add_sort_criteria_to-2485633-29.patch

Test status
StatusResult
Last receivedMon, 09/21/2015 - 13:47:00
Last requestedWed, 09/23/2015 - 15:47:14
Last testedWed, 09/23/2015 - 15:50:34
Test count1
Environment status
PHP 5.5 MySQLfail
File information
Fileadd_sort_criteria_to-2485633-29.patch
BranchTranslation Management Tool - 8.x-1.x
LinkIssue Link
SummaryFAILED: [[SimpleTest]]: [PHP 5.5 MySQL] 2,359 pass(es), 42 fail(s), and 12 exception(s).
Details

PHP 5.5 MySQL

  1. Setup environment
  2. Detect an invalid patch URL
  3. Detect invalid repository information
  4. Detect invalid patch format
  5. Detect a non-applicable patch
  6. Detect invalid PHP syntax
  7. Detect a Drupal installation failure
  8. Detect a test run failure
  9. Detect a failing test
    Review the test failures below then if necessary run them locally until the problem has been fixed.
  10. Complete test suite with all tests passing
2,359 pass(es), 42 fail(s), and 12 exception(s)

Non-pass

Test namePassFailException
ExpandDrupal\tmgmt_content\Tests\ContentEntitySourceListTest6210
MessageGroupFilenameLineFunctionStatus
The test did not complete due to a fatal error.Completion checkContentEntitySourceListTest.php134Drupal\tmgmt_content\Tests\ContentEntitySourceListTest->testTranslationStatuses()
ExpandDrupal\tmgmt_content\Tests\ContentEntitySourceUiTest2134012
MessageGroupFilenameLineFunctionStatus
"One job needs to be checked out." foundOtherContentEntitySourceUiTest.php83Drupal\tmgmt_content\Tests\ContentEntitySourceUiTest->testNodeTranslateTabSingleCheckout()
"pHjUgQqQ" foundOtherContentEntitySourceUiTest.php84Drupal\tmgmt_content\Tests\ContentEntitySourceUiTest->testNodeTranslateTabSingleCheckout()
simplexml_import_dom(): Invalid Nodetype to importsimplexml_import_dom(Object) Drupal\simpletest\WebTestBase->parse() Drupal\simpletest\WebTestBase->drupalPostForm(NULL, Array, Object) Drupal\tmgmt_content\Tests\ContentEntitySourceUiTest->testNodeTranslateTabSingleCheckout() Drupal\simpletest\TestBase->run(Array) simpletest_script_run_one_test('4', 'Drupal\tmgmt_content\Tests\ContentEntitySourceUiTest') WarningAssertContentTrait.php138Drupal\simpletest\WebTestBase->parse()
"Test translation created." foundOtherContentEntitySourceUiTest.php91Drupal\tmgmt_content\Tests\ContentEntitySourceUiTest->testNodeTranslateTabSingleCheckout()
"The translation of pHjUgQqQ to German is finished and can now be reviewed." foundOtherContentEntitySourceUiTest.php95Drupal\tmgmt_content\Tests\ContentEntitySourceUiTest->testNodeTranslateTabSingleCheckout()
simplexml_import_dom(): Invalid Nodetype to importsimplexml_import_dom(Object) Drupal\simpletest\WebTestBase->parse() Drupal\simpletest\WebTestBase->xpath('//a[normalize-space()=:label]', Array) Drupal\simpletest\WebTestBase->clickLinkHelper(Object, 0, '//a[normalize-space()=:label]') Drupal\simpletest\WebTestBase->clickLink(Object) Drupal\tmgmt_content\Tests\ContentEntitySourceUiTest->testNodeTranslateTabSingleCheckout() Drupal\simpletest\TestBase->run(Array) simpletest_script_run_one_test('4', 'Drupal\tmgmt_content\Tests\ContentEntitySourceUiTest') WarningAssertContentTrait.php138Drupal\simpletest\WebTestBase->parse()
Link Needs review does not exist on http://ec2-54-186-69-54.us-west-2.compute.amazonaws.com/checkout/node/1/translationsBrowserContentEntitySourceUiTest.php98Drupal\tmgmt_content\Tests\ContentEntitySourceUiTest->testNodeTranslateTabSingleCheckout()
simplexml_import_dom(): Invalid Nodetype to importsimplexml_import_dom(Object) Drupal\simpletest\WebTestBase->parse() Drupal\simpletest\WebTestBase->drupalPostForm(NULL, Array, Object) Drupal\tmgmt_content\Tests\ContentEntitySourceUiTest->testNodeTranslateTabSingleCheckout() Drupal\simpletest\TestBase->run(Array) simpletest_script_run_one_test('4', 'Drupal\tmgmt_content\Tests\ContentEntitySourceUiTest') WarningAssertContentTrait.php138Drupal\simpletest\WebTestBase->parse()
"The translation for pHjUgQqQ has been accepted." foundOtherContentEntitySourceUiTest.php101Drupal\tmgmt_content\Tests\ContentEntitySourceUiTest->testNodeTranslateTabSingleCheckout()
simplexml_import_dom(): Invalid Nodetype to importsimplexml_import_dom(Object) Drupal\simpletest\WebTestBase->parse() Drupal\simpletest\WebTestBase->xpath('//a[normalize-space()=:label]', Array) Drupal\simpletest\WebTestBase->clickLinkHelper('de_pHjUgQqQ', 0, '//a[normalize-space()=:label]') Drupal\simpletest\WebTestBase->clickLink('de_pHjUgQqQ') Drupal\tmgmt_content\Tests\ContentEntitySourceUiTest->testNodeTranslateTabSingleCheckout() Drupal\simpletest\TestBase->run(Array) simpletest_script_run_one_test('4', 'Drupal\tmgmt_content\Tests\ContentEntitySourceUiTest') WarningAssertContentTrait.php138Drupal\simpletest\WebTestBase->parse()
Link de_pHjUgQqQ does not exist on http://ec2-54-186-69-54.us-west-2.compute.amazonaws.com/checkout/node/1/translationsBrowserContentEntitySourceUiTest.php104Drupal\tmgmt_content\Tests\ContentEntitySourceUiTest->testNodeTranslateTabSingleCheckout()
"de_pHjUgQqQ" foundOtherContentEntitySourceUiTest.php105Drupal\tmgmt_content\Tests\ContentEntitySourceUiTest->testNodeTranslateTabSingleCheckout()
"de_y6i8i7CvLjn3sdL0OIoJ" foundOtherContentEntitySourceUiTest.php106Drupal\tmgmt_content\Tests\ContentEntitySourceUiTest->testNodeTranslateTabSingleCheckout()
Link In progress does not exist on http://ec2-54-186-69-54.us-west-2.compute.amazonaws.com/checkout/node/1/translations?destination=node/1BrowserContentEntitySourceUiTest.php121Drupal\tmgmt_content\Tests\ContentEntitySourceUiTest->testNodeTranslateTabSingleCheckout()
Found the Validate HTML tags buttonOtherContentEntitySourceUiTest.php126Drupal\tmgmt_content\Tests\ContentEntitySourceUiTest->testNodeTranslateTabSingleCheckout()
Found the requested form fields at OtherContentEntitySourceUiTest.php126Drupal\tmgmt_content\Tests\ContentEntitySourceUiTest->testNodeTranslateTabSingleCheckout()
"One job needs to be checked out." foundOtherContentEntitySourceUiTest.php139Drupal\tmgmt_content\Tests\ContentEntitySourceUiTest->testNodeTranslateTabSingleCheckout()
"pHjUgQqQ" foundOtherContentEntitySourceUiTest.php140Drupal\tmgmt_content\Tests\ContentEntitySourceUiTest->testNodeTranslateTabSingleCheckout()
simplexml_import_dom(): Invalid Nodetype to importsimplexml_import_dom(Object) Drupal\simpletest\WebTestBase->parse() Drupal\simpletest\WebTestBase->drupalPostForm(NULL, Array, Object) Drupal\tmgmt_content\Tests\ContentEntitySourceUiTest->testNodeTranslateTabSingleCheckout() Drupal\simpletest\TestBase->run(Array) simpletest_script_run_one_test('4', 'Drupal\tmgmt_content\Tests\ContentEntitySourceUiTest') WarningAssertContentTrait.php138Drupal\simpletest\WebTestBase->parse()
Value 'http://ec2-54-186-69-54.us-west-2.compute.amazonaws.com/checkout/node/1' is equal to value 'http://ec2-54-186-69-54.us-west-2.compute.amazonaws.com/checkout/node/1/translations?destination=node/1'.OtherContentEntitySourceUiTest.php144Drupal\tmgmt_content\Tests\ContentEntitySourceUiTest->testNodeTranslateTabSingleCheckout()
"pHjUgQqQ" not foundOtherContentEntitySourceUiTest.php154Drupal\tmgmt_content\Tests\ContentEntitySourceUiTest->testNodeTranslateTabSingleCheckout()
Drupal\Core\Entity\EntityStorageException: SQLSTATE[23000]: Integrity constraint violation: 1048 Column 'title' cannot be null: INSERT INTO {node_field_data} (nid, vid, type, langcode, title, uid, status, created, changed, promote, sticky, revision_translation_affected, default_langcode, content_translation_source, content_translation_outdated) VALUES (:db_insert_placeholder_0, :db_insert_placeholder_1, :db_insert_placeholder_2, :db_insert_placeholder_3, :db_insert_placeholder_4, :db_insert_placeholder_5, :db_insert_placeholder_6, :db_insert_placeholder_7, :db_insert_placeholder_8, :db_insert_placeholder_9, :db_insert_placeholder_10, :db_insert_placeholder_11, :db_insert_placeholder_12, :db_insert_placeholder_13, :db_insert_placeholder_14), (:db_insert_placeholder_15, :db_insert_placeholder_16, :db_insert_placeholder_17, :db_insert_placeholder_18, :db_insert_placeholder_19, :db_insert_placeholder_20, :db_insert_placeholder_21, :db_insert_placeholder_22, :db_insert_placeholder_23, :db_insert_placeholder_24, :db_insert_placeholder_25, :db_insert_placeholder_26, :db_insert_placeholder_27, :db_insert_placeholder_28, :db_insert_placeholder_29); Array ( [:db_insert_placeholder_0] => 1 [:db_insert_placeholder_1] => 1 [:db_insert_placeholder_2] => page [:db_insert_placeholder_3] => en [:db_insert_placeholder_4] => pHjUgQqQ [:db_insert_placeholder_5] => 3 [:db_insert_placeholder_6] => 1 [:db_insert_placeholder_7] => 1443023253 [:db_insert_placeholder_8] => 1443023253 [:db_insert_placeholder_9] => 1 [:db_insert_placeholder_10] => 0 [:db_insert_placeholder_11] => 1 [:db_insert_placeholder_12] => 1 [:db_insert_placeholder_13] => und [:db_insert_placeholder_14] => 0 [:db_insert_placeholder_15] => 1 [:db_insert_placeholder_16] => 1 [:db_insert_placeholder_17] => page [:db_insert_placeholder_18] => de [:db_insert_placeholder_19] => [:db_insert_placeholder_20] => 3 [:db_insert_placeholder_21] => 1 [:db_insert_placeholder_22] => 1443023253 [:db_insert_placeholder_23] => 1443023253 [:db_insert_placeholder_24] => 1 [:db_insert_placeholder_25] => 0 [:db_insert_placeholder_26] => 1 [:db_insert_placeholder_27] => 0 [:db_insert_placeholder_28] => und [:db_insert_placeholder_29] => 1 ) in Drupal\Core\Entity\Sql\SqlContentEntityStorage->save() (line 757 of /var/lib/drupaltestbot/sites/default/files/checkout/core/lib/Drupal/Core/Entity/Sql/SqlContentEntityStorage.php). Drupal\Core\Entity\Sql\SqlContentEntityStorage->save(Object) Drupal\Core\Entity\Entity->save() Drupal\tmgmt_content\Tests\ContentEntitySourceUiTest->testNodeTranslateTabSingleCheckout() Drupal\simpletest\TestBase->run(Array) simpletest_script_run_one_test('4', 'Drupal\tmgmt_content\Tests\ContentEntitySourceUiTest') Uncaught exceptionSqlContentEntityStorage.php757Drupal\Core\Entity\Sql\SqlContentEntityStorage->save()
Cannot use object of type Drupal\Core\StringTranslation\TranslatableString as arrayPHP Fatal errorContentEntitySource.php135Unknown
Cannot use object of type Drupal\Core\StringTranslation\TranslatableString as arrayPHP Fatal errorContentEntitySource.php135Unknown
Cannot use object of type Drupal\Core\StringTranslation\TranslatableString as arrayPHP Fatal errorContentEntitySource.php135Unknown
"2 jobs need to be checked out." foundOtherContentEntitySourceUiTest.php226Drupal\tmgmt_content\Tests\ContentEntitySourceUiTest->testNodeTranslateTabMultipeCheckout()
"dPaOgiCq" foundOtherContentEntitySourceUiTest.php229Drupal\tmgmt_content\Tests\ContentEntitySourceUiTest->testNodeTranslateTabMultipeCheckout()
simplexml_import_dom(): Invalid Nodetype to importsimplexml_import_dom(Object) Drupal\simpletest\WebTestBase->parse() Drupal\simpletest\WebTestBase->drupalPostForm(NULL, Array, Object) Drupal\tmgmt_content\Tests\ContentEntitySourceUiTest->testNodeTranslateTabMultipeCheckout() Drupal\simpletest\TestBase->run(Array) simpletest_script_run_one_test('4', 'Drupal\tmgmt_content\Tests\ContentEntitySourceUiTest') WarningAssertContentTrait.php138Drupal\simpletest\WebTestBase->parse()
"dPaOgiCq" foundOtherContentEntitySourceUiTest.php231Drupal\tmgmt_content\Tests\ContentEntitySourceUiTest->testNodeTranslateTabMultipeCheckout()
simplexml_import_dom(): Invalid Nodetype to importsimplexml_import_dom(Object) Drupal\simpletest\WebTestBase->parse() Drupal\simpletest\WebTestBase->drupalPostForm(NULL, Array, Object) Drupal\tmgmt_content\Tests\ContentEntitySourceUiTest->testNodeTranslateTabMultipeCheckout() Drupal\simpletest\TestBase->run(Array) simpletest_script_run_one_test('4', 'Drupal\tmgmt_content\Tests\ContentEntitySourceUiTest') WarningAssertContentTrait.php138Drupal\simpletest\WebTestBase->parse()
"Test translation created." foundOtherContentEntitySourceUiTest.php236Drupal\tmgmt_content\Tests\ContentEntitySourceUiTest->testNodeTranslateTabMultipeCheckout()
"The translation for dPaOgiCq has been accepted." foundOtherContentEntitySourceUiTest.php241Drupal\tmgmt_content\Tests\ContentEntitySourceUiTest->testNodeTranslateTabMultipeCheckout()
simplexml_import_dom(): Invalid Nodetype to importsimplexml_import_dom(Object) Drupal\simpletest\WebTestBase->parse() Drupal\simpletest\WebTestBase->xpath('//a[normalize-space()=:label]', Array) Drupal\simpletest\WebTestBase->clickLinkHelper('dPaOgiCq', 0, '//a[normalize-space()=:label]') Drupal\simpletest\WebTestBase->clickLink('dPaOgiCq') Drupal\tmgmt_content\Tests\ContentEntitySourceUiTest->testNodeTranslateTabMultipeCheckout() Drupal\simpletest\TestBase->run(Array) simpletest_script_run_one_test('4', 'Drupal\tmgmt_content\Tests\ContentEntitySourceUiTest') WarningAssertContentTrait.php138Drupal\simpletest\WebTestBase->parse()
Link dPaOgiCq does not exist on http://ec2-54-186-69-54.us-west-2.compute.amazonaws.com/checkout/node/1/translationsBrowserContentEntitySourceUiTest.php244Drupal\tmgmt_content\Tests\ContentEntitySourceUiTest->testNodeTranslateTabMultipeCheckout()
"de_dPaOgiCq" foundOtherContentEntitySourceUiTest.php249Drupal\tmgmt_content\Tests\ContentEntitySourceUiTest->testNodeTranslateTabMultipeCheckout()
"de_scAeWfdtUztbqNpYEIOf" foundOtherContentEntitySourceUiTest.php250Drupal\tmgmt_content\Tests\ContentEntitySourceUiTest->testNodeTranslateTabMultipeCheckout()
"es_dPaOgiCq" foundOtherContentEntitySourceUiTest.php253Drupal\tmgmt_content\Tests\ContentEntitySourceUiTest->testNodeTranslateTabMultipeCheckout()
"es_scAeWfdtUztbqNpYEIOf" foundOtherContentEntitySourceUiTest.php254Drupal\tmgmt_content\Tests\ContentEntitySourceUiTest->testNodeTranslateTabMultipeCheckout()
Cannot use object of type Drupal\Core\StringTranslation\TranslatableString as arrayPHP Fatal errorContentEntitySource.php135Unknown
"2 jobs need to be checked out." foundOtherContentEntitySourceUiTest.php324Drupal\tmgmt_content\Tests\ContentEntitySourceUiTest->testCommentTranslateTab()
"nW4xX8Wp" foundOtherContentEntitySourceUiTest.php327Drupal\tmgmt_content\Tests\ContentEntitySourceUiTest->testCommentTranslateTab()
simplexml_import_dom(): Invalid Nodetype to importsimplexml_import_dom(Object) Drupal\simpletest\WebTestBase->parse() Drupal\simpletest\WebTestBase->drupalPostForm(NULL, Array, Object) Drupal\tmgmt_content\Tests\ContentEntitySourceUiTest->testCommentTranslateTab() Drupal\simpletest\TestBase->run(Array) simpletest_script_run_one_test('4', 'Drupal\tmgmt_content\Tests\ContentEntitySourceUiTest') WarningAssertContentTrait.php138Drupal\simpletest\WebTestBase->parse()
"nW4xX8Wp" foundOtherContentEntitySourceUiTest.php329Drupal\tmgmt_content\Tests\ContentEntitySourceUiTest->testCommentTranslateTab()
simplexml_import_dom(): Invalid Nodetype to importsimplexml_import_dom(Object) Drupal\simpletest\WebTestBase->parse() Drupal\simpletest\WebTestBase->drupalPostForm(NULL, Array, Object) Drupal\tmgmt_content\Tests\ContentEntitySourceUiTest->testCommentTranslateTab() Drupal\simpletest\TestBase->run(Array) simpletest_script_run_one_test('4', 'Drupal\tmgmt_content\Tests\ContentEntitySourceUiTest') WarningAssertContentTrait.php138Drupal\simpletest\WebTestBase->parse()
"Test translation created." foundOtherContentEntitySourceUiTest.php334Drupal\tmgmt_content\Tests\ContentEntitySourceUiTest->testCommentTranslateTab()
"The translation for nW4xX8Wp has been accepted." foundOtherContentEntitySourceUiTest.php339Drupal\tmgmt_content\Tests\ContentEntitySourceUiTest->testCommentTranslateTab()
simplexml_import_dom(): Invalid Nodetype to importsimplexml_import_dom(Object) Drupal\simpletest\WebTestBase->parse() Drupal\simpletest\WebTestBase->xpath('//a[normalize-space()=:label]', Array) Drupal\simpletest\WebTestBase->clickLinkHelper('de_nW4xX8Wp', 0, '//a[normalize-space()=:label]') Drupal\simpletest\WebTestBase->clickLink('de_nW4xX8Wp') Drupal\tmgmt_content\Tests\ContentEntitySourceUiTest->testCommentTranslateTab() Drupal\simpletest\TestBase->run(Array) simpletest_script_run_one_test('4', 'Drupal\tmgmt_content\Tests\ContentEntitySourceUiTest') WarningAssertContentTrait.php138Drupal\simpletest\WebTestBase->parse()
Link de_nW4xX8Wp does not exist on http://ec2-54-186-69-54.us-west-2.compute.amazonaws.com/checkout/comment/1/translationsBrowserContentEntitySourceUiTest.php342Drupal\tmgmt_content\Tests\ContentEntitySourceUiTest->testCommentTranslateTab()
"de_qSsDL0tz" foundOtherContentEntitySourceUiTest.php343Drupal\tmgmt_content\Tests\ContentEntitySourceUiTest->testCommentTranslateTab()
Link es_nW4xX8Wp does not exist on http://ec2-54-186-69-54.us-west-2.compute.amazonaws.com/checkout/comment/1/translationsBrowserContentEntitySourceUiTest.php347Drupal\tmgmt_content\Tests\ContentEntitySourceUiTest->testCommentTranslateTab()
"es_qSsDL0tz" foundOtherContentEntitySourceUiTest.php349Drupal\tmgmt_content\Tests\ContentEntitySourceUiTest->testCommentTranslateTab()
Cannot use object of type Drupal\Core\StringTranslation\TranslatableString as arrayPHP Fatal errorContentEntitySource.php135Unknown
ExpandDrupal\tmgmt_content\Tests\ContentEntitySourceUnitTest1710
MessageGroupFilenameLineFunctionStatus
The test did not complete due to a fatal error.Completion checkContentEntitySourceUnitTest.php97Drupal\tmgmt_content\Tests\ContentEntitySourceUnitTest->testEntityTest()

All

Test namePassFailException
LeafDrupal\tmgmt\Tests\CrudTest19900
LeafDrupal\tmgmt\Tests\HelperTest4300
LeafDrupal\tmgmt\Tests\LocalTasksTests3100
LeafDrupal\tmgmt\Tests\PluginsTest5000
LeafDrupal\tmgmt\Tests\TMGMTCartTest5200
LeafDrupal\tmgmt\Tests\TMGMTUiTest67000
LeafDrupal\tmgmt\Tests\TranslatorTest8500
LeafDrupal\tmgmt\Tests\TranslatorUITest3000
LeafDrupal\tmgmt_config\Tests\ConfigSourceListTest24400
LeafDrupal\tmgmt_config\Tests\ConfigSourceUiTest24100
LeafDrupal\tmgmt_config\Tests\ConfigSourceUnitTest7100
ExpandDrupal\tmgmt_content\Tests\ContentEntitySourceListTest6210
MessageGroupFilenameLineFunctionStatus
The test did not complete due to a fatal error.Completion checkContentEntitySourceListTest.php134Drupal\tmgmt_content\Tests\ContentEntitySourceListTest->testTranslationStatuses()
ExpandDrupal\tmgmt_content\Tests\ContentEntitySourceUiTest2134012
MessageGroupFilenameLineFunctionStatus
"One job needs to be checked out." foundOtherContentEntitySourceUiTest.php83Drupal\tmgmt_content\Tests\ContentEntitySourceUiTest->testNodeTranslateTabSingleCheckout()
"pHjUgQqQ" foundOtherContentEntitySourceUiTest.php84Drupal\tmgmt_content\Tests\ContentEntitySourceUiTest->testNodeTranslateTabSingleCheckout()
simplexml_import_dom(): Invalid Nodetype to importsimplexml_import_dom(Object) Drupal\simpletest\WebTestBase->parse() Drupal\simpletest\WebTestBase->drupalPostForm(NULL, Array, Object) Drupal\tmgmt_content\Tests\ContentEntitySourceUiTest->testNodeTranslateTabSingleCheckout() Drupal\simpletest\TestBase->run(Array) simpletest_script_run_one_test('4', 'Drupal\tmgmt_content\Tests\ContentEntitySourceUiTest') WarningAssertContentTrait.php138Drupal\simpletest\WebTestBase->parse()
"Test translation created." foundOtherContentEntitySourceUiTest.php91Drupal\tmgmt_content\Tests\ContentEntitySourceUiTest->testNodeTranslateTabSingleCheckout()
"The translation of pHjUgQqQ to German is finished and can now be reviewed." foundOtherContentEntitySourceUiTest.php95Drupal\tmgmt_content\Tests\ContentEntitySourceUiTest->testNodeTranslateTabSingleCheckout()
simplexml_import_dom(): Invalid Nodetype to importsimplexml_import_dom(Object) Drupal\simpletest\WebTestBase->parse() Drupal\simpletest\WebTestBase->xpath('//a[normalize-space()=:label]', Array) Drupal\simpletest\WebTestBase->clickLinkHelper(Object, 0, '//a[normalize-space()=:label]') Drupal\simpletest\WebTestBase->clickLink(Object) Drupal\tmgmt_content\Tests\ContentEntitySourceUiTest->testNodeTranslateTabSingleCheckout() Drupal\simpletest\TestBase->run(Array) simpletest_script_run_one_test('4', 'Drupal\tmgmt_content\Tests\ContentEntitySourceUiTest') WarningAssertContentTrait.php138Drupal\simpletest\WebTestBase->parse()
Link Needs review does not exist on http://ec2-54-186-69-54.us-west-2.compute.amazonaws.com/checkout/node/1/translationsBrowserContentEntitySourceUiTest.php98Drupal\tmgmt_content\Tests\ContentEntitySourceUiTest->testNodeTranslateTabSingleCheckout()
simplexml_import_dom(): Invalid Nodetype to importsimplexml_import_dom(Object) Drupal\simpletest\WebTestBase->parse() Drupal\simpletest\WebTestBase->drupalPostForm(NULL, Array, Object) Drupal\tmgmt_content\Tests\ContentEntitySourceUiTest->testNodeTranslateTabSingleCheckout() Drupal\simpletest\TestBase->run(Array) simpletest_script_run_one_test('4', 'Drupal\tmgmt_content\Tests\ContentEntitySourceUiTest') WarningAssertContentTrait.php138Drupal\simpletest\WebTestBase->parse()
"The translation for pHjUgQqQ has been accepted." foundOtherContentEntitySourceUiTest.php101Drupal\tmgmt_content\Tests\ContentEntitySourceUiTest->testNodeTranslateTabSingleCheckout()
simplexml_import_dom(): Invalid Nodetype to importsimplexml_import_dom(Object) Drupal\simpletest\WebTestBase->parse() Drupal\simpletest\WebTestBase->xpath('//a[normalize-space()=:label]', Array) Drupal\simpletest\WebTestBase->clickLinkHelper('de_pHjUgQqQ', 0, '//a[normalize-space()=:label]') Drupal\simpletest\WebTestBase->clickLink('de_pHjUgQqQ') Drupal\tmgmt_content\Tests\ContentEntitySourceUiTest->testNodeTranslateTabSingleCheckout() Drupal\simpletest\TestBase->run(Array) simpletest_script_run_one_test('4', 'Drupal\tmgmt_content\Tests\ContentEntitySourceUiTest') WarningAssertContentTrait.php138Drupal\simpletest\WebTestBase->parse()
Link de_pHjUgQqQ does not exist on http://ec2-54-186-69-54.us-west-2.compute.amazonaws.com/checkout/node/1/translationsBrowserContentEntitySourceUiTest.php104Drupal\tmgmt_content\Tests\ContentEntitySourceUiTest->testNodeTranslateTabSingleCheckout()
"de_pHjUgQqQ" foundOtherContentEntitySourceUiTest.php105Drupal\tmgmt_content\Tests\ContentEntitySourceUiTest->testNodeTranslateTabSingleCheckout()
"de_y6i8i7CvLjn3sdL0OIoJ" foundOtherContentEntitySourceUiTest.php106Drupal\tmgmt_content\Tests\ContentEntitySourceUiTest->testNodeTranslateTabSingleCheckout()
Link In progress does not exist on http://ec2-54-186-69-54.us-west-2.compute.amazonaws.com/checkout/node/1/translations?destination=node/1BrowserContentEntitySourceUiTest.php121Drupal\tmgmt_content\Tests\ContentEntitySourceUiTest->testNodeTranslateTabSingleCheckout()
Found the Validate HTML tags buttonOtherContentEntitySourceUiTest.php126Drupal\tmgmt_content\Tests\ContentEntitySourceUiTest->testNodeTranslateTabSingleCheckout()
Found the requested form fields at OtherContentEntitySourceUiTest.php126Drupal\tmgmt_content\Tests\ContentEntitySourceUiTest->testNodeTranslateTabSingleCheckout()
"One job needs to be checked out." foundOtherContentEntitySourceUiTest.php139Drupal\tmgmt_content\Tests\ContentEntitySourceUiTest->testNodeTranslateTabSingleCheckout()
"pHjUgQqQ" foundOtherContentEntitySourceUiTest.php140Drupal\tmgmt_content\Tests\ContentEntitySourceUiTest->testNodeTranslateTabSingleCheckout()
simplexml_import_dom(): Invalid Nodetype to importsimplexml_import_dom(Object) Drupal\simpletest\WebTestBase->parse() Drupal\simpletest\WebTestBase->drupalPostForm(NULL, Array, Object) Drupal\tmgmt_content\Tests\ContentEntitySourceUiTest->testNodeTranslateTabSingleCheckout() Drupal\simpletest\TestBase->run(Array) simpletest_script_run_one_test('4', 'Drupal\tmgmt_content\Tests\ContentEntitySourceUiTest') WarningAssertContentTrait.php138Drupal\simpletest\WebTestBase->parse()
Value 'http://ec2-54-186-69-54.us-west-2.compute.amazonaws.com/checkout/node/1' is equal to value 'http://ec2-54-186-69-54.us-west-2.compute.amazonaws.com/checkout/node/1/translations?destination=node/1'.OtherContentEntitySourceUiTest.php144Drupal\tmgmt_content\Tests\ContentEntitySourceUiTest->testNodeTranslateTabSingleCheckout()
"pHjUgQqQ" not foundOtherContentEntitySourceUiTest.php154Drupal\tmgmt_content\Tests\ContentEntitySourceUiTest->testNodeTranslateTabSingleCheckout()
Drupal\Core\Entity\EntityStorageException: SQLSTATE[23000]: Integrity constraint violation: 1048 Column 'title' cannot be null: INSERT INTO {node_field_data} (nid, vid, type, langcode, title, uid, status, created, changed, promote, sticky, revision_translation_affected, default_langcode, content_translation_source, content_translation_outdated) VALUES (:db_insert_placeholder_0, :db_insert_placeholder_1, :db_insert_placeholder_2, :db_insert_placeholder_3, :db_insert_placeholder_4, :db_insert_placeholder_5, :db_insert_placeholder_6, :db_insert_placeholder_7, :db_insert_placeholder_8, :db_insert_placeholder_9, :db_insert_placeholder_10, :db_insert_placeholder_11, :db_insert_placeholder_12, :db_insert_placeholder_13, :db_insert_placeholder_14), (:db_insert_placeholder_15, :db_insert_placeholder_16, :db_insert_placeholder_17, :db_insert_placeholder_18, :db_insert_placeholder_19, :db_insert_placeholder_20, :db_insert_placeholder_21, :db_insert_placeholder_22, :db_insert_placeholder_23, :db_insert_placeholder_24, :db_insert_placeholder_25, :db_insert_placeholder_26, :db_insert_placeholder_27, :db_insert_placeholder_28, :db_insert_placeholder_29); Array ( [:db_insert_placeholder_0] => 1 [:db_insert_placeholder_1] => 1 [:db_insert_placeholder_2] => page [:db_insert_placeholder_3] => en [:db_insert_placeholder_4] => pHjUgQqQ [:db_insert_placeholder_5] => 3 [:db_insert_placeholder_6] => 1 [:db_insert_placeholder_7] => 1443023253 [:db_insert_placeholder_8] => 1443023253 [:db_insert_placeholder_9] => 1 [:db_insert_placeholder_10] => 0 [:db_insert_placeholder_11] => 1 [:db_insert_placeholder_12] => 1 [:db_insert_placeholder_13] => und [:db_insert_placeholder_14] => 0 [:db_insert_placeholder_15] => 1 [:db_insert_placeholder_16] => 1 [:db_insert_placeholder_17] => page [:db_insert_placeholder_18] => de [:db_insert_placeholder_19] => [:db_insert_placeholder_20] => 3 [:db_insert_placeholder_21] => 1 [:db_insert_placeholder_22] => 1443023253 [:db_insert_placeholder_23] => 1443023253 [:db_insert_placeholder_24] => 1 [:db_insert_placeholder_25] => 0 [:db_insert_placeholder_26] => 1 [:db_insert_placeholder_27] => 0 [:db_insert_placeholder_28] => und [:db_insert_placeholder_29] => 1 ) in Drupal\Core\Entity\Sql\SqlContentEntityStorage->save() (line 757 of /var/lib/drupaltestbot/sites/default/files/checkout/core/lib/Drupal/Core/Entity/Sql/SqlContentEntityStorage.php). Drupal\Core\Entity\Sql\SqlContentEntityStorage->save(Object) Drupal\Core\Entity\Entity->save() Drupal\tmgmt_content\Tests\ContentEntitySourceUiTest->testNodeTranslateTabSingleCheckout() Drupal\simpletest\TestBase->run(Array) simpletest_script_run_one_test('4', 'Drupal\tmgmt_content\Tests\ContentEntitySourceUiTest') Uncaught exceptionSqlContentEntityStorage.php757Drupal\Core\Entity\Sql\SqlContentEntityStorage->save()
Cannot use object of type Drupal\Core\StringTranslation\TranslatableString as arrayPHP Fatal errorContentEntitySource.php135Unknown
Cannot use object of type Drupal\Core\StringTranslation\TranslatableString as arrayPHP Fatal errorContentEntitySource.php135Unknown
Cannot use object of type Drupal\Core\StringTranslation\TranslatableString as arrayPHP Fatal errorContentEntitySource.php135Unknown
"2 jobs need to be checked out." foundOtherContentEntitySourceUiTest.php226Drupal\tmgmt_content\Tests\ContentEntitySourceUiTest->testNodeTranslateTabMultipeCheckout()
"dPaOgiCq" foundOtherContentEntitySourceUiTest.php229Drupal\tmgmt_content\Tests\ContentEntitySourceUiTest->testNodeTranslateTabMultipeCheckout()
simplexml_import_dom(): Invalid Nodetype to importsimplexml_import_dom(Object) Drupal\simpletest\WebTestBase->parse() Drupal\simpletest\WebTestBase->drupalPostForm(NULL, Array, Object) Drupal\tmgmt_content\Tests\ContentEntitySourceUiTest->testNodeTranslateTabMultipeCheckout() Drupal\simpletest\TestBase->run(Array) simpletest_script_run_one_test('4', 'Drupal\tmgmt_content\Tests\ContentEntitySourceUiTest') WarningAssertContentTrait.php138Drupal\simpletest\WebTestBase->parse()
"dPaOgiCq" foundOtherContentEntitySourceUiTest.php231Drupal\tmgmt_content\Tests\ContentEntitySourceUiTest->testNodeTranslateTabMultipeCheckout()
simplexml_import_dom(): Invalid Nodetype to importsimplexml_import_dom(Object) Drupal\simpletest\WebTestBase->parse() Drupal\simpletest\WebTestBase->drupalPostForm(NULL, Array, Object) Drupal\tmgmt_content\Tests\ContentEntitySourceUiTest->testNodeTranslateTabMultipeCheckout() Drupal\simpletest\TestBase->run(Array) simpletest_script_run_one_test('4', 'Drupal\tmgmt_content\Tests\ContentEntitySourceUiTest') WarningAssertContentTrait.php138Drupal\simpletest\WebTestBase->parse()
"Test translation created." foundOtherContentEntitySourceUiTest.php236Drupal\tmgmt_content\Tests\ContentEntitySourceUiTest->testNodeTranslateTabMultipeCheckout()
"The translation for dPaOgiCq has been accepted." foundOtherContentEntitySourceUiTest.php241Drupal\tmgmt_content\Tests\ContentEntitySourceUiTest->testNodeTranslateTabMultipeCheckout()
simplexml_import_dom(): Invalid Nodetype to importsimplexml_import_dom(Object) Drupal\simpletest\WebTestBase->parse() Drupal\simpletest\WebTestBase->xpath('//a[normalize-space()=:label]', Array) Drupal\simpletest\WebTestBase->clickLinkHelper('dPaOgiCq', 0, '//a[normalize-space()=:label]') Drupal\simpletest\WebTestBase->clickLink('dPaOgiCq') Drupal\tmgmt_content\Tests\ContentEntitySourceUiTest->testNodeTranslateTabMultipeCheckout() Drupal\simpletest\TestBase->run(Array) simpletest_script_run_one_test('4', 'Drupal\tmgmt_content\Tests\ContentEntitySourceUiTest') WarningAssertContentTrait.php138Drupal\simpletest\WebTestBase->parse()
Link dPaOgiCq does not exist on http://ec2-54-186-69-54.us-west-2.compute.amazonaws.com/checkout/node/1/translationsBrowserContentEntitySourceUiTest.php244Drupal\tmgmt_content\Tests\ContentEntitySourceUiTest->testNodeTranslateTabMultipeCheckout()
"de_dPaOgiCq" foundOtherContentEntitySourceUiTest.php249Drupal\tmgmt_content\Tests\ContentEntitySourceUiTest->testNodeTranslateTabMultipeCheckout()
"de_scAeWfdtUztbqNpYEIOf" foundOtherContentEntitySourceUiTest.php250Drupal\tmgmt_content\Tests\ContentEntitySourceUiTest->testNodeTranslateTabMultipeCheckout()
"es_dPaOgiCq" foundOtherContentEntitySourceUiTest.php253Drupal\tmgmt_content\Tests\ContentEntitySourceUiTest->testNodeTranslateTabMultipeCheckout()
"es_scAeWfdtUztbqNpYEIOf" foundOtherContentEntitySourceUiTest.php254Drupal\tmgmt_content\Tests\ContentEntitySourceUiTest->testNodeTranslateTabMultipeCheckout()
Cannot use object of type Drupal\Core\StringTranslation\TranslatableString as arrayPHP Fatal errorContentEntitySource.php135Unknown
"2 jobs need to be checked out." foundOtherContentEntitySourceUiTest.php324Drupal\tmgmt_content\Tests\ContentEntitySourceUiTest->testCommentTranslateTab()
"nW4xX8Wp" foundOtherContentEntitySourceUiTest.php327Drupal\tmgmt_content\Tests\ContentEntitySourceUiTest->testCommentTranslateTab()
simplexml_import_dom(): Invalid Nodetype to importsimplexml_import_dom(Object) Drupal\simpletest\WebTestBase->parse() Drupal\simpletest\WebTestBase->drupalPostForm(NULL, Array, Object) Drupal\tmgmt_content\Tests\ContentEntitySourceUiTest->testCommentTranslateTab() Drupal\simpletest\TestBase->run(Array) simpletest_script_run_one_test('4', 'Drupal\tmgmt_content\Tests\ContentEntitySourceUiTest') WarningAssertContentTrait.php138Drupal\simpletest\WebTestBase->parse()
"nW4xX8Wp" foundOtherContentEntitySourceUiTest.php329Drupal\tmgmt_content\Tests\ContentEntitySourceUiTest->testCommentTranslateTab()
simplexml_import_dom(): Invalid Nodetype to importsimplexml_import_dom(Object) Drupal\simpletest\WebTestBase->parse() Drupal\simpletest\WebTestBase->drupalPostForm(NULL, Array, Object) Drupal\tmgmt_content\Tests\ContentEntitySourceUiTest->testCommentTranslateTab() Drupal\simpletest\TestBase->run(Array) simpletest_script_run_one_test('4', 'Drupal\tmgmt_content\Tests\ContentEntitySourceUiTest') WarningAssertContentTrait.php138Drupal\simpletest\WebTestBase->parse()
"Test translation created." foundOtherContentEntitySourceUiTest.php334Drupal\tmgmt_content\Tests\ContentEntitySourceUiTest->testCommentTranslateTab()
"The translation for nW4xX8Wp has been accepted." foundOtherContentEntitySourceUiTest.php339Drupal\tmgmt_content\Tests\ContentEntitySourceUiTest->testCommentTranslateTab()
simplexml_import_dom(): Invalid Nodetype to importsimplexml_import_dom(Object) Drupal\simpletest\WebTestBase->parse() Drupal\simpletest\WebTestBase->xpath('//a[normalize-space()=:label]', Array) Drupal\simpletest\WebTestBase->clickLinkHelper('de_nW4xX8Wp', 0, '//a[normalize-space()=:label]') Drupal\simpletest\WebTestBase->clickLink('de_nW4xX8Wp') Drupal\tmgmt_content\Tests\ContentEntitySourceUiTest->testCommentTranslateTab() Drupal\simpletest\TestBase->run(Array) simpletest_script_run_one_test('4', 'Drupal\tmgmt_content\Tests\ContentEntitySourceUiTest') WarningAssertContentTrait.php138Drupal\simpletest\WebTestBase->parse()
Link de_nW4xX8Wp does not exist on http://ec2-54-186-69-54.us-west-2.compute.amazonaws.com/checkout/comment/1/translationsBrowserContentEntitySourceUiTest.php342Drupal\tmgmt_content\Tests\ContentEntitySourceUiTest->testCommentTranslateTab()
"de_qSsDL0tz" foundOtherContentEntitySourceUiTest.php343Drupal\tmgmt_content\Tests\ContentEntitySourceUiTest->testCommentTranslateTab()
Link es_nW4xX8Wp does not exist on http://ec2-54-186-69-54.us-west-2.compute.amazonaws.com/checkout/comment/1/translationsBrowserContentEntitySourceUiTest.php347Drupal\tmgmt_content\Tests\ContentEntitySourceUiTest->testCommentTranslateTab()
"es_qSsDL0tz" foundOtherContentEntitySourceUiTest.php349Drupal\tmgmt_content\Tests\ContentEntitySourceUiTest->testCommentTranslateTab()
Cannot use object of type Drupal\Core\StringTranslation\TranslatableString as arrayPHP Fatal errorContentEntitySource.php135Unknown
ExpandDrupal\tmgmt_content\Tests\ContentEntitySourceUnitTest1710
MessageGroupFilenameLineFunctionStatus
The test did not complete due to a fatal error.Completion checkContentEntitySourceUnitTest.php97Drupal\tmgmt_content\Tests\ContentEntitySourceUnitTest->testEntityTest()
LeafDrupal\tmgmt_content\Tests\ContentEntitySuggestionsTest2400
LeafDrupal\tmgmt_demo\Tests\TMGMTDemoTest4800
LeafDrupal\tmgmt_file\Tests\FileTranslatorTest16600
LeafDrupal\tmgmt_locale\Tests\LocaleSourceTest6300
LeafDrupal\tmgmt_locale\Tests\LocaleSourceUiTest5000