remove_query_logger_and-2572009-2.patch

Test status
StatusResult
Last receivedMon, 09/21/2015 - 12:44:17
Last requestedMon, 09/21/2015 - 16:25:41
Last testedMon, 09/21/2015 - 16:26:23
Test count1
Environment status
PHP 5.5 MySQLfail
File information
Fileremove_query_logger_and-2572009-2.patch
BranchDevel - 8.x-1.x
LinkIssue Link
SummaryFAILED: [[SimpleTest]]: [PHP 5.5 MySQL] 259 pass(es), 2 fail(s), and 2 exception(s).
Details

PHP 5.5 MySQL

  1. Setup environment
  2. Detect an invalid patch URL
  3. Detect invalid repository information
  4. Detect invalid patch format
  5. Detect a non-applicable patch
  6. Detect invalid PHP syntax
  7. Detect a Drupal installation failure
  8. Detect a test run failure
  9. Detect a failing test
    Review the test failures below then if necessary run them locally until the problem has been fixed.
  10. Complete test suite with all tests passing
259 pass(es), 2 fail(s), and 2 exception(s)

Non-pass

Test namePassFailException
ExpandDrupal\devel\Tests\DevelControllerTest111
MessageGroupFilenameLineFunctionStatus
The test did not complete due to a fatal error.Completion checkDevelControllerTest.php66Drupal\devel\Tests\DevelControllerTest->testRouteGeneration()
ReflectionException: Method Drupal\devel_test\Controller\DevelSilentTestContoller::globalShoutdown() does not exist in ReflectionMethod->__construct() (line 128 of /var/lib/drupaltestbot/sites/default/files/checkout/core/lib/Drupal/Core/Entity/EntityResolverManager.php). ReflectionMethod->__construct('\Drupal\devel_test\Controller\DevelSilentTestContoller', 'globalShoutdown') Drupal\Core\Entity\EntityResolverManager->setParametersFromReflection(Array, Object) Drupal\Core\Entity\EntityResolverManager->setRouteOptions(Object) Drupal\Core\EventSubscriber\EntityRouteAlterSubscriber->onRoutingRouteAlterSetType(Object, 'routing.route_alter', Object) Drupal\Component\EventDispatcher\ContainerAwareEventDispatcher->dispatch('routing.route_alter', Object) Drupal\Core\Routing\RouteBuilder->rebuild() Drupal\Core\ProxyClass\Routing\RouteBuilder->rebuild() drupal_flush_all_caches() Drupal\simpletest\WebTestBase->resetAll() Drupal\simpletest\WebTestBase->rebuildAll() Drupal\simpletest\WebTestBase->setUp() Drupal\devel\Tests\DevelControllerTest->setUp() Drupal\simpletest\TestBase->run(Array) simpletest_script_run_one_test('8', 'Drupal\devel\Tests\DevelControllerTest') Uncaught exceptionEntityResolverManager.php128ReflectionMethod->__construct()
ExpandDrupal\devel\Tests\DevelSilentTest111
MessageGroupFilenameLineFunctionStatus
The test did not complete due to a fatal error.Completion checkDevelSilentTest.php33Drupal\devel\Tests\DevelSilentTest->testDevelSilent()
ReflectionException: Method Drupal\devel_test\Controller\DevelSilentTestContoller::globalShoutdown() does not exist in ReflectionMethod->__construct() (line 128 of /var/lib/drupaltestbot/sites/default/files/checkout/core/lib/Drupal/Core/Entity/EntityResolverManager.php). ReflectionMethod->__construct('\Drupal\devel_test\Controller\DevelSilentTestContoller', 'globalShoutdown') Drupal\Core\Entity\EntityResolverManager->setParametersFromReflection(Array, Object) Drupal\Core\Entity\EntityResolverManager->setRouteOptions(Object) Drupal\Core\EventSubscriber\EntityRouteAlterSubscriber->onRoutingRouteAlterSetType(Object, 'routing.route_alter', Object) Drupal\Component\EventDispatcher\ContainerAwareEventDispatcher->dispatch('routing.route_alter', Object) Drupal\Core\Routing\RouteBuilder->rebuild() Drupal\Core\ProxyClass\Routing\RouteBuilder->rebuild() drupal_flush_all_caches() Drupal\simpletest\WebTestBase->resetAll() Drupal\simpletest\WebTestBase->rebuildAll() Drupal\simpletest\WebTestBase->setUp() Drupal\simpletest\TestBase->run(Array) simpletest_script_run_one_test('2', 'Drupal\devel\Tests\DevelSilentTest') Uncaught exceptionEntityResolverManager.php128ReflectionMethod->__construct()

All

Test namePassFailException
ExpandDrupal\devel\Tests\DevelControllerTest111
MessageGroupFilenameLineFunctionStatus
The test did not complete due to a fatal error.Completion checkDevelControllerTest.php66Drupal\devel\Tests\DevelControllerTest->testRouteGeneration()
ReflectionException: Method Drupal\devel_test\Controller\DevelSilentTestContoller::globalShoutdown() does not exist in ReflectionMethod->__construct() (line 128 of /var/lib/drupaltestbot/sites/default/files/checkout/core/lib/Drupal/Core/Entity/EntityResolverManager.php). ReflectionMethod->__construct('\Drupal\devel_test\Controller\DevelSilentTestContoller', 'globalShoutdown') Drupal\Core\Entity\EntityResolverManager->setParametersFromReflection(Array, Object) Drupal\Core\Entity\EntityResolverManager->setRouteOptions(Object) Drupal\Core\EventSubscriber\EntityRouteAlterSubscriber->onRoutingRouteAlterSetType(Object, 'routing.route_alter', Object) Drupal\Component\EventDispatcher\ContainerAwareEventDispatcher->dispatch('routing.route_alter', Object) Drupal\Core\Routing\RouteBuilder->rebuild() Drupal\Core\ProxyClass\Routing\RouteBuilder->rebuild() drupal_flush_all_caches() Drupal\simpletest\WebTestBase->resetAll() Drupal\simpletest\WebTestBase->rebuildAll() Drupal\simpletest\WebTestBase->setUp() Drupal\devel\Tests\DevelControllerTest->setUp() Drupal\simpletest\TestBase->run(Array) simpletest_script_run_one_test('8', 'Drupal\devel\Tests\DevelControllerTest') Uncaught exceptionEntityResolverManager.php128ReflectionMethod->__construct()
LeafDrupal\devel\Tests\DevelCsrfLinksTest4500
LeafDrupal\devel\Tests\DevelMailTest300
LeafDrupal\devel\Tests\DevelRebuildMenusTest1700
LeafDrupal\devel\Tests\DevelReinstallTest1600
ExpandDrupal\devel\Tests\DevelSilentTest111
MessageGroupFilenameLineFunctionStatus
The test did not complete due to a fatal error.Completion checkDevelSilentTest.php33Drupal\devel\Tests\DevelSilentTest->testDevelSilent()
ReflectionException: Method Drupal\devel_test\Controller\DevelSilentTestContoller::globalShoutdown() does not exist in ReflectionMethod->__construct() (line 128 of /var/lib/drupaltestbot/sites/default/files/checkout/core/lib/Drupal/Core/Entity/EntityResolverManager.php). ReflectionMethod->__construct('\Drupal\devel_test\Controller\DevelSilentTestContoller', 'globalShoutdown') Drupal\Core\Entity\EntityResolverManager->setParametersFromReflection(Array, Object) Drupal\Core\Entity\EntityResolverManager->setRouteOptions(Object) Drupal\Core\EventSubscriber\EntityRouteAlterSubscriber->onRoutingRouteAlterSetType(Object, 'routing.route_alter', Object) Drupal\Component\EventDispatcher\ContainerAwareEventDispatcher->dispatch('routing.route_alter', Object) Drupal\Core\Routing\RouteBuilder->rebuild() Drupal\Core\ProxyClass\Routing\RouteBuilder->rebuild() drupal_flush_all_caches() Drupal\simpletest\WebTestBase->resetAll() Drupal\simpletest\WebTestBase->rebuildAll() Drupal\simpletest\WebTestBase->setUp() Drupal\simpletest\TestBase->run(Array) simpletest_script_run_one_test('2', 'Drupal\devel\Tests\DevelSilentTest') Uncaught exceptionEntityResolverManager.php128ReflectionMethod->__construct()
LeafDrupal\devel\Tests\DevelSwitchUserTest13300
LeafDrupal\devel_generate\Tests\DevelGenerateTest4300