workbench_moderation_20150917_0.patch

Test status
StatusResult
Last receivedThu, 09/17/2015 - 22:10:59
Last requestedThu, 09/17/2015 - 22:11:01
Last testedThu, 09/17/2015 - 22:11:30
Test count2
Environment status
MySQLfail
File information
Fileworkbench_moderation_20150917_0.patch
BranchWorkbench Moderation - 7.x-1.4
LinkIssue Link
SummaryFAILED: [[SimpleTest]]: [MySQL] 146 pass(es), 4 fail(s), and 3 exception(s).
Details

MySQL

  1. Setup environment
  2. Detect an invalid patch URL
  3. Detect invalid repository information
  4. Detect invalid patch format
  5. Detect a non-applicable patch
  6. Detect invalid PHP syntax
  7. Detect a Drupal installation failure
  8. Detect a test run failure
  9. Detect a failing test
    Review the test failures below then if necessary run them locally until the problem has been fixed.
  10. Complete test suite with all tests passing
146 pass(es), 4 fail(s), and 3 exception(s)

Non-pass

Test namePassFailException
ExpandExternal node update (WorkbenchModerationExternalNodeUpdateTestCase) [Workbench Moderation]1301
MessageGroupFilenameLineFunctionStatus
PDOException: SQLSTATE[42S22]: Column not found: 1054 Unknown column 'nh.current' in 'field list': SELECT nh.from_state AS from_state, nh.state AS state, nh.published AS published, nh.current AS current FROM {workbench_moderation_node_history} nh WHERE (nid = :db_condition_placeholder_0) AND (current = :db_condition_placeholder_1) ; Array ( [:db_condition_placeholder_0] => 1 [:db_condition_placeholder_1] => 1 ) in WorkbenchModerationExternalNodeUpdateTestCase->getModerationRecord() (line 185 of /var/lib/drupaltestbot/sites/default/files/checkout/sites/default/modules/workbench_moderation/tests/external_node_update.test).Uncaught exceptiondatabase.inc2171PDOStatement->execute()
ExpandPublish from node form (WorkbenchModerationPublishFromNodeFormTestCase) [Workbench Moderation]2542
MessageGroupFilenameLineFunctionStatus
Workbench moderation has a published revisionOtherworkbench_moderation.test228WorkbenchModerationPublishFromNodeFormTestCase->testPublishFromNodeForm()
Undefined index: publishedNoticeworkbench_moderation.test229WorkbenchModerationPublishFromNodeFormTestCase->testPublishFromNodeForm()
Trying to get property of non-objectNoticeworkbench_moderation.test229WorkbenchModerationPublishFromNodeFormTestCase->testPublishFromNodeForm()
Published revision is loaded by defaultOtherworkbench_moderation.test229WorkbenchModerationPublishFromNodeFormTestCase->testPublishFromNodeForm()
Published revision has status = 1Otherworkbench_moderation.test230WorkbenchModerationPublishFromNodeFormTestCase->testPublishFromNodeForm()
Anonymous users can access the published contentBrowserworkbench_moderation.test235WorkbenchModerationPublishFromNodeFormTestCase->testPublishFromNodeForm()

All

Test namePassFailException
ExpandExternal node update (WorkbenchModerationExternalNodeUpdateTestCase) [Workbench Moderation]1301
MessageGroupFilenameLineFunctionStatus
PDOException: SQLSTATE[42S22]: Column not found: 1054 Unknown column 'nh.current' in 'field list': SELECT nh.from_state AS from_state, nh.state AS state, nh.published AS published, nh.current AS current FROM {workbench_moderation_node_history} nh WHERE (nid = :db_condition_placeholder_0) AND (current = :db_condition_placeholder_1) ; Array ( [:db_condition_placeholder_0] => 1 [:db_condition_placeholder_1] => 1 ) in WorkbenchModerationExternalNodeUpdateTestCase->getModerationRecord() (line 185 of /var/lib/drupaltestbot/sites/default/files/checkout/sites/default/modules/workbench_moderation/tests/external_node_update.test).Uncaught exceptiondatabase.inc2171PDOStatement->execute()
LeafModeration tab (WorkbenchModerationModerateTabTestCase) [Workbench Moderation]4200
ExpandPublish from node form (WorkbenchModerationPublishFromNodeFormTestCase) [Workbench Moderation]2542
MessageGroupFilenameLineFunctionStatus
Workbench moderation has a published revisionOtherworkbench_moderation.test228WorkbenchModerationPublishFromNodeFormTestCase->testPublishFromNodeForm()
Undefined index: publishedNoticeworkbench_moderation.test229WorkbenchModerationPublishFromNodeFormTestCase->testPublishFromNodeForm()
Trying to get property of non-objectNoticeworkbench_moderation.test229WorkbenchModerationPublishFromNodeFormTestCase->testPublishFromNodeForm()
Published revision is loaded by defaultOtherworkbench_moderation.test229WorkbenchModerationPublishFromNodeFormTestCase->testPublishFromNodeForm()
Published revision has status = 1Otherworkbench_moderation.test230WorkbenchModerationPublishFromNodeFormTestCase->testPublishFromNodeForm()
Anonymous users can access the published contentBrowserworkbench_moderation.test235WorkbenchModerationPublishFromNodeFormTestCase->testPublishFromNodeForm()
LeafUnpublish moderated content (WorkbenchModerationUnpublishTestCase) [Workbench Moderation]2300
LeafWorkbench Moderation file attachments (WorkbenchModerationFilesTestCase) [Workbench Moderation]4300