fix_scald_render_cache-2570191-2.patch

Test status
StatusResult
Last receivedThu, 09/17/2015 - 11:59:59
Last requestedThu, 09/17/2015 - 12:00:01
Last testedThu, 09/17/2015 - 12:00:37
Test count1
Environment status
MySQLfail
File information
Filefix_scald_render_cache-2570191-2.patch
BranchScald: Media Management made easy - 7.x-1.4
LinkIssue Link
SummaryFAILED: [[SimpleTest]]: [MySQL] 74 pass(es), 170 fail(s), and 41 exception(s).
Details

MySQL

  1. Setup environment
  2. Detect an invalid patch URL
  3. Detect invalid repository information
  4. Detect invalid patch format
  5. Detect a non-applicable patch
  6. Detect invalid PHP syntax
  7. Detect a Drupal installation failure
  8. Detect a test run failure
  9. Detect a failing test
    Review the test failures below then if necessary run them locally until the problem has been fixed.
  10. Complete test suite with all tests passing
74 pass(es), 170 fail(s), and 41 exception(s)

Non-pass

Test namePassFailException
ExpandAtom Reference (ScaldAtomRefereneTestCase) [Scald]5165
MessageGroupFilenameLineFunctionStatus
Enabled modules: atom_reference, field_ui, scald_dnd_library, scaldOtherscald.test20ScaldWebTestCase->setUp()
Invalid permission administer scald.Roleatom_reference.test40ScaldAtomRefereneTestCase->testAtomReferenceField()
Invalid permission view any atom.Roleatom_reference.test40ScaldAtomRefereneTestCase->testAtomReferenceField()
Invalid permission create atom of any type.Roleatom_reference.test40ScaldAtomRefereneTestCase->testAtomReferenceField()
Argument 1 passed to DrupalWebTestCase::drupalLogin() must be an instance of stdClass, boolean given, called in /var/lib/drupaltestbot/sites/default/files/checkout/sites/default/modules/scald/modules/fields/atom_reference/atom_reference.test on line 41 and definedRecoverable errordrupal_web_test_case.php1252DrupalWebTestCase->drupalLogin()
Trying to get property of non-objectNoticedrupal_web_test_case.php1258DrupalWebTestCase->drupalLogin()
Trying to get property of non-objectNoticedrupal_web_test_case.php1259DrupalWebTestCase->drupalLogin()
Failed to set field name to Otheratom_reference.test41ScaldAtomRefereneTestCase->testAtomReferenceField()
Failed to set field pass to Otheratom_reference.test41ScaldAtomRefereneTestCase->testAtomReferenceField()
Found the requested form fields at userOtheratom_reference.test41ScaldAtomRefereneTestCase->testAtomReferenceField()
Trying to get property of non-objectNoticedrupal_web_test_case.php1265DrupalWebTestCase->drupalLogin()
User successfully logged in.User loginatom_reference.test41ScaldAtomRefereneTestCase->testAtomReferenceField()
Failed to set field files[file] to /var/lib/drupaltestbot/sites/default/files/checkout/sites/default/files/simpletest/141650/image-test.pngOtherscald.test55ScaldWebTestCase->createAtom()
Found the Continue buttonOtherscald.test55ScaldWebTestCase->createAtom()
Found the requested form fields at atom/add/imageOtherscald.test55ScaldWebTestCase->createAtom()
Found field with name 'atom0[title]' and value 'image-test.png'Browserscald.test56ScaldWebTestCase->createAtom()
Failed to set field atom0[title] to Image avcrF4euxFfXyBqpMAUqOtherscald.test64ScaldWebTestCase->createAtom()
Failed to set field atom0[scald_authors][und] to jOGAgOxN1cOtherscald.test64ScaldWebTestCase->createAtom()
Found the Finish buttonOtherscald.test64ScaldWebTestCase->createAtom()
Found the requested form fields at Otherscald.test64ScaldWebTestCase->createAtom()
EntityFieldQueryException: Entity <em class="placeholder">scald_atom</em> has no base table. in EntityFieldQuery->propertyQuery() (line 1247 of /var/lib/drupaltestbot/sites/default/files/checkout/includes/entity.inc).Uncaught exceptionentity.inc1247EntityFieldQuery->propertyQuery()
ExpandScald atom entities (ScaldAtomEntityTestCase) [Scald]245818
MessageGroupFilenameLineFunctionStatus
Enabled modules: scald_image, scaldOtherscald.test20ScaldWebTestCase->setUp()
Invalid permission create atom of image type.Rolescald.test338ScaldAtomEntityTestCase->setUp()
Invalid permission view any atom.Rolescald.test338ScaldAtomEntityTestCase->setUp()
Invalid permission fetch any atom.Rolescald.test338ScaldAtomEntityTestCase->setUp()
Invalid permission edit own atom.Rolescald.test338ScaldAtomEntityTestCase->setUp()
Argument 1 passed to DrupalWebTestCase::drupalLogin() must be an instance of stdClass, boolean given, called in /var/lib/drupaltestbot/sites/default/files/checkout/sites/default/modules/scald/tests/scald.test on line 339 and definedRecoverable errordrupal_web_test_case.php1252DrupalWebTestCase->drupalLogin()
Trying to get property of non-objectNoticedrupal_web_test_case.php1258DrupalWebTestCase->drupalLogin()
Trying to get property of non-objectNoticedrupal_web_test_case.php1259DrupalWebTestCase->drupalLogin()
Failed to set field name to Otherscald.test339ScaldAtomEntityTestCase->setUp()
Failed to set field pass to Otherscald.test339ScaldAtomEntityTestCase->setUp()
Found the requested form fields at userOtherscald.test339ScaldAtomEntityTestCase->setUp()
Trying to get property of non-objectNoticedrupal_web_test_case.php1265DrupalWebTestCase->drupalLogin()
User successfully logged in.User loginscald.test339ScaldAtomEntityTestCase->setUp()
Failed to set field files[file] to /var/lib/drupaltestbot/sites/default/files/checkout/sites/default/files/simpletest/669687/image-test.pngOtherscald.test55ScaldWebTestCase->createAtom()
Found the Continue buttonOtherscald.test55ScaldWebTestCase->createAtom()
Found the requested form fields at atom/add/imageOtherscald.test55ScaldWebTestCase->createAtom()
Found field with name 'atom0[title]' and value 'image-test.png'Browserscald.test56ScaldWebTestCase->createAtom()
Failed to set field atom0[title] to Image lgj6czMOqwMpMNKbqRCgOtherscald.test64ScaldWebTestCase->createAtom()
Failed to set field atom0[scald_authors][und] to eHEyLMLzfDOtherscald.test64ScaldWebTestCase->createAtom()
Found the Finish buttonOtherscald.test64ScaldWebTestCase->createAtom()
Found the requested form fields at Otherscald.test64ScaldWebTestCase->createAtom()
EntityFieldQueryException: Entity <em class="placeholder">scald_atom</em> has no base table. in EntityFieldQuery->propertyQuery() (line 1247 of /var/lib/drupaltestbot/sites/default/files/checkout/includes/entity.inc).Uncaught exceptionentity.inc1247EntityFieldQuery->propertyQuery()
Enabled modules: scald_image, scaldOtherscald.test20ScaldWebTestCase->setUp()
Invalid permission create atom of image type.Rolescald.test338ScaldAtomEntityTestCase->setUp()
Invalid permission view any atom.Rolescald.test338ScaldAtomEntityTestCase->setUp()
Invalid permission fetch any atom.Rolescald.test338ScaldAtomEntityTestCase->setUp()
Invalid permission edit own atom.Rolescald.test338ScaldAtomEntityTestCase->setUp()
Argument 1 passed to DrupalWebTestCase::drupalLogin() must be an instance of stdClass, boolean given, called in /var/lib/drupaltestbot/sites/default/files/checkout/sites/default/modules/scald/tests/scald.test on line 339 and definedRecoverable errordrupal_web_test_case.php1252DrupalWebTestCase->drupalLogin()
Trying to get property of non-objectNoticedrupal_web_test_case.php1258DrupalWebTestCase->drupalLogin()
Trying to get property of non-objectNoticedrupal_web_test_case.php1259DrupalWebTestCase->drupalLogin()
Failed to set field name to Otherscald.test339ScaldAtomEntityTestCase->setUp()
Failed to set field pass to Otherscald.test339ScaldAtomEntityTestCase->setUp()
Found the requested form fields at userOtherscald.test339ScaldAtomEntityTestCase->setUp()
Trying to get property of non-objectNoticedrupal_web_test_case.php1265DrupalWebTestCase->drupalLogin()
User successfully logged in.User loginscald.test339ScaldAtomEntityTestCase->setUp()
Failed to set field files[file] to /var/lib/drupaltestbot/sites/default/files/checkout/sites/default/files/simpletest/343306/image-test.pngOtherscald.test55ScaldWebTestCase->createAtom()
Found the Continue buttonOtherscald.test55ScaldWebTestCase->createAtom()
Found the requested form fields at atom/add/imageOtherscald.test55ScaldWebTestCase->createAtom()
Found field with name 'atom0[title]' and value 'image-test.png'Browserscald.test56ScaldWebTestCase->createAtom()
Failed to set field atom0[title] to Image zYGnQTlSpAp1atTx4RwXOtherscald.test64ScaldWebTestCase->createAtom()
Failed to set field atom0[scald_authors][und] to h9tghuBL0TOtherscald.test64ScaldWebTestCase->createAtom()
Found the Finish buttonOtherscald.test64ScaldWebTestCase->createAtom()
Found the requested form fields at Otherscald.test64ScaldWebTestCase->createAtom()
EntityFieldQueryException: Entity <em class="placeholder">scald_atom</em> has no base table. in EntityFieldQuery->propertyQuery() (line 1247 of /var/lib/drupaltestbot/sites/default/files/checkout/includes/entity.inc).Uncaught exceptionentity.inc1247EntityFieldQuery->propertyQuery()
The test did not complete due to a fatal error.Completion checkscald.test400ScaldAtomEntityTestCase->testScaldAtomManual()
Enabled modules: scald_image, scaldOtherscald.test20ScaldWebTestCase->setUp()
Invalid permission create atom of image type.Rolescald.test338ScaldAtomEntityTestCase->setUp()
Invalid permission view any atom.Rolescald.test338ScaldAtomEntityTestCase->setUp()
Invalid permission fetch any atom.Rolescald.test338ScaldAtomEntityTestCase->setUp()
Invalid permission edit own atom.Rolescald.test338ScaldAtomEntityTestCase->setUp()
Argument 1 passed to DrupalWebTestCase::drupalLogin() must be an instance of stdClass, boolean given, called in /var/lib/drupaltestbot/sites/default/files/checkout/sites/default/modules/scald/tests/scald.test on line 339 and definedRecoverable errordrupal_web_test_case.php1252DrupalWebTestCase->drupalLogin()
Trying to get property of non-objectNoticedrupal_web_test_case.php1258DrupalWebTestCase->drupalLogin()
Trying to get property of non-objectNoticedrupal_web_test_case.php1259DrupalWebTestCase->drupalLogin()
Failed to set field name to Otherscald.test339ScaldAtomEntityTestCase->setUp()
Failed to set field pass to Otherscald.test339ScaldAtomEntityTestCase->setUp()
Found the requested form fields at userOtherscald.test339ScaldAtomEntityTestCase->setUp()
Trying to get property of non-objectNoticedrupal_web_test_case.php1265DrupalWebTestCase->drupalLogin()
User successfully logged in.User loginscald.test339ScaldAtomEntityTestCase->setUp()
Invalid permission view any atom.Rolescald.test412ScaldAtomEntityTestCase->testScaldAtomManual()
Invalid permission fetch any atom.Rolescald.test412ScaldAtomEntityTestCase->testScaldAtomManual()
Invalid permission edit own atom.Rolescald.test412ScaldAtomEntityTestCase->testScaldAtomManual()
Invalid permission create atom of image type.Rolescald.test412ScaldAtomEntityTestCase->testScaldAtomManual()
Invalid permission delete own atom.Rolescald.test412ScaldAtomEntityTestCase->testScaldAtomManual()
Argument 1 passed to DrupalWebTestCase::drupalLogin() must be an instance of stdClass, boolean given, called in /var/lib/drupaltestbot/sites/default/files/checkout/sites/default/modules/scald/tests/scald.test on line 413 and definedRecoverable errordrupal_web_test_case.php1252DrupalWebTestCase->drupalLogin()
Trying to get property of non-objectNoticedrupal_web_test_case.php1258DrupalWebTestCase->drupalLogin()
Trying to get property of non-objectNoticedrupal_web_test_case.php1259DrupalWebTestCase->drupalLogin()
Failed to set field name to Otherscald.test413ScaldAtomEntityTestCase->testScaldAtomManual()
Failed to set field pass to Otherscald.test413ScaldAtomEntityTestCase->testScaldAtomManual()
Found the requested form fields at userOtherscald.test413ScaldAtomEntityTestCase->testScaldAtomManual()
Trying to get property of non-objectNoticedrupal_web_test_case.php1265DrupalWebTestCase->drupalLogin()
User successfully logged in.User loginscald.test413ScaldAtomEntityTestCase->testScaldAtomManual()
Failed to set field files[file] to /var/lib/drupaltestbot/sites/default/files/checkout/sites/default/files/simpletest/245617/image-test.pngOtherscald.test419ScaldAtomEntityTestCase->testScaldAtomManual()
Found the Continue buttonOtherscald.test419ScaldAtomEntityTestCase->testScaldAtomManual()
Found the requested form fields at atom/add/imageOtherscald.test419ScaldAtomEntityTestCase->testScaldAtomManual()
Image file found in database.Otherscald.test430ScaldAtomEntityTestCase->testScaldAtomManual()
Call to undefined function scald_fetch()PHP Fatal errorscald.test432Unknown
ExpandScald base (ScaldBaseTestCase) [Scald]020
MessageGroupFilenameLineFunctionStatus
The test did not complete due to a fatal error.Completion checkscald.test139ScaldBaseTestCase->testScaldBaseAtomType()
Enabled modules: scaldOtherscald.test20ScaldWebTestCase->setUp()
ExpandScald DnD (ScaldDnDTestCase) [Scald]3104
MessageGroupFilenameLineFunctionStatus
The test did not complete due to a fatal error.Completion checkscald.test550ScaldDnDTestCase->testScaldDndLibrary()
Enabled modules: scald_image, scald_dnd_library, scaldOtherscald.test20ScaldWebTestCase->setUp()
Invalid permission create atom of image type.Rolescald.test543ScaldDnDTestCase->setUp()
Invalid permission view any atom.Rolescald.test543ScaldDnDTestCase->setUp()
Invalid permission fetch any atom.Rolescald.test543ScaldDnDTestCase->setUp()
Invalid permission edit own atom.Rolescald.test543ScaldDnDTestCase->setUp()
Argument 1 passed to DrupalWebTestCase::drupalLogin() must be an instance of stdClass, boolean given, called in /var/lib/drupaltestbot/sites/default/files/checkout/sites/default/modules/scald/tests/scald.test on line 544 and definedRecoverable errordrupal_web_test_case.php1252DrupalWebTestCase->drupalLogin()
Trying to get property of non-objectNoticedrupal_web_test_case.php1258DrupalWebTestCase->drupalLogin()
Trying to get property of non-objectNoticedrupal_web_test_case.php1259DrupalWebTestCase->drupalLogin()
Failed to set field name to Otherscald.test544ScaldDnDTestCase->setUp()
Failed to set field pass to Otherscald.test544ScaldDnDTestCase->setUp()
Found the requested form fields at userOtherscald.test544ScaldDnDTestCase->setUp()
Trying to get property of non-objectNoticedrupal_web_test_case.php1265DrupalWebTestCase->drupalLogin()
User successfully logged in.User loginscald.test544ScaldDnDTestCase->setUp()
ExpandScald Localize (ScaldLocalizeTestCase) [Scald]428414
MessageGroupFilenameLineFunctionStatus
Enabled modules: scald_image, locale, i18n, i18n_string, scaldOtherscald.test20ScaldWebTestCase->setUp()
Invalid permission administer scald.Rolescald.test611ScaldLocalizeTestCase->setUp()
Invalid permission create atom of image type.Rolescald.test611ScaldLocalizeTestCase->setUp()
Invalid permission view any atom.Rolescald.test611ScaldLocalizeTestCase->setUp()
Invalid permission fetch any atom.Rolescald.test611ScaldLocalizeTestCase->setUp()
Invalid permission delete any atom.Rolescald.test611ScaldLocalizeTestCase->setUp()
Invalid permission edit own atom.Rolescald.test611ScaldLocalizeTestCase->setUp()
Invalid permission administer languages.Rolescald.test611ScaldLocalizeTestCase->setUp()
Invalid permission translate interface.Rolescald.test611ScaldLocalizeTestCase->setUp()
Invalid permission translate user-defined strings.Rolescald.test611ScaldLocalizeTestCase->setUp()
Argument 1 passed to DrupalWebTestCase::drupalLogin() must be an instance of stdClass, boolean given, called in /var/lib/drupaltestbot/sites/default/files/checkout/sites/default/modules/scald/tests/scald.test on line 612 and definedRecoverable errordrupal_web_test_case.php1252DrupalWebTestCase->drupalLogin()
Trying to get property of non-objectNoticedrupal_web_test_case.php1258DrupalWebTestCase->drupalLogin()
Trying to get property of non-objectNoticedrupal_web_test_case.php1259DrupalWebTestCase->drupalLogin()
Failed to set field name to Otherscald.test612ScaldLocalizeTestCase->setUp()
Failed to set field pass to Otherscald.test612ScaldLocalizeTestCase->setUp()
Found the requested form fields at userOtherscald.test612ScaldLocalizeTestCase->setUp()
Trying to get property of non-objectNoticedrupal_web_test_case.php1265DrupalWebTestCase->drupalLogin()
User successfully logged in.User loginscald.test612ScaldLocalizeTestCase->setUp()
Failed to set field langcode to frOtherscald.test616ScaldLocalizeTestCase->setUp()
Found the Add language buttonOtherscald.test616ScaldLocalizeTestCase->setUp()
Found the requested form fields at admin/config/regional/language/addOtherscald.test616ScaldLocalizeTestCase->setUp()
Failed to set field language[enabled][locale-url] to 1Otherscald.test620ScaldLocalizeTestCase->setUp()
Found the Save settings buttonOtherscald.test620ScaldLocalizeTestCase->setUp()
Found the requested form fields at admin/config/regional/language/configureOtherscald.test620ScaldLocalizeTestCase->setUp()
Failed to set field string to EditOtherscald.test634ScaldLocalizeTestCase->testStringTranslation()
Found the Filter buttonOtherscald.test634ScaldLocalizeTestCase->testStringTranslation()
Found the requested form fields at admin/config/regional/translate/translateOtherscald.test634ScaldLocalizeTestCase->testStringTranslation()
Link edit does not exist on http://ec2-54-148-9-230.us-west-2.compute.amazonaws.com/checkout/?q=admin/config/regional/translate/translateBrowserscald.test636ScaldLocalizeTestCase->testStringTranslation()
Failed to set field translations[fr] to ModifierOtherscald.test640ScaldLocalizeTestCase->testStringTranslation()
Found the Save translations buttonOtherscald.test640ScaldLocalizeTestCase->testStringTranslation()
Found the requested form fields at Otherscald.test640ScaldLocalizeTestCase->testStringTranslation()
PDOException: SQLSTATE[42S02]: Base table or view not found: 1146 Table 'drupaltestbotmysql.simpletest391265cache_scald' doesn't exist: TRUNCATE {cache_scald} ; Array ( ) in cache_clear_all() (line 167 of /var/lib/drupaltestbot/sites/default/files/checkout/includes/cache.inc).Uncaught exceptiondatabase.inc2171PDOStatement->execute()
Enabled modules: scald_image, locale, i18n, i18n_string, scaldOtherscald.test20ScaldWebTestCase->setUp()
Invalid permission administer scald.Rolescald.test611ScaldLocalizeTestCase->setUp()
Invalid permission create atom of image type.Rolescald.test611ScaldLocalizeTestCase->setUp()
Invalid permission view any atom.Rolescald.test611ScaldLocalizeTestCase->setUp()
Invalid permission fetch any atom.Rolescald.test611ScaldLocalizeTestCase->setUp()
Invalid permission delete any atom.Rolescald.test611ScaldLocalizeTestCase->setUp()
Invalid permission edit own atom.Rolescald.test611ScaldLocalizeTestCase->setUp()
Invalid permission administer languages.Rolescald.test611ScaldLocalizeTestCase->setUp()
Invalid permission translate interface.Rolescald.test611ScaldLocalizeTestCase->setUp()
Invalid permission translate user-defined strings.Rolescald.test611ScaldLocalizeTestCase->setUp()
Argument 1 passed to DrupalWebTestCase::drupalLogin() must be an instance of stdClass, boolean given, called in /var/lib/drupaltestbot/sites/default/files/checkout/sites/default/modules/scald/tests/scald.test on line 612 and definedRecoverable errordrupal_web_test_case.php1252DrupalWebTestCase->drupalLogin()
Trying to get property of non-objectNoticedrupal_web_test_case.php1258DrupalWebTestCase->drupalLogin()
Trying to get property of non-objectNoticedrupal_web_test_case.php1259DrupalWebTestCase->drupalLogin()
Failed to set field name to Otherscald.test612ScaldLocalizeTestCase->setUp()
Failed to set field pass to Otherscald.test612ScaldLocalizeTestCase->setUp()
Found the requested form fields at userOtherscald.test612ScaldLocalizeTestCase->setUp()
Trying to get property of non-objectNoticedrupal_web_test_case.php1265DrupalWebTestCase->drupalLogin()
User successfully logged in.User loginscald.test612ScaldLocalizeTestCase->setUp()
Failed to set field langcode to frOtherscald.test616ScaldLocalizeTestCase->setUp()
Found the Add language buttonOtherscald.test616ScaldLocalizeTestCase->setUp()
Found the requested form fields at admin/config/regional/language/addOtherscald.test616ScaldLocalizeTestCase->setUp()
Failed to set field language[enabled][locale-url] to 1Otherscald.test620ScaldLocalizeTestCase->setUp()
Found the Save settings buttonOtherscald.test620ScaldLocalizeTestCase->setUp()
Found the requested form fields at admin/config/regional/language/configureOtherscald.test620ScaldLocalizeTestCase->setUp()
The "translate" action is shown in the types table.Otherscald.test656ScaldLocalizeTestCase->testAtomTypeTranslation()
Failed to set field strings[scald:type:image:title] to L'imageOtherscald.test666ScaldLocalizeTestCase->testAtomTypeTranslation()
Failed to set field strings[scald:type:image:description] to Une représentation visuelleOtherscald.test666ScaldLocalizeTestCase->testAtomTypeTranslation()
Found the Save translation buttonOtherscald.test666ScaldLocalizeTestCase->testAtomTypeTranslation()
Found the requested form fields at admin/structure/scald/image/translate/frOtherscald.test666ScaldLocalizeTestCase->testAtomTypeTranslation()
The type is translated on the overview.Otherscald.test670ScaldLocalizeTestCase->testAtomTypeTranslation()
The type is translated on the Add Atom page.Otherscald.test674ScaldLocalizeTestCase->testAtomTypeTranslation()
The type is translated on the Add Image page.Otherscald.test678ScaldLocalizeTestCase->testAtomTypeTranslation()
Failed to set field files[file] to /var/lib/drupaltestbot/sites/default/files/checkout/sites/default/files/simpletest/989315/image-test.pngOtherscald.test720ScaldLocalizeTestCase->createAtom()
Found the Continue buttonOtherscald.test720ScaldLocalizeTestCase->createAtom()
Found the requested form fields at fr/atom/add/imageOtherscald.test720ScaldLocalizeTestCase->createAtom()
Found field with name 'atom0[title]' and value 'image-test.png'Browserscald.test721ScaldLocalizeTestCase->createAtom()
Failed to set field atom0[title] to Image o54erVqM1uHAakOcvEUZOtherscald.test729ScaldLocalizeTestCase->createAtom()
Failed to set field atom0[scald_authors][und] to lToQnUkeLXOtherscald.test729ScaldLocalizeTestCase->createAtom()
Found the Finish buttonOtherscald.test729ScaldLocalizeTestCase->createAtom()
Found the requested form fields at Otherscald.test729ScaldLocalizeTestCase->createAtom()
EntityFieldQueryException: Entity <em class="placeholder">scald_atom</em> has no base table. in EntityFieldQuery->propertyQuery() (line 1247 of /var/lib/drupaltestbot/sites/default/files/checkout/includes/entity.inc).Uncaught exceptionentity.inc1247EntityFieldQuery->propertyQuery()
The test did not complete due to a fatal error.Completion checkscald.test697ScaldLocalizeTestCase->testScaldTextGroup()
Enabled modules: scald_image, locale, i18n, i18n_string, scaldOtherscald.test20ScaldWebTestCase->setUp()
Invalid permission administer scald.Rolescald.test611ScaldLocalizeTestCase->setUp()
Invalid permission create atom of image type.Rolescald.test611ScaldLocalizeTestCase->setUp()
Invalid permission view any atom.Rolescald.test611ScaldLocalizeTestCase->setUp()
Invalid permission fetch any atom.Rolescald.test611ScaldLocalizeTestCase->setUp()
Invalid permission delete any atom.Rolescald.test611ScaldLocalizeTestCase->setUp()
Invalid permission edit own atom.Rolescald.test611ScaldLocalizeTestCase->setUp()
Invalid permission administer languages.Rolescald.test611ScaldLocalizeTestCase->setUp()
Invalid permission translate interface.Rolescald.test611ScaldLocalizeTestCase->setUp()
Invalid permission translate user-defined strings.Rolescald.test611ScaldLocalizeTestCase->setUp()
Argument 1 passed to DrupalWebTestCase::drupalLogin() must be an instance of stdClass, boolean given, called in /var/lib/drupaltestbot/sites/default/files/checkout/sites/default/modules/scald/tests/scald.test on line 612 and definedRecoverable errordrupal_web_test_case.php1252DrupalWebTestCase->drupalLogin()
Trying to get property of non-objectNoticedrupal_web_test_case.php1258DrupalWebTestCase->drupalLogin()
Trying to get property of non-objectNoticedrupal_web_test_case.php1259DrupalWebTestCase->drupalLogin()
Failed to set field name to Otherscald.test612ScaldLocalizeTestCase->setUp()
Failed to set field pass to Otherscald.test612ScaldLocalizeTestCase->setUp()
Found the requested form fields at userOtherscald.test612ScaldLocalizeTestCase->setUp()
Trying to get property of non-objectNoticedrupal_web_test_case.php1265DrupalWebTestCase->drupalLogin()
User successfully logged in.User loginscald.test612ScaldLocalizeTestCase->setUp()
Failed to set field langcode to frOtherscald.test616ScaldLocalizeTestCase->setUp()
Found the Add language buttonOtherscald.test616ScaldLocalizeTestCase->setUp()
Found the requested form fields at admin/config/regional/language/addOtherscald.test616ScaldLocalizeTestCase->setUp()
Failed to set field language[enabled][locale-url] to 1Otherscald.test620ScaldLocalizeTestCase->setUp()
Found the Save settings buttonOtherscald.test620ScaldLocalizeTestCase->setUp()
Found the requested form fields at admin/config/regional/language/configureOtherscald.test620ScaldLocalizeTestCase->setUp()

All

Test namePassFailException
ExpandAtom Reference (ScaldAtomRefereneTestCase) [Scald]5165
MessageGroupFilenameLineFunctionStatus
Enabled modules: atom_reference, field_ui, scald_dnd_library, scaldOtherscald.test20ScaldWebTestCase->setUp()
Invalid permission administer scald.Roleatom_reference.test40ScaldAtomRefereneTestCase->testAtomReferenceField()
Invalid permission view any atom.Roleatom_reference.test40ScaldAtomRefereneTestCase->testAtomReferenceField()
Invalid permission create atom of any type.Roleatom_reference.test40ScaldAtomRefereneTestCase->testAtomReferenceField()
Argument 1 passed to DrupalWebTestCase::drupalLogin() must be an instance of stdClass, boolean given, called in /var/lib/drupaltestbot/sites/default/files/checkout/sites/default/modules/scald/modules/fields/atom_reference/atom_reference.test on line 41 and definedRecoverable errordrupal_web_test_case.php1252DrupalWebTestCase->drupalLogin()
Trying to get property of non-objectNoticedrupal_web_test_case.php1258DrupalWebTestCase->drupalLogin()
Trying to get property of non-objectNoticedrupal_web_test_case.php1259DrupalWebTestCase->drupalLogin()
Failed to set field name to Otheratom_reference.test41ScaldAtomRefereneTestCase->testAtomReferenceField()
Failed to set field pass to Otheratom_reference.test41ScaldAtomRefereneTestCase->testAtomReferenceField()
Found the requested form fields at userOtheratom_reference.test41ScaldAtomRefereneTestCase->testAtomReferenceField()
Trying to get property of non-objectNoticedrupal_web_test_case.php1265DrupalWebTestCase->drupalLogin()
User successfully logged in.User loginatom_reference.test41ScaldAtomRefereneTestCase->testAtomReferenceField()
Failed to set field files[file] to /var/lib/drupaltestbot/sites/default/files/checkout/sites/default/files/simpletest/141650/image-test.pngOtherscald.test55ScaldWebTestCase->createAtom()
Found the Continue buttonOtherscald.test55ScaldWebTestCase->createAtom()
Found the requested form fields at atom/add/imageOtherscald.test55ScaldWebTestCase->createAtom()
Found field with name 'atom0[title]' and value 'image-test.png'Browserscald.test56ScaldWebTestCase->createAtom()
Failed to set field atom0[title] to Image avcrF4euxFfXyBqpMAUqOtherscald.test64ScaldWebTestCase->createAtom()
Failed to set field atom0[scald_authors][und] to jOGAgOxN1cOtherscald.test64ScaldWebTestCase->createAtom()
Found the Finish buttonOtherscald.test64ScaldWebTestCase->createAtom()
Found the requested form fields at Otherscald.test64ScaldWebTestCase->createAtom()
EntityFieldQueryException: Entity <em class="placeholder">scald_atom</em> has no base table. in EntityFieldQuery->propertyQuery() (line 1247 of /var/lib/drupaltestbot/sites/default/files/checkout/includes/entity.inc).Uncaught exceptionentity.inc1247EntityFieldQuery->propertyQuery()
ExpandScald atom entities (ScaldAtomEntityTestCase) [Scald]245818
MessageGroupFilenameLineFunctionStatus
Enabled modules: scald_image, scaldOtherscald.test20ScaldWebTestCase->setUp()
Invalid permission create atom of image type.Rolescald.test338ScaldAtomEntityTestCase->setUp()
Invalid permission view any atom.Rolescald.test338ScaldAtomEntityTestCase->setUp()
Invalid permission fetch any atom.Rolescald.test338ScaldAtomEntityTestCase->setUp()
Invalid permission edit own atom.Rolescald.test338ScaldAtomEntityTestCase->setUp()
Argument 1 passed to DrupalWebTestCase::drupalLogin() must be an instance of stdClass, boolean given, called in /var/lib/drupaltestbot/sites/default/files/checkout/sites/default/modules/scald/tests/scald.test on line 339 and definedRecoverable errordrupal_web_test_case.php1252DrupalWebTestCase->drupalLogin()
Trying to get property of non-objectNoticedrupal_web_test_case.php1258DrupalWebTestCase->drupalLogin()
Trying to get property of non-objectNoticedrupal_web_test_case.php1259DrupalWebTestCase->drupalLogin()
Failed to set field name to Otherscald.test339ScaldAtomEntityTestCase->setUp()
Failed to set field pass to Otherscald.test339ScaldAtomEntityTestCase->setUp()
Found the requested form fields at userOtherscald.test339ScaldAtomEntityTestCase->setUp()
Trying to get property of non-objectNoticedrupal_web_test_case.php1265DrupalWebTestCase->drupalLogin()
User successfully logged in.User loginscald.test339ScaldAtomEntityTestCase->setUp()
Failed to set field files[file] to /var/lib/drupaltestbot/sites/default/files/checkout/sites/default/files/simpletest/669687/image-test.pngOtherscald.test55ScaldWebTestCase->createAtom()
Found the Continue buttonOtherscald.test55ScaldWebTestCase->createAtom()
Found the requested form fields at atom/add/imageOtherscald.test55ScaldWebTestCase->createAtom()
Found field with name 'atom0[title]' and value 'image-test.png'Browserscald.test56ScaldWebTestCase->createAtom()
Failed to set field atom0[title] to Image lgj6czMOqwMpMNKbqRCgOtherscald.test64ScaldWebTestCase->createAtom()
Failed to set field atom0[scald_authors][und] to eHEyLMLzfDOtherscald.test64ScaldWebTestCase->createAtom()
Found the Finish buttonOtherscald.test64ScaldWebTestCase->createAtom()
Found the requested form fields at Otherscald.test64ScaldWebTestCase->createAtom()
EntityFieldQueryException: Entity <em class="placeholder">scald_atom</em> has no base table. in EntityFieldQuery->propertyQuery() (line 1247 of /var/lib/drupaltestbot/sites/default/files/checkout/includes/entity.inc).Uncaught exceptionentity.inc1247EntityFieldQuery->propertyQuery()
Enabled modules: scald_image, scaldOtherscald.test20ScaldWebTestCase->setUp()
Invalid permission create atom of image type.Rolescald.test338ScaldAtomEntityTestCase->setUp()
Invalid permission view any atom.Rolescald.test338ScaldAtomEntityTestCase->setUp()
Invalid permission fetch any atom.Rolescald.test338ScaldAtomEntityTestCase->setUp()
Invalid permission edit own atom.Rolescald.test338ScaldAtomEntityTestCase->setUp()
Argument 1 passed to DrupalWebTestCase::drupalLogin() must be an instance of stdClass, boolean given, called in /var/lib/drupaltestbot/sites/default/files/checkout/sites/default/modules/scald/tests/scald.test on line 339 and definedRecoverable errordrupal_web_test_case.php1252DrupalWebTestCase->drupalLogin()
Trying to get property of non-objectNoticedrupal_web_test_case.php1258DrupalWebTestCase->drupalLogin()
Trying to get property of non-objectNoticedrupal_web_test_case.php1259DrupalWebTestCase->drupalLogin()
Failed to set field name to Otherscald.test339ScaldAtomEntityTestCase->setUp()
Failed to set field pass to Otherscald.test339ScaldAtomEntityTestCase->setUp()
Found the requested form fields at userOtherscald.test339ScaldAtomEntityTestCase->setUp()
Trying to get property of non-objectNoticedrupal_web_test_case.php1265DrupalWebTestCase->drupalLogin()
User successfully logged in.User loginscald.test339ScaldAtomEntityTestCase->setUp()
Failed to set field files[file] to /var/lib/drupaltestbot/sites/default/files/checkout/sites/default/files/simpletest/343306/image-test.pngOtherscald.test55ScaldWebTestCase->createAtom()
Found the Continue buttonOtherscald.test55ScaldWebTestCase->createAtom()
Found the requested form fields at atom/add/imageOtherscald.test55ScaldWebTestCase->createAtom()
Found field with name 'atom0[title]' and value 'image-test.png'Browserscald.test56ScaldWebTestCase->createAtom()
Failed to set field atom0[title] to Image zYGnQTlSpAp1atTx4RwXOtherscald.test64ScaldWebTestCase->createAtom()
Failed to set field atom0[scald_authors][und] to h9tghuBL0TOtherscald.test64ScaldWebTestCase->createAtom()
Found the Finish buttonOtherscald.test64ScaldWebTestCase->createAtom()
Found the requested form fields at Otherscald.test64ScaldWebTestCase->createAtom()
EntityFieldQueryException: Entity <em class="placeholder">scald_atom</em> has no base table. in EntityFieldQuery->propertyQuery() (line 1247 of /var/lib/drupaltestbot/sites/default/files/checkout/includes/entity.inc).Uncaught exceptionentity.inc1247EntityFieldQuery->propertyQuery()
The test did not complete due to a fatal error.Completion checkscald.test400ScaldAtomEntityTestCase->testScaldAtomManual()
Enabled modules: scald_image, scaldOtherscald.test20ScaldWebTestCase->setUp()
Invalid permission create atom of image type.Rolescald.test338ScaldAtomEntityTestCase->setUp()
Invalid permission view any atom.Rolescald.test338ScaldAtomEntityTestCase->setUp()
Invalid permission fetch any atom.Rolescald.test338ScaldAtomEntityTestCase->setUp()
Invalid permission edit own atom.Rolescald.test338ScaldAtomEntityTestCase->setUp()
Argument 1 passed to DrupalWebTestCase::drupalLogin() must be an instance of stdClass, boolean given, called in /var/lib/drupaltestbot/sites/default/files/checkout/sites/default/modules/scald/tests/scald.test on line 339 and definedRecoverable errordrupal_web_test_case.php1252DrupalWebTestCase->drupalLogin()
Trying to get property of non-objectNoticedrupal_web_test_case.php1258DrupalWebTestCase->drupalLogin()
Trying to get property of non-objectNoticedrupal_web_test_case.php1259DrupalWebTestCase->drupalLogin()
Failed to set field name to Otherscald.test339ScaldAtomEntityTestCase->setUp()
Failed to set field pass to Otherscald.test339ScaldAtomEntityTestCase->setUp()
Found the requested form fields at userOtherscald.test339ScaldAtomEntityTestCase->setUp()
Trying to get property of non-objectNoticedrupal_web_test_case.php1265DrupalWebTestCase->drupalLogin()
User successfully logged in.User loginscald.test339ScaldAtomEntityTestCase->setUp()
Invalid permission view any atom.Rolescald.test412ScaldAtomEntityTestCase->testScaldAtomManual()
Invalid permission fetch any atom.Rolescald.test412ScaldAtomEntityTestCase->testScaldAtomManual()
Invalid permission edit own atom.Rolescald.test412ScaldAtomEntityTestCase->testScaldAtomManual()
Invalid permission create atom of image type.Rolescald.test412ScaldAtomEntityTestCase->testScaldAtomManual()
Invalid permission delete own atom.Rolescald.test412ScaldAtomEntityTestCase->testScaldAtomManual()
Argument 1 passed to DrupalWebTestCase::drupalLogin() must be an instance of stdClass, boolean given, called in /var/lib/drupaltestbot/sites/default/files/checkout/sites/default/modules/scald/tests/scald.test on line 413 and definedRecoverable errordrupal_web_test_case.php1252DrupalWebTestCase->drupalLogin()
Trying to get property of non-objectNoticedrupal_web_test_case.php1258DrupalWebTestCase->drupalLogin()
Trying to get property of non-objectNoticedrupal_web_test_case.php1259DrupalWebTestCase->drupalLogin()
Failed to set field name to Otherscald.test413ScaldAtomEntityTestCase->testScaldAtomManual()
Failed to set field pass to Otherscald.test413ScaldAtomEntityTestCase->testScaldAtomManual()
Found the requested form fields at userOtherscald.test413ScaldAtomEntityTestCase->testScaldAtomManual()
Trying to get property of non-objectNoticedrupal_web_test_case.php1265DrupalWebTestCase->drupalLogin()
User successfully logged in.User loginscald.test413ScaldAtomEntityTestCase->testScaldAtomManual()
Failed to set field files[file] to /var/lib/drupaltestbot/sites/default/files/checkout/sites/default/files/simpletest/245617/image-test.pngOtherscald.test419ScaldAtomEntityTestCase->testScaldAtomManual()
Found the Continue buttonOtherscald.test419ScaldAtomEntityTestCase->testScaldAtomManual()
Found the requested form fields at atom/add/imageOtherscald.test419ScaldAtomEntityTestCase->testScaldAtomManual()
Image file found in database.Otherscald.test430ScaldAtomEntityTestCase->testScaldAtomManual()
Call to undefined function scald_fetch()PHP Fatal errorscald.test432Unknown
ExpandScald base (ScaldBaseTestCase) [Scald]020
MessageGroupFilenameLineFunctionStatus
The test did not complete due to a fatal error.Completion checkscald.test139ScaldBaseTestCase->testScaldBaseAtomType()
Enabled modules: scaldOtherscald.test20ScaldWebTestCase->setUp()
ExpandScald DnD (ScaldDnDTestCase) [Scald]3104
MessageGroupFilenameLineFunctionStatus
The test did not complete due to a fatal error.Completion checkscald.test550ScaldDnDTestCase->testScaldDndLibrary()
Enabled modules: scald_image, scald_dnd_library, scaldOtherscald.test20ScaldWebTestCase->setUp()
Invalid permission create atom of image type.Rolescald.test543ScaldDnDTestCase->setUp()
Invalid permission view any atom.Rolescald.test543ScaldDnDTestCase->setUp()
Invalid permission fetch any atom.Rolescald.test543ScaldDnDTestCase->setUp()
Invalid permission edit own atom.Rolescald.test543ScaldDnDTestCase->setUp()
Argument 1 passed to DrupalWebTestCase::drupalLogin() must be an instance of stdClass, boolean given, called in /var/lib/drupaltestbot/sites/default/files/checkout/sites/default/modules/scald/tests/scald.test on line 544 and definedRecoverable errordrupal_web_test_case.php1252DrupalWebTestCase->drupalLogin()
Trying to get property of non-objectNoticedrupal_web_test_case.php1258DrupalWebTestCase->drupalLogin()
Trying to get property of non-objectNoticedrupal_web_test_case.php1259DrupalWebTestCase->drupalLogin()
Failed to set field name to Otherscald.test544ScaldDnDTestCase->setUp()
Failed to set field pass to Otherscald.test544ScaldDnDTestCase->setUp()
Found the requested form fields at userOtherscald.test544ScaldDnDTestCase->setUp()
Trying to get property of non-objectNoticedrupal_web_test_case.php1265DrupalWebTestCase->drupalLogin()
User successfully logged in.User loginscald.test544ScaldDnDTestCase->setUp()
ExpandScald Localize (ScaldLocalizeTestCase) [Scald]428414
MessageGroupFilenameLineFunctionStatus
Enabled modules: scald_image, locale, i18n, i18n_string, scaldOtherscald.test20ScaldWebTestCase->setUp()
Invalid permission administer scald.Rolescald.test611ScaldLocalizeTestCase->setUp()
Invalid permission create atom of image type.Rolescald.test611ScaldLocalizeTestCase->setUp()
Invalid permission view any atom.Rolescald.test611ScaldLocalizeTestCase->setUp()
Invalid permission fetch any atom.Rolescald.test611ScaldLocalizeTestCase->setUp()
Invalid permission delete any atom.Rolescald.test611ScaldLocalizeTestCase->setUp()
Invalid permission edit own atom.Rolescald.test611ScaldLocalizeTestCase->setUp()
Invalid permission administer languages.Rolescald.test611ScaldLocalizeTestCase->setUp()
Invalid permission translate interface.Rolescald.test611ScaldLocalizeTestCase->setUp()
Invalid permission translate user-defined strings.Rolescald.test611ScaldLocalizeTestCase->setUp()
Argument 1 passed to DrupalWebTestCase::drupalLogin() must be an instance of stdClass, boolean given, called in /var/lib/drupaltestbot/sites/default/files/checkout/sites/default/modules/scald/tests/scald.test on line 612 and definedRecoverable errordrupal_web_test_case.php1252DrupalWebTestCase->drupalLogin()
Trying to get property of non-objectNoticedrupal_web_test_case.php1258DrupalWebTestCase->drupalLogin()
Trying to get property of non-objectNoticedrupal_web_test_case.php1259DrupalWebTestCase->drupalLogin()
Failed to set field name to Otherscald.test612ScaldLocalizeTestCase->setUp()
Failed to set field pass to Otherscald.test612ScaldLocalizeTestCase->setUp()
Found the requested form fields at userOtherscald.test612ScaldLocalizeTestCase->setUp()
Trying to get property of non-objectNoticedrupal_web_test_case.php1265DrupalWebTestCase->drupalLogin()
User successfully logged in.User loginscald.test612ScaldLocalizeTestCase->setUp()
Failed to set field langcode to frOtherscald.test616ScaldLocalizeTestCase->setUp()
Found the Add language buttonOtherscald.test616ScaldLocalizeTestCase->setUp()
Found the requested form fields at admin/config/regional/language/addOtherscald.test616ScaldLocalizeTestCase->setUp()
Failed to set field language[enabled][locale-url] to 1Otherscald.test620ScaldLocalizeTestCase->setUp()
Found the Save settings buttonOtherscald.test620ScaldLocalizeTestCase->setUp()
Found the requested form fields at admin/config/regional/language/configureOtherscald.test620ScaldLocalizeTestCase->setUp()
Failed to set field string to EditOtherscald.test634ScaldLocalizeTestCase->testStringTranslation()
Found the Filter buttonOtherscald.test634ScaldLocalizeTestCase->testStringTranslation()
Found the requested form fields at admin/config/regional/translate/translateOtherscald.test634ScaldLocalizeTestCase->testStringTranslation()
Link edit does not exist on http://ec2-54-148-9-230.us-west-2.compute.amazonaws.com/checkout/?q=admin/config/regional/translate/translateBrowserscald.test636ScaldLocalizeTestCase->testStringTranslation()
Failed to set field translations[fr] to ModifierOtherscald.test640ScaldLocalizeTestCase->testStringTranslation()
Found the Save translations buttonOtherscald.test640ScaldLocalizeTestCase->testStringTranslation()
Found the requested form fields at Otherscald.test640ScaldLocalizeTestCase->testStringTranslation()
PDOException: SQLSTATE[42S02]: Base table or view not found: 1146 Table 'drupaltestbotmysql.simpletest391265cache_scald' doesn't exist: TRUNCATE {cache_scald} ; Array ( ) in cache_clear_all() (line 167 of /var/lib/drupaltestbot/sites/default/files/checkout/includes/cache.inc).Uncaught exceptiondatabase.inc2171PDOStatement->execute()
Enabled modules: scald_image, locale, i18n, i18n_string, scaldOtherscald.test20ScaldWebTestCase->setUp()
Invalid permission administer scald.Rolescald.test611ScaldLocalizeTestCase->setUp()
Invalid permission create atom of image type.Rolescald.test611ScaldLocalizeTestCase->setUp()
Invalid permission view any atom.Rolescald.test611ScaldLocalizeTestCase->setUp()
Invalid permission fetch any atom.Rolescald.test611ScaldLocalizeTestCase->setUp()
Invalid permission delete any atom.Rolescald.test611ScaldLocalizeTestCase->setUp()
Invalid permission edit own atom.Rolescald.test611ScaldLocalizeTestCase->setUp()
Invalid permission administer languages.Rolescald.test611ScaldLocalizeTestCase->setUp()
Invalid permission translate interface.Rolescald.test611ScaldLocalizeTestCase->setUp()
Invalid permission translate user-defined strings.Rolescald.test611ScaldLocalizeTestCase->setUp()
Argument 1 passed to DrupalWebTestCase::drupalLogin() must be an instance of stdClass, boolean given, called in /var/lib/drupaltestbot/sites/default/files/checkout/sites/default/modules/scald/tests/scald.test on line 612 and definedRecoverable errordrupal_web_test_case.php1252DrupalWebTestCase->drupalLogin()
Trying to get property of non-objectNoticedrupal_web_test_case.php1258DrupalWebTestCase->drupalLogin()
Trying to get property of non-objectNoticedrupal_web_test_case.php1259DrupalWebTestCase->drupalLogin()
Failed to set field name to Otherscald.test612ScaldLocalizeTestCase->setUp()
Failed to set field pass to Otherscald.test612ScaldLocalizeTestCase->setUp()
Found the requested form fields at userOtherscald.test612ScaldLocalizeTestCase->setUp()
Trying to get property of non-objectNoticedrupal_web_test_case.php1265DrupalWebTestCase->drupalLogin()
User successfully logged in.User loginscald.test612ScaldLocalizeTestCase->setUp()
Failed to set field langcode to frOtherscald.test616ScaldLocalizeTestCase->setUp()
Found the Add language buttonOtherscald.test616ScaldLocalizeTestCase->setUp()
Found the requested form fields at admin/config/regional/language/addOtherscald.test616ScaldLocalizeTestCase->setUp()
Failed to set field language[enabled][locale-url] to 1Otherscald.test620ScaldLocalizeTestCase->setUp()
Found the Save settings buttonOtherscald.test620ScaldLocalizeTestCase->setUp()
Found the requested form fields at admin/config/regional/language/configureOtherscald.test620ScaldLocalizeTestCase->setUp()
The "translate" action is shown in the types table.Otherscald.test656ScaldLocalizeTestCase->testAtomTypeTranslation()
Failed to set field strings[scald:type:image:title] to L'imageOtherscald.test666ScaldLocalizeTestCase->testAtomTypeTranslation()
Failed to set field strings[scald:type:image:description] to Une représentation visuelleOtherscald.test666ScaldLocalizeTestCase->testAtomTypeTranslation()
Found the Save translation buttonOtherscald.test666ScaldLocalizeTestCase->testAtomTypeTranslation()
Found the requested form fields at admin/structure/scald/image/translate/frOtherscald.test666ScaldLocalizeTestCase->testAtomTypeTranslation()
The type is translated on the overview.Otherscald.test670ScaldLocalizeTestCase->testAtomTypeTranslation()
The type is translated on the Add Atom page.Otherscald.test674ScaldLocalizeTestCase->testAtomTypeTranslation()
The type is translated on the Add Image page.Otherscald.test678ScaldLocalizeTestCase->testAtomTypeTranslation()
Failed to set field files[file] to /var/lib/drupaltestbot/sites/default/files/checkout/sites/default/files/simpletest/989315/image-test.pngOtherscald.test720ScaldLocalizeTestCase->createAtom()
Found the Continue buttonOtherscald.test720ScaldLocalizeTestCase->createAtom()
Found the requested form fields at fr/atom/add/imageOtherscald.test720ScaldLocalizeTestCase->createAtom()
Found field with name 'atom0[title]' and value 'image-test.png'Browserscald.test721ScaldLocalizeTestCase->createAtom()
Failed to set field atom0[title] to Image o54erVqM1uHAakOcvEUZOtherscald.test729ScaldLocalizeTestCase->createAtom()
Failed to set field atom0[scald_authors][und] to lToQnUkeLXOtherscald.test729ScaldLocalizeTestCase->createAtom()
Found the Finish buttonOtherscald.test729ScaldLocalizeTestCase->createAtom()
Found the requested form fields at Otherscald.test729ScaldLocalizeTestCase->createAtom()
EntityFieldQueryException: Entity <em class="placeholder">scald_atom</em> has no base table. in EntityFieldQuery->propertyQuery() (line 1247 of /var/lib/drupaltestbot/sites/default/files/checkout/includes/entity.inc).Uncaught exceptionentity.inc1247EntityFieldQuery->propertyQuery()
The test did not complete due to a fatal error.Completion checkscald.test697ScaldLocalizeTestCase->testScaldTextGroup()
Enabled modules: scald_image, locale, i18n, i18n_string, scaldOtherscald.test20ScaldWebTestCase->setUp()
Invalid permission administer scald.Rolescald.test611ScaldLocalizeTestCase->setUp()
Invalid permission create atom of image type.Rolescald.test611ScaldLocalizeTestCase->setUp()
Invalid permission view any atom.Rolescald.test611ScaldLocalizeTestCase->setUp()
Invalid permission fetch any atom.Rolescald.test611ScaldLocalizeTestCase->setUp()
Invalid permission delete any atom.Rolescald.test611ScaldLocalizeTestCase->setUp()
Invalid permission edit own atom.Rolescald.test611ScaldLocalizeTestCase->setUp()
Invalid permission administer languages.Rolescald.test611ScaldLocalizeTestCase->setUp()
Invalid permission translate interface.Rolescald.test611ScaldLocalizeTestCase->setUp()
Invalid permission translate user-defined strings.Rolescald.test611ScaldLocalizeTestCase->setUp()
Argument 1 passed to DrupalWebTestCase::drupalLogin() must be an instance of stdClass, boolean given, called in /var/lib/drupaltestbot/sites/default/files/checkout/sites/default/modules/scald/tests/scald.test on line 612 and definedRecoverable errordrupal_web_test_case.php1252DrupalWebTestCase->drupalLogin()
Trying to get property of non-objectNoticedrupal_web_test_case.php1258DrupalWebTestCase->drupalLogin()
Trying to get property of non-objectNoticedrupal_web_test_case.php1259DrupalWebTestCase->drupalLogin()
Failed to set field name to Otherscald.test612ScaldLocalizeTestCase->setUp()
Failed to set field pass to Otherscald.test612ScaldLocalizeTestCase->setUp()
Found the requested form fields at userOtherscald.test612ScaldLocalizeTestCase->setUp()
Trying to get property of non-objectNoticedrupal_web_test_case.php1265DrupalWebTestCase->drupalLogin()
User successfully logged in.User loginscald.test612ScaldLocalizeTestCase->setUp()
Failed to set field langcode to frOtherscald.test616ScaldLocalizeTestCase->setUp()
Found the Add language buttonOtherscald.test616ScaldLocalizeTestCase->setUp()
Found the requested form fields at admin/config/regional/language/addOtherscald.test616ScaldLocalizeTestCase->setUp()
Failed to set field language[enabled][locale-url] to 1Otherscald.test620ScaldLocalizeTestCase->setUp()
Found the Save settings buttonOtherscald.test620ScaldLocalizeTestCase->setUp()
Found the requested form fields at admin/config/regional/language/configureOtherscald.test620ScaldLocalizeTestCase->setUp()