allow_multiple_local-2257033-6-test_only.patch

Test status
StatusResult
Last receivedFri, 09/11/2015 - 12:14:10
Last requestedFri, 09/11/2015 - 12:30:28
Last testedFri, 09/11/2015 - 12:33:35
Test count1
Environment status
PHP 5.5 MySQLfail
File information
Fileallow_multiple_local-2257033-6-test_only.patch
BranchTranslation Management Tool - 8.x-1.x
LinkIssue Link
SummaryFAILED: [[SimpleTest]]: [PHP 5.5 MySQL] 2,653 pass(es), 3 fail(s), and 1 exception(s).
Details

PHP 5.5 MySQL

  1. Setup environment
  2. Detect an invalid patch URL
  3. Detect invalid repository information
  4. Detect invalid patch format
  5. Detect a non-applicable patch
  6. Detect invalid PHP syntax
  7. Detect a Drupal installation failure
  8. Detect a test run failure
  9. Detect a failing test
    Review the test failures below then if necessary run them locally until the problem has been fixed.
  10. Complete test suite with all tests passing
2,653 pass(es), 3 fail(s), and 1 exception(s)

Non-pass

Test namePassFailException
ExpandDrupal\tmgmt\Tests\TranslatorTest11931
MessageGroupFilenameLineFunctionStatus
Drupal\Core\Config\Schema\SchemaIncompleteException: Schema errors for tmgmt.translator.test_translator with the following errors: tmgmt.translator.test_translator:settings.remote_languages_mappings missing schema in Drupal\Core\Config\Testing\ConfigSchemaChecker->onConfigSave() (line 98 of /var/lib/drupaltestbot/sites/default/files/checkout/core/lib/Drupal/Core/Config/Testing/ConfigSchemaChecker.php). Drupal\Core\Config\Testing\ConfigSchemaChecker->onConfigSave(Object, 'config.save', Object) Drupal\Component\EventDispatcher\ContainerAwareEventDispatcher->dispatch('config.save', Object) Drupal\Core\Config\Config->save() Drupal\Core\Config\Entity\ConfigEntityStorage->doSave('test_translator', Object) Drupal\Core\Entity\EntityStorageBase->save(Object) Drupal\Core\Config\Entity\ConfigEntityStorage->save(Object) Drupal\Core\Entity\Entity->save() Drupal\Core\Config\Entity\ConfigEntityBase->save() Drupal\tmgmt\Tests\TranslatorTest->testRemoteLanguagesMappings() Drupal\simpletest\TestBase->run(Array) simpletest_script_run_one_test('11', 'Drupal\tmgmt\Tests\TranslatorTest') Uncaught exceptionConfigSchemaChecker.php98Drupal\Core\Config\Testing\ConfigSchemaChecker->onConfigSave()
Mapping saved correctlyBrowserTranslatorTest.php142Drupal\tmgmt\Tests\TranslatorTest->testMultipleLocalToSingleRemoteMapping()
Translator maps correctlyOtherTranslatorTest.php151Drupal\tmgmt\Tests\TranslatorTest->testMultipleLocalToSingleRemoteMapping()
Translator maps correctlyOtherTranslatorTest.php160Drupal\tmgmt\Tests\TranslatorTest->testMultipleLocalToSingleRemoteMapping()

All

Test namePassFailException
LeafDrupal\tmgmt\Tests\CrudTest19900
LeafDrupal\tmgmt\Tests\HelperTest4300
LeafDrupal\tmgmt\Tests\LocalTasksTests3100
LeafDrupal\tmgmt\Tests\PluginsTest5000
LeafDrupal\tmgmt\Tests\TMGMTCartTest5200
LeafDrupal\tmgmt\Tests\TMGMTUiTest66400
ExpandDrupal\tmgmt\Tests\TranslatorTest11931
MessageGroupFilenameLineFunctionStatus
Drupal\Core\Config\Schema\SchemaIncompleteException: Schema errors for tmgmt.translator.test_translator with the following errors: tmgmt.translator.test_translator:settings.remote_languages_mappings missing schema in Drupal\Core\Config\Testing\ConfigSchemaChecker->onConfigSave() (line 98 of /var/lib/drupaltestbot/sites/default/files/checkout/core/lib/Drupal/Core/Config/Testing/ConfigSchemaChecker.php). Drupal\Core\Config\Testing\ConfigSchemaChecker->onConfigSave(Object, 'config.save', Object) Drupal\Component\EventDispatcher\ContainerAwareEventDispatcher->dispatch('config.save', Object) Drupal\Core\Config\Config->save() Drupal\Core\Config\Entity\ConfigEntityStorage->doSave('test_translator', Object) Drupal\Core\Entity\EntityStorageBase->save(Object) Drupal\Core\Config\Entity\ConfigEntityStorage->save(Object) Drupal\Core\Entity\Entity->save() Drupal\Core\Config\Entity\ConfigEntityBase->save() Drupal\tmgmt\Tests\TranslatorTest->testRemoteLanguagesMappings() Drupal\simpletest\TestBase->run(Array) simpletest_script_run_one_test('11', 'Drupal\tmgmt\Tests\TranslatorTest') Uncaught exceptionConfigSchemaChecker.php98Drupal\Core\Config\Testing\ConfigSchemaChecker->onConfigSave()
Mapping saved correctlyBrowserTranslatorTest.php142Drupal\tmgmt\Tests\TranslatorTest->testMultipleLocalToSingleRemoteMapping()
Translator maps correctlyOtherTranslatorTest.php151Drupal\tmgmt\Tests\TranslatorTest->testMultipleLocalToSingleRemoteMapping()
Translator maps correctlyOtherTranslatorTest.php160Drupal\tmgmt\Tests\TranslatorTest->testMultipleLocalToSingleRemoteMapping()
LeafDrupal\tmgmt\Tests\TranslatorUITest3000
LeafDrupal\tmgmt_config\Tests\ConfigSourceListTest24400
LeafDrupal\tmgmt_config\Tests\ConfigSourceUiTest24100
LeafDrupal\tmgmt_config\Tests\ConfigSourceUnitTest3900
LeafDrupal\tmgmt_content\Tests\ContentEntitySourceListTest16100
LeafDrupal\tmgmt_content\Tests\ContentEntitySourceUiTest28300
LeafDrupal\tmgmt_content\Tests\ContentEntitySourceUnitTest14600
LeafDrupal\tmgmt_content\Tests\ContentEntitySuggestionsTest2400
LeafDrupal\tmgmt_demo\Tests\TMGMTDemoTest4800
LeafDrupal\tmgmt_file\Tests\FileTranslatorTest16600
LeafDrupal\tmgmt_locale\Tests\LocaleSourceTest6300
LeafDrupal\tmgmt_locale\Tests\LocaleSourceUiTest5000