flag-node_links_support-2411977-6.patch

Test status
StatusResult
Last receivedThu, 09/10/2015 - 23:04:00
Last requestedSun, 09/13/2015 - 13:43:24
Last testedSun, 09/13/2015 - 13:44:04
Test count1
Environment status
PHP 5.5 MySQLfail
File information
Fileflag-node_links_support-2411977-6.patch
BranchFlag - 8.x-4.x
LinkIssue Link
SummaryFAILED: [[SimpleTest]]: [PHP 5.5 MySQL] 449 pass(es), 2 fail(s), and 3 exception(s).
Details

PHP 5.5 MySQL

  1. Setup environment
  2. Detect an invalid patch URL
  3. Detect invalid repository information
  4. Detect invalid patch format
  5. Detect a non-applicable patch
  6. Detect invalid PHP syntax
  7. Detect a Drupal installation failure
  8. Detect a test run failure
  9. Detect a failing test
    Review the test failures below then if necessary run them locally until the problem has been fixed.
  10. Complete test suite with all tests passing
449 pass(es), 2 fail(s), and 3 exception(s)

Non-pass

Test namePassFailException
ExpandDrupal\flag\Tests\FlagNodeLinksTest1423
MessageGroupFilenameLineFunctionStatus
Failed to set field flag_entity_type to flagtype_nodeOtherFlagNodeLinksTest.php111Drupal\flag\Tests\FlagNodeLinksTest->doCreateFlag()
Found the requested form fields at admin/structure/flags/addOtherFlagNodeLinksTest.php111Drupal\flag\Tests\FlagNodeLinksTest->doCreateFlag()
Undefined offset: 0Drupal\simpletest\WebTestBase->drupalPostAjaxForm(NULL, Array, 'link_type') Drupal\flag\Tests\FlagNodeLinksTest->doCreateFlag() Drupal\flag\Tests\FlagNodeLinksTest->testNodeLinks() Drupal\simpletest\TestBase->run(Array) simpletest_script_run_one_test('1', 'Drupal\flag\Tests\FlagNodeLinksTest') NoticeWebTestBase.php1872Drupal\simpletest\WebTestBase->drupalPostAjaxForm()
Undefined index: ajaxDrupal\simpletest\WebTestBase->drupalPostAjaxForm(NULL, Array, 'link_type') Drupal\flag\Tests\FlagNodeLinksTest->doCreateFlag() Drupal\flag\Tests\FlagNodeLinksTest->testNodeLinks() Drupal\simpletest\TestBase->run(Array) simpletest_script_run_one_test('1', 'Drupal\flag\Tests\FlagNodeLinksTest') NoticeWebTestBase.php1873Drupal\simpletest\WebTestBase->drupalPostAjaxForm()
Exception: No #ajax path specified. in Drupal\simpletest\WebTestBase->drupalPostAjaxForm() (line 1909 of /var/lib/drupaltestbot/sites/default/files/checkout/core/modules/simpletest/src/WebTestBase.php). Drupal\simpletest\WebTestBase->drupalPostAjaxForm(NULL, Array, 'link_type') Drupal\flag\Tests\FlagNodeLinksTest->doCreateFlag() Drupal\flag\Tests\FlagNodeLinksTest->testNodeLinks() Drupal\simpletest\TestBase->run(Array) simpletest_script_run_one_test('1', 'Drupal\flag\Tests\FlagNodeLinksTest') Uncaught exceptionWebTestBase.php1909Drupal\simpletest\WebTestBase->drupalPostAjaxForm()

All

Test namePassFailException
LeafDrupal\flag\Tests\FlagConfirmFormTest5900
LeafDrupal\flag\Tests\FlagCountsTest1000
LeafDrupal\flag\Tests\FlagEnableDisableTest5100
LeafDrupal\flag\Tests\FlagFieldEntryTest7700
ExpandDrupal\flag\Tests\FlagNodeLinksTest1423
MessageGroupFilenameLineFunctionStatus
Failed to set field flag_entity_type to flagtype_nodeOtherFlagNodeLinksTest.php111Drupal\flag\Tests\FlagNodeLinksTest->doCreateFlag()
Found the requested form fields at admin/structure/flags/addOtherFlagNodeLinksTest.php111Drupal\flag\Tests\FlagNodeLinksTest->doCreateFlag()
Undefined offset: 0Drupal\simpletest\WebTestBase->drupalPostAjaxForm(NULL, Array, 'link_type') Drupal\flag\Tests\FlagNodeLinksTest->doCreateFlag() Drupal\flag\Tests\FlagNodeLinksTest->testNodeLinks() Drupal\simpletest\TestBase->run(Array) simpletest_script_run_one_test('1', 'Drupal\flag\Tests\FlagNodeLinksTest') NoticeWebTestBase.php1872Drupal\simpletest\WebTestBase->drupalPostAjaxForm()
Undefined index: ajaxDrupal\simpletest\WebTestBase->drupalPostAjaxForm(NULL, Array, 'link_type') Drupal\flag\Tests\FlagNodeLinksTest->doCreateFlag() Drupal\flag\Tests\FlagNodeLinksTest->testNodeLinks() Drupal\simpletest\TestBase->run(Array) simpletest_script_run_one_test('1', 'Drupal\flag\Tests\FlagNodeLinksTest') NoticeWebTestBase.php1873Drupal\simpletest\WebTestBase->drupalPostAjaxForm()
Exception: No #ajax path specified. in Drupal\simpletest\WebTestBase->drupalPostAjaxForm() (line 1909 of /var/lib/drupaltestbot/sites/default/files/checkout/core/modules/simpletest/src/WebTestBase.php). Drupal\simpletest\WebTestBase->drupalPostAjaxForm(NULL, Array, 'link_type') Drupal\flag\Tests\FlagNodeLinksTest->doCreateFlag() Drupal\flag\Tests\FlagNodeLinksTest->testNodeLinks() Drupal\simpletest\TestBase->run(Array) simpletest_script_run_one_test('1', 'Drupal\flag\Tests\FlagNodeLinksTest') Uncaught exceptionWebTestBase.php1909Drupal\simpletest\WebTestBase->drupalPostAjaxForm()
LeafDrupal\flag\Tests\FlagResetTest1700
LeafDrupal\flag\Tests\FlagServiceTest1100
LeafDrupal\flag\Tests\FlagSimpleTest21000