2253831-12--start_tracking_batch.patch

Test status
StatusResult
Last receivedThu, 09/10/2015 - 16:48:00
Last requestedThu, 09/10/2015 - 19:55:23
Last testedThu, 09/10/2015 - 19:56:13
Test count1
Environment status
PHP 5.5 MySQLfail
File information
File2253831-12--start_tracking_batch.patch
BranchSearch API - 8.x-1.x
LinkIssue Link
SummaryFAILED: [[SimpleTest]]: [PHP 5.5 MySQL] 845 pass(es), 95 fail(s), and 62 exception(s).
Details

PHP 5.5 MySQL

  1. Setup environment
  2. Detect an invalid patch URL
  3. Detect invalid repository information
  4. Detect invalid patch format
  5. Detect a non-applicable patch
  6. Detect invalid PHP syntax
  7. Detect a Drupal installation failure
  8. Detect a test run failure
  9. Detect a failing test
    Review the test failures below then if necessary run them locally until the problem has been fixed.
  10. Complete test suite with all tests passing
845 pass(es), 95 fail(s), and 62 exception(s)

Non-pass

Test namePassFailException
ExpandDrupal\search_api\Tests\CustomDataTypesUnitTest1802
MessageGroupFilenameLineFunctionStatus
Illegal offset typeDrupal\Core\State\State->set(Array, Array) Drupal\search_api\Task\IndexTaskManager->startTracking(Object) Drupal\search_api\Entity\Index->postSave(Object, ) Drupal\Core\Entity\EntityStorageBase->doPostSave(Object, ) Drupal\Core\Entity\EntityStorageBase->save(Object) Drupal\Core\Config\Entity\ConfigEntityStorage->save(Object) Drupal\Core\Entity\Entity->save() Drupal\Core\Config\Entity\ConfigEntityBase->save() Drupal\Core\Config\ConfigInstaller->createConfiguration('', Array) Drupal\Core\Config\ConfigInstaller->installDefaultConfig('module', 'search_api_test_db') Drupal\Core\ProxyClass\Config\ConfigInstaller->installDefaultConfig('module', 'search_api_test_db') Drupal\simpletest\KernelTestBase->installConfig(Array) Drupal\search_api\Tests\CustomDataTypesUnitTest->setUp() Drupal\simpletest\TestBase->run(Array) simpletest_script_run_one_test('14', 'Drupal\search_api\Tests\CustomDataTypesUnitTest') WarningState.php88Drupal\Core\State\State->set()
Illegal offset typeDrupal\Core\KeyValueStore\MemoryStorage->set(Array, Array) Drupal\Core\State\State->set(Array, Array) Drupal\search_api\Task\IndexTaskManager->startTracking(Object) Drupal\search_api\Entity\Index->postSave(Object, ) Drupal\Core\Entity\EntityStorageBase->doPostSave(Object, ) Drupal\Core\Entity\EntityStorageBase->save(Object) Drupal\Core\Config\Entity\ConfigEntityStorage->save(Object) Drupal\Core\Entity\Entity->save() Drupal\Core\Config\Entity\ConfigEntityBase->save() Drupal\Core\Config\ConfigInstaller->createConfiguration('', Array) Drupal\Core\Config\ConfigInstaller->installDefaultConfig('module', 'search_api_test_db') Drupal\Core\ProxyClass\Config\ConfigInstaller->installDefaultConfig('module', 'search_api_test_db') Drupal\simpletest\KernelTestBase->installConfig(Array) Drupal\search_api\Tests\CustomDataTypesUnitTest->setUp() Drupal\simpletest\TestBase->run(Array) simpletest_script_run_one_test('14', 'Drupal\search_api\Tests\CustomDataTypesUnitTest') WarningMemoryStorage.php54Drupal\Core\KeyValueStore\MemoryStorage->set()
ExpandDrupal\search_api\Tests\IntegrationTest209164
MessageGroupFilenameLineFunctionStatus
Illegal offset typeWarningState.php88Drupal\Core\State\State->set()
"The index was successfully saved." foundOtherIntegrationTest.php149Drupal\search_api\Tests\IntegrationTest->createIndex()
Correct redirect to index page.OtherIntegrationTest.php150Drupal\search_api\Tests\IntegrationTest->createIndex()
Three items are tracked.OtherIntegrationTest.php196Drupal\search_api\Tests\IntegrationTest->checkContentEntityTracking()
Illegal offset typeWarningState.php88Drupal\Core\State\State->set()
Three items are tracked.OtherIntegrationTest.php224Drupal\search_api\Tests\IntegrationTest->checkContentEntityTracking()
Two items are tracked.OtherIntegrationTest.php250Drupal\search_api\Tests\IntegrationTest->checkContentEntityTracking()
One item is tracked.OtherIntegrationTest.php263Drupal\search_api\Tests\IntegrationTest->checkContentEntityTracking()
One item is tracked.OtherIntegrationTest.php276Drupal\search_api\Tests\IntegrationTest->checkContentEntityTracking()
Two items are tracked.OtherIntegrationTest.php289Drupal\search_api\Tests\IntegrationTest->checkContentEntityTracking()
One item is tracked.OtherIntegrationTest.php295Drupal\search_api\Tests\IntegrationTest->checkContentEntityTracking()
Found the Index now buttonOtherIntegrationTest.php463Drupal\search_api\Tests\IntegrationTest->setReadOnly()
Found the requested form fields at admin/config/search/search-api/index/test_indexOtherIntegrationTest.php463Drupal\search_api\Tests\IntegrationTest->setReadOnly()
Illegal offset typeWarningState.php88Drupal\Core\State\State->set()
After enabling the index, 2 items are tracked.OtherIntegrationTest.php500Drupal\search_api\Tests\IntegrationTest->disableEnableIndex()
Illegal offset typeWarningState.php88Drupal\Core\State\State->set()
Correct number of items tracked after enabling the "User" datasource.OtherIntegrationTest.php526Drupal\search_api\Tests\IntegrationTest->changeIndexDatasource()
Correct number of items tracked after disabling the "User" datasource.OtherIntegrationTest.php535Drupal\search_api\Tests\IntegrationTest->changeIndexDatasource()
All nodes are correctly tracked by the index.OtherIntegrationTest.php550Drupal\search_api\Tests\IntegrationTest->changeIndexServer()
All items still need to be indexed.OtherIntegrationTest.php570Drupal\search_api\Tests\IntegrationTest->changeIndexServer()
ExpandDrupal\search_api\Tests\LanguageIntegrationUnitTest2692
MessageGroupFilenameLineFunctionStatus
Illegal offset typeDrupal\Core\State\State->set(Array, Array) Drupal\search_api\Task\IndexTaskManager->startTracking(Object) Drupal\search_api\Entity\Index->postSave(Object, ) Drupal\Core\Entity\EntityStorageBase->doPostSave(Object, ) Drupal\Core\Entity\EntityStorageBase->save(Object) Drupal\Core\Config\Entity\ConfigEntityStorage->save(Object) Drupal\Core\Entity\Entity->save() Drupal\Core\Config\Entity\ConfigEntityBase->save() Drupal\search_api\Tests\LanguageIntegrationUnitTest->setUp() Drupal\simpletest\TestBase->run(Array) simpletest_script_run_one_test('11', 'Drupal\search_api\Tests\LanguageIntegrationUnitTest') WarningState.php88Drupal\Core\State\State->set()
Illegal offset typeDrupal\Core\KeyValueStore\MemoryStorage->set(Array, Array) Drupal\Core\State\State->set(Array, Array) Drupal\search_api\Task\IndexTaskManager->startTracking(Object) Drupal\search_api\Entity\Index->postSave(Object, ) Drupal\Core\Entity\EntityStorageBase->doPostSave(Object, ) Drupal\Core\Entity\EntityStorageBase->save(Object) Drupal\Core\Config\Entity\ConfigEntityStorage->save(Object) Drupal\Core\Entity\Entity->save() Drupal\Core\Config\Entity\ConfigEntityBase->save() Drupal\search_api\Tests\LanguageIntegrationUnitTest->setUp() Drupal\simpletest\TestBase->run(Array) simpletest_script_run_one_test('11', 'Drupal\search_api\Tests\LanguageIntegrationUnitTest') WarningMemoryStorage.php54Drupal\Core\KeyValueStore\MemoryStorage->set()
There are two items to be indexed.OtherLanguageIntegrationUnitTest.php117Drupal\search_api\Tests\LanguageIntegrationUnitTest->testItemTranslations()
Two items have been indexed.OtherLanguageIntegrationUnitTest.php119Drupal\search_api\Tests\LanguageIntegrationUnitTest->testItemTranslations()
The updated item needs to be reindexed.OtherLanguageIntegrationUnitTest.php138Drupal\search_api\Tests\LanguageIntegrationUnitTest->testItemTranslations()
There are two items in total.OtherLanguageIntegrationUnitTest.php139Drupal\search_api\Tests\LanguageIntegrationUnitTest->testItemTranslations()
The updated items needs to be reindexed.OtherLanguageIntegrationUnitTest.php160Drupal\search_api\Tests\LanguageIntegrationUnitTest->testItemTranslations()
There are four items in total.OtherLanguageIntegrationUnitTest.php161Drupal\search_api\Tests\LanguageIntegrationUnitTest->testItemTranslations()
There are three items in total.OtherLanguageIntegrationUnitTest.php178Drupal\search_api\Tests\LanguageIntegrationUnitTest->testItemTranslations()
The updated items needs to be reindexed.OtherLanguageIntegrationUnitTest.php179Drupal\search_api\Tests\LanguageIntegrationUnitTest->testItemTranslations()
Three items are indexed.OtherLanguageIntegrationUnitTest.php181Drupal\search_api\Tests\LanguageIntegrationUnitTest->testItemTranslations()
ExpandDrupal\search_api\Tests\OverviewPageTest7504
MessageGroupFilenameLineFunctionStatus
Illegal offset typeDrupal\Core\State\State->set(Array, Array) Drupal\search_api\Task\IndexTaskManager->startTracking(Object) Drupal\search_api\Entity\Index->postSave(Object, ) Drupal\Core\Entity\EntityStorageBase->doPostSave(Object, ) Drupal\Core\Entity\EntityStorageBase->save(Object) Drupal\Core\Config\Entity\ConfigEntityStorage->save(Object) Drupal\Core\Entity\Entity->save() Drupal\Core\Config\Entity\ConfigEntityBase->save() Drupal\search_api\Tests\WebTestBase->getTestIndex() Drupal\search_api\Tests\OverviewPageTest->testServerAndIndexCreation() Drupal\simpletest\TestBase->run(Array) simpletest_script_run_one_test('9', 'Drupal\search_api\Tests\OverviewPageTest') WarningState.php88Drupal\Core\State\State->set()
InvalidArgumentException: Placeholders must have a trailing [] if they are to be expanded with an array of values. in Drupal\Core\Database\Connection->expandArguments() (line 701 of /var/lib/drupaltestbot/sites/default/files/checkout/core/lib/Drupal/Core/Database/Connection.php). Drupal\Core\Database\Connection->expandArguments('SELECT 1 AS expression FROM {key_value} key_value WHERE ( (name = :db_condition_placeholder_0:db_condition_placeholder_1) AND (collection = :db_condition_placeholder_2) )', Array) Drupal\Core\Database\Connection->query('SELECT 1 AS expression FROM {key_value} key_value WHERE ( (name = :db_condition_placeholder_0:db_condition_placeholder_1) AND (collection = :db_condition_placeholder_2) )', Array, Array) Drupal\Core\Database\Driver\mysql\Connection->query('SELECT 1 AS expression FROM {key_value} key_value WHERE ( (name = :db_condition_placeholder_0:db_condition_placeholder_1) AND (collection = :db_condition_placeholder_2) )', Array, Array) Drupal\Core\Database\Query\Select->execute() Drupal\Core\Database\Query\Merge->execute() Drupal\Core\KeyValueStore\DatabaseStorage->set(Array, Array) Drupal\Core\State\State->set(Array, Array) Drupal\search_api\Task\IndexTaskManager->startTracking(Object) Drupal\search_api\Entity\Index->postSave(Object, ) Drupal\Core\Entity\EntityStorageBase->doPostSave(Object, ) Drupal\Core\Entity\EntityStorageBase->save(Object) Drupal\Core\Config\Entity\ConfigEntityStorage->save(Object) Drupal\Core\Entity\Entity->save() Drupal\Core\Config\Entity\ConfigEntityBase->save() Drupal\search_api\Tests\WebTestBase->getTestIndex() Drupal\search_api\Tests\OverviewPageTest->testServerAndIndexCreation() Drupal\simpletest\TestBase->run(Array) simpletest_script_run_one_test('9', 'Drupal\search_api\Tests\OverviewPageTest') Uncaught exceptionConnection.php701Drupal\Core\Database\Connection->expandArguments()
Illegal offset typeDrupal\Core\State\State->set(Array, Array) Drupal\search_api\Task\IndexTaskManager->startTracking(Object) Drupal\search_api\Entity\Index->postSave(Object, ) Drupal\Core\Entity\EntityStorageBase->doPostSave(Object, ) Drupal\Core\Entity\EntityStorageBase->save(Object) Drupal\Core\Config\Entity\ConfigEntityStorage->save(Object) Drupal\Core\Entity\Entity->save() Drupal\Core\Config\Entity\ConfigEntityBase->save() Drupal\search_api\Tests\WebTestBase->getTestIndex() Drupal\search_api\Tests\OverviewPageTest->testServerAndIndexStatusChanges() Drupal\simpletest\TestBase->run(Array) simpletest_script_run_one_test('9', 'Drupal\search_api\Tests\OverviewPageTest') WarningState.php88Drupal\Core\State\State->set()
InvalidArgumentException: Placeholders must have a trailing [] if they are to be expanded with an array of values. in Drupal\Core\Database\Connection->expandArguments() (line 701 of /var/lib/drupaltestbot/sites/default/files/checkout/core/lib/Drupal/Core/Database/Connection.php). Drupal\Core\Database\Connection->expandArguments('SELECT 1 AS expression FROM {key_value} key_value WHERE ( (name = :db_condition_placeholder_0:db_condition_placeholder_1) AND (collection = :db_condition_placeholder_2) )', Array) Drupal\Core\Database\Connection->query('SELECT 1 AS expression FROM {key_value} key_value WHERE ( (name = :db_condition_placeholder_0:db_condition_placeholder_1) AND (collection = :db_condition_placeholder_2) )', Array, Array) Drupal\Core\Database\Driver\mysql\Connection->query('SELECT 1 AS expression FROM {key_value} key_value WHERE ( (name = :db_condition_placeholder_0:db_condition_placeholder_1) AND (collection = :db_condition_placeholder_2) )', Array, Array) Drupal\Core\Database\Query\Select->execute() Drupal\Core\Database\Query\Merge->execute() Drupal\Core\KeyValueStore\DatabaseStorage->set(Array, Array) Drupal\Core\State\State->set(Array, Array) Drupal\search_api\Task\IndexTaskManager->startTracking(Object) Drupal\search_api\Entity\Index->postSave(Object, ) Drupal\Core\Entity\EntityStorageBase->doPostSave(Object, ) Drupal\Core\Entity\EntityStorageBase->save(Object) Drupal\Core\Config\Entity\ConfigEntityStorage->save(Object) Drupal\Core\Entity\Entity->save() Drupal\Core\Config\Entity\ConfigEntityBase->save() Drupal\search_api\Tests\WebTestBase->getTestIndex() Drupal\search_api\Tests\OverviewPageTest->testServerAndIndexStatusChanges() Drupal\simpletest\TestBase->run(Array) simpletest_script_run_one_test('9', 'Drupal\search_api\Tests\OverviewPageTest') Uncaught exceptionConnection.php701Drupal\Core\Database\Connection->expandArguments()
ExpandDrupal\search_api\Tests\Processor\ContentAccessTest68424
MessageGroupFilenameLineFunctionStatus
Illegal offset typeDrupal\Core\State\State->set(Array, Array) Drupal\search_api\Task\IndexTaskManager->startTracking(Object) Drupal\search_api\Entity\Index->postSave(Object, ) Drupal\Core\Entity\EntityStorageBase->doPostSave(Object, ) Drupal\Core\Entity\EntityStorageBase->save(Object) Drupal\Core\Config\Entity\ConfigEntityStorage->save(Object) Drupal\Core\Entity\Entity->save() Drupal\Core\Config\Entity\ConfigEntityBase->save() Drupal\search_api\Tests\Processor\ProcessorTestBase->setUp('content_access') Drupal\search_api\Tests\Processor\ContentAccessTest->setUp() Drupal\simpletest\TestBase->run(Array) simpletest_script_run_one_test('5', 'Drupal\search_api\Tests\Processor\ContentAccessTest') WarningState.php88Drupal\Core\State\State->set()
Illegal offset typeDrupal\Core\KeyValueStore\MemoryStorage->set(Array, Array) Drupal\Core\State\State->set(Array, Array) Drupal\search_api\Task\IndexTaskManager->startTracking(Object) Drupal\search_api\Entity\Index->postSave(Object, ) Drupal\Core\Entity\EntityStorageBase->doPostSave(Object, ) Drupal\Core\Entity\EntityStorageBase->save(Object) Drupal\Core\Config\Entity\ConfigEntityStorage->save(Object) Drupal\Core\Entity\Entity->save() Drupal\Core\Config\Entity\ConfigEntityBase->save() Drupal\search_api\Tests\Processor\ProcessorTestBase->setUp('content_access') Drupal\search_api\Tests\Processor\ContentAccessTest->setUp() Drupal\simpletest\TestBase->run(Array) simpletest_script_run_one_test('5', 'Drupal\search_api\Tests\Processor\ContentAccessTest') WarningMemoryStorage.php54Drupal\Core\KeyValueStore\MemoryStorage->set()
Illegal offset typeDrupal\Core\State\State->set(Array, Array) Drupal\search_api\Task\IndexTaskManager->startTracking(Object, Array) Drupal\search_api\Entity\Index->reactToDatasourceSwitch(Object) Drupal\search_api\Entity\Index->postSave(Object, 1) Drupal\Core\Entity\EntityStorageBase->doPostSave(Object, 1) Drupal\Core\Entity\EntityStorageBase->save(Object) Drupal\Core\Config\Entity\ConfigEntityStorage->save(Object) Drupal\Core\Entity\Entity->save() Drupal\Core\Config\Entity\ConfigEntityBase->save() Drupal\search_api\Tests\Processor\ContentAccessTest->setUp() Drupal\simpletest\TestBase->run(Array) simpletest_script_run_one_test('5', 'Drupal\search_api\Tests\Processor\ContentAccessTest') WarningState.php88Drupal\Core\State\State->set()
Illegal offset typeDrupal\Core\KeyValueStore\MemoryStorage->set(Array, Array) Drupal\Core\State\State->set(Array, Array) Drupal\search_api\Task\IndexTaskManager->startTracking(Object, Array) Drupal\search_api\Entity\Index->reactToDatasourceSwitch(Object) Drupal\search_api\Entity\Index->postSave(Object, 1) Drupal\Core\Entity\EntityStorageBase->doPostSave(Object, 1) Drupal\Core\Entity\EntityStorageBase->save(Object) Drupal\Core\Config\Entity\ConfigEntityStorage->save(Object) Drupal\Core\Entity\Entity->save() Drupal\Core\Config\Entity\ConfigEntityBase->save() Drupal\search_api\Tests\Processor\ContentAccessTest->setUp() Drupal\simpletest\TestBase->run(Array) simpletest_script_run_one_test('5', 'Drupal\search_api\Tests\Processor\ContentAccessTest') WarningMemoryStorage.php54Drupal\Core\KeyValueStore\MemoryStorage->set()
Value array ( ) is equal to value array ( 0 => 'entity:comment/1:en', 1 => 'entity:node/1:en', 2 => 'entity:node/2:en', 3 => 'entity:user/0:en', ).OtherContentAccessTest.php128Drupal\search_api\Tests\Processor\ContentAccessTest->testQueryAccessAll()
Illegal offset typeDrupal\Core\State\State->set(Array, Array) Drupal\search_api\Task\IndexTaskManager->startTracking(Object) Drupal\search_api\Entity\Index->postSave(Object, ) Drupal\Core\Entity\EntityStorageBase->doPostSave(Object, ) Drupal\Core\Entity\EntityStorageBase->save(Object) Drupal\Core\Config\Entity\ConfigEntityStorage->save(Object) Drupal\Core\Entity\Entity->save() Drupal\Core\Config\Entity\ConfigEntityBase->save() Drupal\search_api\Tests\Processor\ProcessorTestBase->setUp('content_access') Drupal\search_api\Tests\Processor\ContentAccessTest->setUp() Drupal\simpletest\TestBase->run(Array) simpletest_script_run_one_test('5', 'Drupal\search_api\Tests\Processor\ContentAccessTest') WarningState.php88Drupal\Core\State\State->set()
Illegal offset typeDrupal\Core\KeyValueStore\MemoryStorage->set(Array, Array) Drupal\Core\State\State->set(Array, Array) Drupal\search_api\Task\IndexTaskManager->startTracking(Object) Drupal\search_api\Entity\Index->postSave(Object, ) Drupal\Core\Entity\EntityStorageBase->doPostSave(Object, ) Drupal\Core\Entity\EntityStorageBase->save(Object) Drupal\Core\Config\Entity\ConfigEntityStorage->save(Object) Drupal\Core\Entity\Entity->save() Drupal\Core\Config\Entity\ConfigEntityBase->save() Drupal\search_api\Tests\Processor\ProcessorTestBase->setUp('content_access') Drupal\search_api\Tests\Processor\ContentAccessTest->setUp() Drupal\simpletest\TestBase->run(Array) simpletest_script_run_one_test('5', 'Drupal\search_api\Tests\Processor\ContentAccessTest') WarningMemoryStorage.php54Drupal\Core\KeyValueStore\MemoryStorage->set()
Illegal offset typeDrupal\Core\State\State->set(Array, Array) Drupal\search_api\Task\IndexTaskManager->startTracking(Object, Array) Drupal\search_api\Entity\Index->reactToDatasourceSwitch(Object) Drupal\search_api\Entity\Index->postSave(Object, 1) Drupal\Core\Entity\EntityStorageBase->doPostSave(Object, 1) Drupal\Core\Entity\EntityStorageBase->save(Object) Drupal\Core\Config\Entity\ConfigEntityStorage->save(Object) Drupal\Core\Entity\Entity->save() Drupal\Core\Config\Entity\ConfigEntityBase->save() Drupal\search_api\Tests\Processor\ContentAccessTest->setUp() Drupal\simpletest\TestBase->run(Array) simpletest_script_run_one_test('5', 'Drupal\search_api\Tests\Processor\ContentAccessTest') WarningState.php88Drupal\Core\State\State->set()
Illegal offset typeDrupal\Core\KeyValueStore\MemoryStorage->set(Array, Array) Drupal\Core\State\State->set(Array, Array) Drupal\search_api\Task\IndexTaskManager->startTracking(Object, Array) Drupal\search_api\Entity\Index->reactToDatasourceSwitch(Object) Drupal\search_api\Entity\Index->postSave(Object, 1) Drupal\Core\Entity\EntityStorageBase->doPostSave(Object, 1) Drupal\Core\Entity\EntityStorageBase->save(Object) Drupal\Core\Config\Entity\ConfigEntityStorage->save(Object) Drupal\Core\Entity\Entity->save() Drupal\Core\Config\Entity\ConfigEntityBase->save() Drupal\search_api\Tests\Processor\ContentAccessTest->setUp() Drupal\simpletest\TestBase->run(Array) simpletest_script_run_one_test('5', 'Drupal\search_api\Tests\Processor\ContentAccessTest') WarningMemoryStorage.php54Drupal\Core\KeyValueStore\MemoryStorage->set()
Value array ( ) is equal to value array ( 0 => 'entity:comment/1:en', 1 => 'entity:user/0:en', ).OtherContentAccessTest.php141Drupal\search_api\Tests\Processor\ContentAccessTest->testQueryAccessComments()
Illegal offset typeDrupal\Core\State\State->set(Array, Array) Drupal\search_api\Task\IndexTaskManager->startTracking(Object) Drupal\search_api\Entity\Index->postSave(Object, ) Drupal\Core\Entity\EntityStorageBase->doPostSave(Object, ) Drupal\Core\Entity\EntityStorageBase->save(Object) Drupal\Core\Config\Entity\ConfigEntityStorage->save(Object) Drupal\Core\Entity\Entity->save() Drupal\Core\Config\Entity\ConfigEntityBase->save() Drupal\search_api\Tests\Processor\ProcessorTestBase->setUp('content_access') Drupal\search_api\Tests\Processor\ContentAccessTest->setUp() Drupal\simpletest\TestBase->run(Array) simpletest_script_run_one_test('5', 'Drupal\search_api\Tests\Processor\ContentAccessTest') WarningState.php88Drupal\Core\State\State->set()
Illegal offset typeDrupal\Core\KeyValueStore\MemoryStorage->set(Array, Array) Drupal\Core\State\State->set(Array, Array) Drupal\search_api\Task\IndexTaskManager->startTracking(Object) Drupal\search_api\Entity\Index->postSave(Object, ) Drupal\Core\Entity\EntityStorageBase->doPostSave(Object, ) Drupal\Core\Entity\EntityStorageBase->save(Object) Drupal\Core\Config\Entity\ConfigEntityStorage->save(Object) Drupal\Core\Entity\Entity->save() Drupal\Core\Config\Entity\ConfigEntityBase->save() Drupal\search_api\Tests\Processor\ProcessorTestBase->setUp('content_access') Drupal\search_api\Tests\Processor\ContentAccessTest->setUp() Drupal\simpletest\TestBase->run(Array) simpletest_script_run_one_test('5', 'Drupal\search_api\Tests\Processor\ContentAccessTest') WarningMemoryStorage.php54Drupal\Core\KeyValueStore\MemoryStorage->set()
Illegal offset typeDrupal\Core\State\State->set(Array, Array) Drupal\search_api\Task\IndexTaskManager->startTracking(Object, Array) Drupal\search_api\Entity\Index->reactToDatasourceSwitch(Object) Drupal\search_api\Entity\Index->postSave(Object, 1) Drupal\Core\Entity\EntityStorageBase->doPostSave(Object, 1) Drupal\Core\Entity\EntityStorageBase->save(Object) Drupal\Core\Config\Entity\ConfigEntityStorage->save(Object) Drupal\Core\Entity\Entity->save() Drupal\Core\Config\Entity\ConfigEntityBase->save() Drupal\search_api\Tests\Processor\ContentAccessTest->setUp() Drupal\simpletest\TestBase->run(Array) simpletest_script_run_one_test('5', 'Drupal\search_api\Tests\Processor\ContentAccessTest') WarningState.php88Drupal\Core\State\State->set()
Illegal offset typeDrupal\Core\KeyValueStore\MemoryStorage->set(Array, Array) Drupal\Core\State\State->set(Array, Array) Drupal\search_api\Task\IndexTaskManager->startTracking(Object, Array) Drupal\search_api\Entity\Index->reactToDatasourceSwitch(Object) Drupal\search_api\Entity\Index->postSave(Object, 1) Drupal\Core\Entity\EntityStorageBase->doPostSave(Object, 1) Drupal\Core\Entity\EntityStorageBase->save(Object) Drupal\Core\Config\Entity\ConfigEntityStorage->save(Object) Drupal\Core\Entity\Entity->save() Drupal\Core\Config\Entity\ConfigEntityBase->save() Drupal\search_api\Tests\Processor\ContentAccessTest->setUp() Drupal\simpletest\TestBase->run(Array) simpletest_script_run_one_test('5', 'Drupal\search_api\Tests\Processor\ContentAccessTest') WarningMemoryStorage.php54Drupal\Core\KeyValueStore\MemoryStorage->set()
Value array ( ) is equal to value array ( 0 => 'entity:node/4:en', 1 => 'entity:user/0:en', 2 => 'entity:user/2:en', ).OtherContentAccessTest.php159Drupal\search_api\Tests\Processor\ContentAccessTest->testQueryAccessOwn()
Illegal offset typeDrupal\Core\State\State->set(Array, Array) Drupal\search_api\Task\IndexTaskManager->startTracking(Object) Drupal\search_api\Entity\Index->postSave(Object, ) Drupal\Core\Entity\EntityStorageBase->doPostSave(Object, ) Drupal\Core\Entity\EntityStorageBase->save(Object) Drupal\Core\Config\Entity\ConfigEntityStorage->save(Object) Drupal\Core\Entity\Entity->save() Drupal\Core\Config\Entity\ConfigEntityBase->save() Drupal\search_api\Tests\Processor\ProcessorTestBase->setUp('content_access') Drupal\search_api\Tests\Processor\ContentAccessTest->setUp() Drupal\simpletest\TestBase->run(Array) simpletest_script_run_one_test('5', 'Drupal\search_api\Tests\Processor\ContentAccessTest') WarningState.php88Drupal\Core\State\State->set()
Illegal offset typeDrupal\Core\KeyValueStore\MemoryStorage->set(Array, Array) Drupal\Core\State\State->set(Array, Array) Drupal\search_api\Task\IndexTaskManager->startTracking(Object) Drupal\search_api\Entity\Index->postSave(Object, ) Drupal\Core\Entity\EntityStorageBase->doPostSave(Object, ) Drupal\Core\Entity\EntityStorageBase->save(Object) Drupal\Core\Config\Entity\ConfigEntityStorage->save(Object) Drupal\Core\Entity\Entity->save() Drupal\Core\Config\Entity\ConfigEntityBase->save() Drupal\search_api\Tests\Processor\ProcessorTestBase->setUp('content_access') Drupal\search_api\Tests\Processor\ContentAccessTest->setUp() Drupal\simpletest\TestBase->run(Array) simpletest_script_run_one_test('5', 'Drupal\search_api\Tests\Processor\ContentAccessTest') WarningMemoryStorage.php54Drupal\Core\KeyValueStore\MemoryStorage->set()
Illegal offset typeDrupal\Core\State\State->set(Array, Array) Drupal\search_api\Task\IndexTaskManager->startTracking(Object, Array) Drupal\search_api\Entity\Index->reactToDatasourceSwitch(Object) Drupal\search_api\Entity\Index->postSave(Object, 1) Drupal\Core\Entity\EntityStorageBase->doPostSave(Object, 1) Drupal\Core\Entity\EntityStorageBase->save(Object) Drupal\Core\Config\Entity\ConfigEntityStorage->save(Object) Drupal\Core\Entity\Entity->save() Drupal\Core\Config\Entity\ConfigEntityBase->save() Drupal\search_api\Tests\Processor\ContentAccessTest->setUp() Drupal\simpletest\TestBase->run(Array) simpletest_script_run_one_test('5', 'Drupal\search_api\Tests\Processor\ContentAccessTest') WarningState.php88Drupal\Core\State\State->set()
Illegal offset typeDrupal\Core\KeyValueStore\MemoryStorage->set(Array, Array) Drupal\Core\State\State->set(Array, Array) Drupal\search_api\Task\IndexTaskManager->startTracking(Object, Array) Drupal\search_api\Entity\Index->reactToDatasourceSwitch(Object) Drupal\search_api\Entity\Index->postSave(Object, 1) Drupal\Core\Entity\EntityStorageBase->doPostSave(Object, 1) Drupal\Core\Entity\EntityStorageBase->save(Object) Drupal\Core\Config\Entity\ConfigEntityStorage->save(Object) Drupal\Core\Entity\Entity->save() Drupal\Core\Config\Entity\ConfigEntityBase->save() Drupal\search_api\Tests\Processor\ContentAccessTest->setUp() Drupal\simpletest\TestBase->run(Array) simpletest_script_run_one_test('5', 'Drupal\search_api\Tests\Processor\ContentAccessTest') WarningMemoryStorage.php54Drupal\Core\KeyValueStore\MemoryStorage->set()
Value array ( ) is equal to value array ( 0 => 'entity:node/1:en', 1 => 'entity:user/0:en', 2 => 'entity:user/2:en', ).OtherContentAccessTest.php185Drupal\search_api\Tests\Processor\ContentAccessTest->testQueryAccessWithNodeGrants()
Illegal offset typeDrupal\Core\State\State->set(Array, Array) Drupal\search_api\Task\IndexTaskManager->startTracking(Object) Drupal\search_api\Entity\Index->postSave(Object, ) Drupal\Core\Entity\EntityStorageBase->doPostSave(Object, ) Drupal\Core\Entity\EntityStorageBase->save(Object) Drupal\Core\Config\Entity\ConfigEntityStorage->save(Object) Drupal\Core\Entity\Entity->save() Drupal\Core\Config\Entity\ConfigEntityBase->save() Drupal\search_api\Tests\Processor\ProcessorTestBase->setUp('content_access') Drupal\search_api\Tests\Processor\ContentAccessTest->setUp() Drupal\simpletest\TestBase->run(Array) simpletest_script_run_one_test('5', 'Drupal\search_api\Tests\Processor\ContentAccessTest') WarningState.php88Drupal\Core\State\State->set()
Illegal offset typeDrupal\Core\KeyValueStore\MemoryStorage->set(Array, Array) Drupal\Core\State\State->set(Array, Array) Drupal\search_api\Task\IndexTaskManager->startTracking(Object) Drupal\search_api\Entity\Index->postSave(Object, ) Drupal\Core\Entity\EntityStorageBase->doPostSave(Object, ) Drupal\Core\Entity\EntityStorageBase->save(Object) Drupal\Core\Config\Entity\ConfigEntityStorage->save(Object) Drupal\Core\Entity\Entity->save() Drupal\Core\Config\Entity\ConfigEntityBase->save() Drupal\search_api\Tests\Processor\ProcessorTestBase->setUp('content_access') Drupal\search_api\Tests\Processor\ContentAccessTest->setUp() Drupal\simpletest\TestBase->run(Array) simpletest_script_run_one_test('5', 'Drupal\search_api\Tests\Processor\ContentAccessTest') WarningMemoryStorage.php54Drupal\Core\KeyValueStore\MemoryStorage->set()
Illegal offset typeDrupal\Core\State\State->set(Array, Array) Drupal\search_api\Task\IndexTaskManager->startTracking(Object, Array) Drupal\search_api\Entity\Index->reactToDatasourceSwitch(Object) Drupal\search_api\Entity\Index->postSave(Object, 1) Drupal\Core\Entity\EntityStorageBase->doPostSave(Object, 1) Drupal\Core\Entity\EntityStorageBase->save(Object) Drupal\Core\Config\Entity\ConfigEntityStorage->save(Object) Drupal\Core\Entity\Entity->save() Drupal\Core\Config\Entity\ConfigEntityBase->save() Drupal\search_api\Tests\Processor\ContentAccessTest->setUp() Drupal\simpletest\TestBase->run(Array) simpletest_script_run_one_test('5', 'Drupal\search_api\Tests\Processor\ContentAccessTest') WarningState.php88Drupal\Core\State\State->set()
Illegal offset typeDrupal\Core\KeyValueStore\MemoryStorage->set(Array, Array) Drupal\Core\State\State->set(Array, Array) Drupal\search_api\Task\IndexTaskManager->startTracking(Object, Array) Drupal\search_api\Entity\Index->reactToDatasourceSwitch(Object) Drupal\search_api\Entity\Index->postSave(Object, 1) Drupal\Core\Entity\EntityStorageBase->doPostSave(Object, 1) Drupal\Core\Entity\EntityStorageBase->save(Object) Drupal\Core\Config\Entity\ConfigEntityStorage->save(Object) Drupal\Core\Entity\Entity->save() Drupal\Core\Config\Entity\ConfigEntityBase->save() Drupal\search_api\Tests\Processor\ContentAccessTest->setUp() Drupal\simpletest\TestBase->run(Array) simpletest_script_run_one_test('5', 'Drupal\search_api\Tests\Processor\ContentAccessTest') WarningMemoryStorage.php54Drupal\Core\KeyValueStore\MemoryStorage->set()
Illegal offset typeDrupal\Core\State\State->set(Array, Array) Drupal\search_api\Task\IndexTaskManager->startTracking(Object) Drupal\search_api\Entity\Index->postSave(Object, ) Drupal\Core\Entity\EntityStorageBase->doPostSave(Object, ) Drupal\Core\Entity\EntityStorageBase->save(Object) Drupal\Core\Config\Entity\ConfigEntityStorage->save(Object) Drupal\Core\Entity\Entity->save() Drupal\Core\Config\Entity\ConfigEntityBase->save() Drupal\search_api\Tests\Processor\ProcessorTestBase->setUp('content_access') Drupal\search_api\Tests\Processor\ContentAccessTest->setUp() Drupal\simpletest\TestBase->run(Array) simpletest_script_run_one_test('5', 'Drupal\search_api\Tests\Processor\ContentAccessTest') WarningState.php88Drupal\Core\State\State->set()
Illegal offset typeDrupal\Core\KeyValueStore\MemoryStorage->set(Array, Array) Drupal\Core\State\State->set(Array, Array) Drupal\search_api\Task\IndexTaskManager->startTracking(Object) Drupal\search_api\Entity\Index->postSave(Object, ) Drupal\Core\Entity\EntityStorageBase->doPostSave(Object, ) Drupal\Core\Entity\EntityStorageBase->save(Object) Drupal\Core\Config\Entity\ConfigEntityStorage->save(Object) Drupal\Core\Entity\Entity->save() Drupal\Core\Config\Entity\ConfigEntityBase->save() Drupal\search_api\Tests\Processor\ProcessorTestBase->setUp('content_access') Drupal\search_api\Tests\Processor\ContentAccessTest->setUp() Drupal\simpletest\TestBase->run(Array) simpletest_script_run_one_test('5', 'Drupal\search_api\Tests\Processor\ContentAccessTest') WarningMemoryStorage.php54Drupal\Core\KeyValueStore\MemoryStorage->set()
Illegal offset typeDrupal\Core\State\State->set(Array, Array) Drupal\search_api\Task\IndexTaskManager->startTracking(Object, Array) Drupal\search_api\Entity\Index->reactToDatasourceSwitch(Object) Drupal\search_api\Entity\Index->postSave(Object, 1) Drupal\Core\Entity\EntityStorageBase->doPostSave(Object, 1) Drupal\Core\Entity\EntityStorageBase->save(Object) Drupal\Core\Config\Entity\ConfigEntityStorage->save(Object) Drupal\Core\Entity\Entity->save() Drupal\Core\Config\Entity\ConfigEntityBase->save() Drupal\search_api\Tests\Processor\ContentAccessTest->setUp() Drupal\simpletest\TestBase->run(Array) simpletest_script_run_one_test('5', 'Drupal\search_api\Tests\Processor\ContentAccessTest') WarningState.php88Drupal\Core\State\State->set()
Illegal offset typeDrupal\Core\KeyValueStore\MemoryStorage->set(Array, Array) Drupal\Core\State\State->set(Array, Array) Drupal\search_api\Task\IndexTaskManager->startTracking(Object, Array) Drupal\search_api\Entity\Index->reactToDatasourceSwitch(Object) Drupal\search_api\Entity\Index->postSave(Object, 1) Drupal\Core\Entity\EntityStorageBase->doPostSave(Object, 1) Drupal\Core\Entity\EntityStorageBase->save(Object) Drupal\Core\Config\Entity\ConfigEntityStorage->save(Object) Drupal\Core\Entity\Entity->save() Drupal\Core\Config\Entity\ConfigEntityBase->save() Drupal\search_api\Tests\Processor\ContentAccessTest->setUp() Drupal\simpletest\TestBase->run(Array) simpletest_script_run_one_test('5', 'Drupal\search_api\Tests\Processor\ContentAccessTest') WarningMemoryStorage.php54Drupal\Core\KeyValueStore\MemoryStorage->set()
ExpandDrupal\search_api\Tests\Processor\RenderedItemTest4204
MessageGroupFilenameLineFunctionStatus
Illegal offset typeDrupal\Core\State\State->set(Array, Array) Drupal\search_api\Task\IndexTaskManager->startTracking(Object) Drupal\search_api\Entity\Index->postSave(Object, ) Drupal\Core\Entity\EntityStorageBase->doPostSave(Object, ) Drupal\Core\Entity\EntityStorageBase->save(Object) Drupal\Core\Config\Entity\ConfigEntityStorage->save(Object) Drupal\Core\Entity\Entity->save() Drupal\Core\Config\Entity\ConfigEntityBase->save() Drupal\search_api\Tests\Processor\ProcessorTestBase->setUp('rendered_item') Drupal\search_api\Tests\Processor\RenderedItemTest->setUp() Drupal\simpletest\TestBase->run(Array) simpletest_script_run_one_test('3', 'Drupal\search_api\Tests\Processor\RenderedItemTest') WarningState.php88Drupal\Core\State\State->set()
Illegal offset typeDrupal\Core\KeyValueStore\MemoryStorage->set(Array, Array) Drupal\Core\State\State->set(Array, Array) Drupal\search_api\Task\IndexTaskManager->startTracking(Object) Drupal\search_api\Entity\Index->postSave(Object, ) Drupal\Core\Entity\EntityStorageBase->doPostSave(Object, ) Drupal\Core\Entity\EntityStorageBase->save(Object) Drupal\Core\Config\Entity\ConfigEntityStorage->save(Object) Drupal\Core\Entity\Entity->save() Drupal\Core\Config\Entity\ConfigEntityBase->save() Drupal\search_api\Tests\Processor\ProcessorTestBase->setUp('rendered_item') Drupal\search_api\Tests\Processor\RenderedItemTest->setUp() Drupal\simpletest\TestBase->run(Array) simpletest_script_run_one_test('3', 'Drupal\search_api\Tests\Processor\RenderedItemTest') WarningMemoryStorage.php54Drupal\Core\KeyValueStore\MemoryStorage->set()
Illegal offset typeDrupal\Core\State\State->set(Array, Array) Drupal\search_api\Task\IndexTaskManager->startTracking(Object) Drupal\search_api\Entity\Index->postSave(Object, ) Drupal\Core\Entity\EntityStorageBase->doPostSave(Object, ) Drupal\Core\Entity\EntityStorageBase->save(Object) Drupal\Core\Config\Entity\ConfigEntityStorage->save(Object) Drupal\Core\Entity\Entity->save() Drupal\Core\Config\Entity\ConfigEntityBase->save() Drupal\search_api\Tests\Processor\ProcessorTestBase->setUp('rendered_item') Drupal\search_api\Tests\Processor\RenderedItemTest->setUp() Drupal\simpletest\TestBase->run(Array) simpletest_script_run_one_test('3', 'Drupal\search_api\Tests\Processor\RenderedItemTest') WarningState.php88Drupal\Core\State\State->set()
Illegal offset typeDrupal\Core\KeyValueStore\MemoryStorage->set(Array, Array) Drupal\Core\State\State->set(Array, Array) Drupal\search_api\Task\IndexTaskManager->startTracking(Object) Drupal\search_api\Entity\Index->postSave(Object, ) Drupal\Core\Entity\EntityStorageBase->doPostSave(Object, ) Drupal\Core\Entity\EntityStorageBase->save(Object) Drupal\Core\Config\Entity\ConfigEntityStorage->save(Object) Drupal\Core\Entity\Entity->save() Drupal\Core\Config\Entity\ConfigEntityBase->save() Drupal\search_api\Tests\Processor\ProcessorTestBase->setUp('rendered_item') Drupal\search_api\Tests\Processor\RenderedItemTest->setUp() Drupal\simpletest\TestBase->run(Array) simpletest_script_run_one_test('3', 'Drupal\search_api\Tests\Processor\RenderedItemTest') WarningMemoryStorage.php54Drupal\Core\KeyValueStore\MemoryStorage->set()
ExpandDrupal\search_api\Tests\ServerTaskUnitTest59010
MessageGroupFilenameLineFunctionStatus
Illegal offset typeDrupal\Core\State\State->set(Array, Array) Drupal\search_api\Task\IndexTaskManager->startTracking(Object) Drupal\search_api\Entity\Index->postSave(Object, ) Drupal\Core\Entity\EntityStorageBase->doPostSave(Object, ) Drupal\Core\Entity\EntityStorageBase->save(Object) Drupal\Core\Config\Entity\ConfigEntityStorage->save(Object) Drupal\Core\Entity\Entity->save() Drupal\Core\Config\Entity\ConfigEntityBase->save() Drupal\search_api\Tests\ServerTaskUnitTest->setUp() Drupal\simpletest\TestBase->run(Array) simpletest_script_run_one_test('7', 'Drupal\search_api\Tests\ServerTaskUnitTest') WarningState.php88Drupal\Core\State\State->set()
Illegal offset typeDrupal\Core\KeyValueStore\MemoryStorage->set(Array, Array) Drupal\Core\State\State->set(Array, Array) Drupal\search_api\Task\IndexTaskManager->startTracking(Object) Drupal\search_api\Entity\Index->postSave(Object, ) Drupal\Core\Entity\EntityStorageBase->doPostSave(Object, ) Drupal\Core\Entity\EntityStorageBase->save(Object) Drupal\Core\Config\Entity\ConfigEntityStorage->save(Object) Drupal\Core\Entity\Entity->save() Drupal\Core\Config\Entity\ConfigEntityBase->save() Drupal\search_api\Tests\ServerTaskUnitTest->setUp() Drupal\simpletest\TestBase->run(Array) simpletest_script_run_one_test('7', 'Drupal\search_api\Tests\ServerTaskUnitTest') WarningMemoryStorage.php54Drupal\Core\KeyValueStore\MemoryStorage->set()
Illegal offset typeDrupal\Core\State\State->set(Array, Array) Drupal\search_api\Task\IndexTaskManager->startTracking(Object) Drupal\search_api\Entity\Index->postSave(Object, ) Drupal\Core\Entity\EntityStorageBase->doPostSave(Object, ) Drupal\Core\Entity\EntityStorageBase->save(Object) Drupal\Core\Config\Entity\ConfigEntityStorage->save(Object) Drupal\Core\Entity\Entity->save() Drupal\Core\Config\Entity\ConfigEntityBase->save() Drupal\search_api\Tests\ServerTaskUnitTest->setUp() Drupal\simpletest\TestBase->run(Array) simpletest_script_run_one_test('7', 'Drupal\search_api\Tests\ServerTaskUnitTest') WarningState.php88Drupal\Core\State\State->set()
Illegal offset typeDrupal\Core\KeyValueStore\MemoryStorage->set(Array, Array) Drupal\Core\State\State->set(Array, Array) Drupal\search_api\Task\IndexTaskManager->startTracking(Object) Drupal\search_api\Entity\Index->postSave(Object, ) Drupal\Core\Entity\EntityStorageBase->doPostSave(Object, ) Drupal\Core\Entity\EntityStorageBase->save(Object) Drupal\Core\Config\Entity\ConfigEntityStorage->save(Object) Drupal\Core\Entity\Entity->save() Drupal\Core\Config\Entity\ConfigEntityBase->save() Drupal\search_api\Tests\ServerTaskUnitTest->setUp() Drupal\simpletest\TestBase->run(Array) simpletest_script_run_one_test('7', 'Drupal\search_api\Tests\ServerTaskUnitTest') WarningMemoryStorage.php54Drupal\Core\KeyValueStore\MemoryStorage->set()
Illegal offset typeDrupal\Core\State\State->set(Array, Array) Drupal\search_api\Task\IndexTaskManager->startTracking(Object) Drupal\search_api\Entity\Index->postSave(Object, ) Drupal\Core\Entity\EntityStorageBase->doPostSave(Object, ) Drupal\Core\Entity\EntityStorageBase->save(Object) Drupal\Core\Config\Entity\ConfigEntityStorage->save(Object) Drupal\Core\Entity\Entity->save() Drupal\Core\Config\Entity\ConfigEntityBase->save() Drupal\search_api\Tests\ServerTaskUnitTest->setUp() Drupal\simpletest\TestBase->run(Array) simpletest_script_run_one_test('7', 'Drupal\search_api\Tests\ServerTaskUnitTest') WarningState.php88Drupal\Core\State\State->set()
Illegal offset typeDrupal\Core\KeyValueStore\MemoryStorage->set(Array, Array) Drupal\Core\State\State->set(Array, Array) Drupal\search_api\Task\IndexTaskManager->startTracking(Object) Drupal\search_api\Entity\Index->postSave(Object, ) Drupal\Core\Entity\EntityStorageBase->doPostSave(Object, ) Drupal\Core\Entity\EntityStorageBase->save(Object) Drupal\Core\Config\Entity\ConfigEntityStorage->save(Object) Drupal\Core\Entity\Entity->save() Drupal\Core\Config\Entity\ConfigEntityBase->save() Drupal\search_api\Tests\ServerTaskUnitTest->setUp() Drupal\simpletest\TestBase->run(Array) simpletest_script_run_one_test('7', 'Drupal\search_api\Tests\ServerTaskUnitTest') WarningMemoryStorage.php54Drupal\Core\KeyValueStore\MemoryStorage->set()
Illegal offset typeDrupal\Core\State\State->set(Array, Array) Drupal\search_api\Task\IndexTaskManager->startTracking(Object) Drupal\search_api\Entity\Index->postSave(Object, ) Drupal\Core\Entity\EntityStorageBase->doPostSave(Object, ) Drupal\Core\Entity\EntityStorageBase->save(Object) Drupal\Core\Config\Entity\ConfigEntityStorage->save(Object) Drupal\Core\Entity\Entity->save() Drupal\Core\Config\Entity\ConfigEntityBase->save() Drupal\search_api\Tests\ServerTaskUnitTest->setUp() Drupal\simpletest\TestBase->run(Array) simpletest_script_run_one_test('7', 'Drupal\search_api\Tests\ServerTaskUnitTest') WarningState.php88Drupal\Core\State\State->set()
Illegal offset typeDrupal\Core\KeyValueStore\MemoryStorage->set(Array, Array) Drupal\Core\State\State->set(Array, Array) Drupal\search_api\Task\IndexTaskManager->startTracking(Object) Drupal\search_api\Entity\Index->postSave(Object, ) Drupal\Core\Entity\EntityStorageBase->doPostSave(Object, ) Drupal\Core\Entity\EntityStorageBase->save(Object) Drupal\Core\Config\Entity\ConfigEntityStorage->save(Object) Drupal\Core\Entity\Entity->save() Drupal\Core\Config\Entity\ConfigEntityBase->save() Drupal\search_api\Tests\ServerTaskUnitTest->setUp() Drupal\simpletest\TestBase->run(Array) simpletest_script_run_one_test('7', 'Drupal\search_api\Tests\ServerTaskUnitTest') WarningMemoryStorage.php54Drupal\Core\KeyValueStore\MemoryStorage->set()
Illegal offset typeDrupal\Core\State\State->set(Array, Array) Drupal\search_api\Task\IndexTaskManager->startTracking(Object) Drupal\search_api\Entity\Index->postSave(Object, ) Drupal\Core\Entity\EntityStorageBase->doPostSave(Object, ) Drupal\Core\Entity\EntityStorageBase->save(Object) Drupal\Core\Config\Entity\ConfigEntityStorage->save(Object) Drupal\Core\Entity\Entity->save() Drupal\Core\Config\Entity\ConfigEntityBase->save() Drupal\search_api\Tests\ServerTaskUnitTest->setUp() Drupal\simpletest\TestBase->run(Array) simpletest_script_run_one_test('7', 'Drupal\search_api\Tests\ServerTaskUnitTest') WarningState.php88Drupal\Core\State\State->set()
Illegal offset typeDrupal\Core\KeyValueStore\MemoryStorage->set(Array, Array) Drupal\Core\State\State->set(Array, Array) Drupal\search_api\Task\IndexTaskManager->startTracking(Object) Drupal\search_api\Entity\Index->postSave(Object, ) Drupal\Core\Entity\EntityStorageBase->doPostSave(Object, ) Drupal\Core\Entity\EntityStorageBase->save(Object) Drupal\Core\Config\Entity\ConfigEntityStorage->save(Object) Drupal\Core\Entity\Entity->save() Drupal\Core\Config\Entity\ConfigEntityBase->save() Drupal\search_api\Tests\ServerTaskUnitTest->setUp() Drupal\simpletest\TestBase->run(Array) simpletest_script_run_one_test('7', 'Drupal\search_api\Tests\ServerTaskUnitTest') WarningMemoryStorage.php54Drupal\Core\KeyValueStore\MemoryStorage->set()
ExpandDrupal\search_api\Tests\ViewsTest012
MessageGroupFilenameLineFunctionStatus
The test did not complete due to a fatal error.Completion checkViewsTest.php45Drupal\search_api\Tests\ViewsTest->testFulltextSearch()
Illegal offset typeDrupal\Core\State\State->set(Array, Array) Drupal\search_api\Task\IndexTaskManager->startTracking(Object) Drupal\search_api\Entity\Index->postSave(Object, ) Drupal\Core\Entity\EntityStorageBase->doPostSave(Object, ) Drupal\Core\Entity\EntityStorageBase->save(Object) Drupal\Core\Config\Entity\ConfigEntityStorage->save(Object) Drupal\Core\Entity\Entity->save() Drupal\Core\Config\Entity\ConfigEntityBase->save() Drupal\Core\Config\ConfigInstaller->createConfiguration('', Array) Drupal\Core\Config\ConfigInstaller->installDefaultConfig('module', 'search_api_test_db') Drupal\Core\ProxyClass\Config\ConfigInstaller->installDefaultConfig('module', 'search_api_test_db') Drupal\Core\Extension\ModuleInstaller->install(Array, 1) Drupal\Core\ProxyClass\Extension\ModuleInstaller->install(Array, 1) Drupal\simpletest\WebTestBase->installModulesFromClassProperty(Object) Drupal\simpletest\WebTestBase->setUp() Drupal\search_api\Tests\WebTestBase->setUp() Drupal\search_api\Tests\ViewsTest->setUp() Drupal\simpletest\TestBase->run(Array) simpletest_script_run_one_test('6', 'Drupal\search_api\Tests\ViewsTest') WarningState.php88Drupal\Core\State\State->set()
InvalidArgumentException: Placeholders must have a trailing [] if they are to be expanded with an array of values. in Drupal\Core\Database\Connection->expandArguments() (line 701 of /var/lib/drupaltestbot/sites/default/files/checkout/core/lib/Drupal/Core/Database/Connection.php). Drupal\Core\Database\Connection->expandArguments('SELECT 1 AS expression FROM {key_value} key_value WHERE ( (name = :db_condition_placeholder_0:db_condition_placeholder_1) AND (collection = :db_condition_placeholder_2) )', Array) Drupal\Core\Database\Connection->query('SELECT 1 AS expression FROM {key_value} key_value WHERE ( (name = :db_condition_placeholder_0:db_condition_placeholder_1) AND (collection = :db_condition_placeholder_2) )', Array, Array) Drupal\Core\Database\Driver\mysql\Connection->query('SELECT 1 AS expression FROM {key_value} key_value WHERE ( (name = :db_condition_placeholder_0:db_condition_placeholder_1) AND (collection = :db_condition_placeholder_2) )', Array, Array) Drupal\Core\Database\Query\Select->execute() Drupal\Core\Database\Query\Merge->execute() Drupal\Core\KeyValueStore\DatabaseStorage->set(Array, Array) Drupal\Core\State\State->set(Array, Array) Drupal\search_api\Task\IndexTaskManager->startTracking(Object) Drupal\search_api\Entity\Index->postSave(Object, ) Drupal\Core\Entity\EntityStorageBase->doPostSave(Object, ) Drupal\Core\Entity\EntityStorageBase->save(Object) Drupal\Core\Config\Entity\ConfigEntityStorage->save(Object) Drupal\Core\Entity\Entity->save() Drupal\Core\Config\Entity\ConfigEntityBase->save() Drupal\Core\Config\ConfigInstaller->createConfiguration('', Array) Drupal\Core\Config\ConfigInstaller->installDefaultConfig('module', 'search_api_test_db') Drupal\Core\ProxyClass\Config\ConfigInstaller->installDefaultConfig('module', 'search_api_test_db') Drupal\Core\Extension\ModuleInstaller->install(Array, 1) Drupal\Core\ProxyClass\Extension\ModuleInstaller->install(Array, 1) Drupal\simpletest\WebTestBase->installModulesFromClassProperty(Object) Drupal\simpletest\WebTestBase->setUp() Drupal\search_api\Tests\WebTestBase->setUp() Drupal\search_api\Tests\ViewsTest->setUp() Drupal\simpletest\TestBase->run(Array) simpletest_script_run_one_test('6', 'Drupal\search_api\Tests\ViewsTest') Uncaught exceptionConnection.php701Drupal\Core\Database\Connection->expandArguments()
ExpandDrupal\search_api_db\Tests\BackendTest100648
MessageGroupFilenameLineFunctionStatus
Illegal offset typeDrupal\Core\State\State->set(Array, Array) Drupal\search_api\Task\IndexTaskManager->startTracking(Object) Drupal\search_api\Entity\Index->postSave(Object, ) Drupal\Core\Entity\EntityStorageBase->doPostSave(Object, ) Drupal\Core\Entity\EntityStorageBase->save(Object) Drupal\Core\Config\Entity\ConfigEntityStorage->save(Object) Drupal\Core\Entity\Entity->save() Drupal\Core\Config\Entity\ConfigEntityBase->save() Drupal\Core\Config\ConfigInstaller->createConfiguration('', Array) Drupal\Core\Config\ConfigInstaller->installDefaultConfig('module', 'search_api_test_db') Drupal\Core\ProxyClass\Config\ConfigInstaller->installDefaultConfig('module', 'search_api_test_db') Drupal\simpletest\KernelTestBase->installConfig(Array) Drupal\search_api_db\Tests\BackendTest->setUp() Drupal\simpletest\TestBase->run(Array) simpletest_script_run_one_test('2', 'Drupal\search_api_db\Tests\BackendTest') WarningState.php88Drupal\Core\State\State->set()
Illegal offset typeDrupal\Core\KeyValueStore\MemoryStorage->set(Array, Array) Drupal\Core\State\State->set(Array, Array) Drupal\search_api\Task\IndexTaskManager->startTracking(Object) Drupal\search_api\Entity\Index->postSave(Object, ) Drupal\Core\Entity\EntityStorageBase->doPostSave(Object, ) Drupal\Core\Entity\EntityStorageBase->save(Object) Drupal\Core\Config\Entity\ConfigEntityStorage->save(Object) Drupal\Core\Entity\Entity->save() Drupal\Core\Config\Entity\ConfigEntityBase->save() Drupal\Core\Config\ConfigInstaller->createConfiguration('', Array) Drupal\Core\Config\ConfigInstaller->installDefaultConfig('module', 'search_api_test_db') Drupal\Core\ProxyClass\Config\ConfigInstaller->installDefaultConfig('module', 'search_api_test_db') Drupal\simpletest\KernelTestBase->installConfig(Array) Drupal\search_api_db\Tests\BackendTest->setUp() Drupal\simpletest\TestBase->run(Array) simpletest_script_run_one_test('2', 'Drupal\search_api_db\Tests\BackendTest') WarningMemoryStorage.php54Drupal\Core\KeyValueStore\MemoryStorage->set()
Correct item count.OtherBackendTest.php130Drupal\search_api_db\Tests\BackendTest->checkDefaultIndex()
Search for »test« returned correct number of results.OtherBackendTest.php242Drupal\search_api_db\Tests\BackendTest->searchSuccess1()
Search for »test« returned correct result.OtherBackendTest.php243Drupal\search_api_db\Tests\BackendTest->searchSuccess1()
Value NULL is equal to value 'entity:entity_test/2:en'.OtherBackendTest.php249Drupal\search_api_db\Tests\BackendTest->searchSuccess1()
Search for »test foo« returned correct number of results.OtherBackendTest.php255Drupal\search_api_db\Tests\BackendTest->searchSuccess1()
Search for »test foo« returned correct result.OtherBackendTest.php256Drupal\search_api_db\Tests\BackendTest->searchSuccess1()
Search for »foo« returned correct number of results.OtherBackendTest.php261Drupal\search_api_db\Tests\BackendTest->searchSuccess1()
Search for »foo« returned correct result.OtherBackendTest.php262Drupal\search_api_db\Tests\BackendTest->searchSuccess1()
Complex search 1 returned correct number of results.OtherBackendTest.php282Drupal\search_api_db\Tests\BackendTest->searchSuccess1()
Complex search 1 returned correct result.OtherBackendTest.php283Drupal\search_api_db\Tests\BackendTest->searchSuccess1()
OR facets query returned correct number of results.OtherBackendTest.php306Drupal\search_api_db\Tests\BackendTest->checkFacets()
usort() expects parameter 1 to be array, null givenusort(NULL, Array) Drupal\search_api_db\Tests\BackendTest->checkFacets() Drupal\search_api_db\Tests\BackendTest->testFramework() Drupal\simpletest\TestBase->run(Array) simpletest_script_run_one_test('2', 'Drupal\search_api_db\Tests\BackendTest') WarningBackendTest.php313Drupal\search_api_db\Tests\BackendTest->checkFacets()
Correct OR facets were returnedOtherBackendTest.php314Drupal\search_api_db\Tests\BackendTest->checkFacets()
OR facets query returned correct number of results.OtherBackendTest.php333Drupal\search_api_db\Tests\BackendTest->checkFacets()
usort() expects parameter 1 to be array, null givenusort(NULL, Array) Drupal\search_api_db\Tests\BackendTest->checkFacets() Drupal\search_api_db\Tests\BackendTest->testFramework() Drupal\simpletest\TestBase->run(Array) simpletest_script_run_one_test('2', 'Drupal\search_api_db\Tests\BackendTest') WarningBackendTest.php339Drupal\search_api_db\Tests\BackendTest->checkFacets()
Correct OR facets were returnedOtherBackendTest.php340Drupal\search_api_db\Tests\BackendTest->checkFacets()
Sorting on field with NULLs returned correct number of results.OtherBackendTest.php460Drupal\search_api_db\Tests\BackendTest->regressionTests()
Sorting on field with NULLs returned correct result.OtherBackendTest.php461Drupal\search_api_db\Tests\BackendTest->regressionTests()
OR filter on field with NULLs returned correct number of results.OtherBackendTest.php472Drupal\search_api_db\Tests\BackendTest->regressionTests()
OR filter on field with NULLs returned correct result.OtherBackendTest.php473Drupal\search_api_db\Tests\BackendTest->regressionTests()
OR filter on multi-valued field returned correct number of results.OtherBackendTest.php485Drupal\search_api_db\Tests\BackendTest->regressionTests()
OR filter on multi-valued field returned correct result.OtherBackendTest.php486Drupal\search_api_db\Tests\BackendTest->regressionTests()
Multiple OR filters on multi-valued field returned correct number of results.OtherBackendTest.php501Drupal\search_api_db\Tests\BackendTest->regressionTests()
Multiple OR filters on multi-valued field returned correct result.OtherBackendTest.php502Drupal\search_api_db\Tests\BackendTest->regressionTests()
Complex nested filters on multi-valued field returned correct number of results.OtherBackendTest.php519Drupal\search_api_db\Tests\BackendTest->regressionTests()
Complex nested filters on multi-valued field returned correct result.OtherBackendTest.php520Drupal\search_api_db\Tests\BackendTest->regressionTests()
usort() expects parameter 1 to be array, null givenusort(NULL, Array) Drupal\search_api_db\Tests\BackendTest->regressionTests() Drupal\search_api_db\Tests\BackendTest->testFramework() Drupal\simpletest\TestBase->run(Array) simpletest_script_run_one_test('2', 'Drupal\search_api_db\Tests\BackendTest') WarningBackendTest.php541Drupal\search_api_db\Tests\BackendTest->regressionTests()
Correct facets were returnedOtherBackendTest.php542Drupal\search_api_db\Tests\BackendTest->regressionTests()
usort() expects parameter 1 to be array, null givenusort(NULL, Array) Drupal\search_api_db\Tests\BackendTest->regressionTests() Drupal\search_api_db\Tests\BackendTest->testFramework() Drupal\simpletest\TestBase->run(Array) simpletest_script_run_one_test('2', 'Drupal\search_api_db\Tests\BackendTest') WarningBackendTest.php554Drupal\search_api_db\Tests\BackendTest->regressionTests()
Correct facets were returnedOtherBackendTest.php555Drupal\search_api_db\Tests\BackendTest->regressionTests()
OR keywords returned correct number of results.OtherBackendTest.php566Drupal\search_api_db\Tests\BackendTest->regressionTests()
OR keywords returned correct result.OtherBackendTest.php567Drupal\search_api_db\Tests\BackendTest->regressionTests()
Multi-field OR keywords returned correct number of results.OtherBackendTest.php574Drupal\search_api_db\Tests\BackendTest->regressionTests()
Nested OR keywords returned correct number of results.OtherBackendTest.php592Drupal\search_api_db\Tests\BackendTest->regressionTests()
Nested OR keywords returned correct result.OtherBackendTest.php593Drupal\search_api_db\Tests\BackendTest->regressionTests()
Nested multi-field OR keywords returned correct number of results.OtherBackendTest.php613Drupal\search_api_db\Tests\BackendTest->regressionTests()
Nested multi-field OR keywords returned correct result.OtherBackendTest.php614Drupal\search_api_db\Tests\BackendTest->regressionTests()
Negated AND fulltext search returned correct number of results.OtherBackendTest.php626Drupal\search_api_db\Tests\BackendTest->regressionTests()
Negated AND fulltext search returned correct result.OtherBackendTest.php627Drupal\search_api_db\Tests\BackendTest->regressionTests()
Negated OR fulltext search returned correct number of results.OtherBackendTest.php638Drupal\search_api_db\Tests\BackendTest->regressionTests()
Negated OR fulltext search returned correct result.OtherBackendTest.php639Drupal\search_api_db\Tests\BackendTest->regressionTests()
Nested NOT AND fulltext search returned correct number of results.OtherBackendTest.php654Drupal\search_api_db\Tests\BackendTest->regressionTests()
Nested NOT AND fulltext search returned correct result.OtherBackendTest.php655Drupal\search_api_db\Tests\BackendTest->regressionTests()
Undefined index: typeDrupal\search_api_db\Tests\BackendTest->regressionTests() Drupal\search_api_db\Tests\BackendTest->testFramework() Drupal\simpletest\TestBase->run(Array) simpletest_script_run_one_test('2', 'Drupal\search_api_db\Tests\BackendTest') NoticeBackendTest.php692Drupal\search_api_db\Tests\BackendTest->regressionTests()
usort() expects parameter 1 to be array, null givenusort(NULL, Array) Drupal\search_api_db\Tests\BackendTest->regressionTests() Drupal\search_api_db\Tests\BackendTest->testFramework() Drupal\simpletest\TestBase->run(Array) simpletest_script_run_one_test('2', 'Drupal\search_api_db\Tests\BackendTest') WarningBackendTest.php693Drupal\search_api_db\Tests\BackendTest->regressionTests()
Correct facets were returnedOtherBackendTest.php694Drupal\search_api_db\Tests\BackendTest->regressionTests()
Search for »test« returned correct number of results.OtherBackendTest.php366Drupal\search_api_db\Tests\BackendTest->searchSuccess2()
Search for »test« returned correct result.OtherBackendTest.php367Drupal\search_api_db\Tests\BackendTest->searchSuccess2()
Search with multi-term fulltext filter returned correct number of results.OtherBackendTest.php372Drupal\search_api_db\Tests\BackendTest->searchSuccess2()
Search with multi-term fulltext filter returned correct result.OtherBackendTest.php373Drupal\search_api_db\Tests\BackendTest->searchSuccess2()
Search for »test foo« returned correct number of results.OtherBackendTest.php378Drupal\search_api_db\Tests\BackendTest->searchSuccess2()
Search for »test foo« returned correct result.OtherBackendTest.php379Drupal\search_api_db\Tests\BackendTest->searchSuccess2()
Search for »foo« returned correct number of results.OtherBackendTest.php384Drupal\search_api_db\Tests\BackendTest->searchSuccess2()
Search for »foo« returned correct result.OtherBackendTest.php385Drupal\search_api_db\Tests\BackendTest->searchSuccess2()
Complex search 1 returned correct number of results.OtherBackendTest.php405Drupal\search_api_db\Tests\BackendTest->searchSuccess2()
Complex search 1 returned correct result.OtherBackendTest.php406Drupal\search_api_db\Tests\BackendTest->searchSuccess2()
Complex search 2 returned correct number of results.OtherBackendTest.php426Drupal\search_api_db\Tests\BackendTest->searchSuccess2()
Complex search 2 returned correct result.OtherBackendTest.php427Drupal\search_api_db\Tests\BackendTest->searchSuccess2()
Filter query 1 on multi-valued field returned correct number of results.OtherBackendTest.php432Drupal\search_api_db\Tests\BackendTest->searchSuccess2()
Filter query 1 on multi-valued field returned correct result.OtherBackendTest.php433Drupal\search_api_db\Tests\BackendTest->searchSuccess2()
Filter query 2 on multi-valued field returned correct number of results.OtherBackendTest.php442Drupal\search_api_db\Tests\BackendTest->searchSuccess2()
Filter query 2 on multi-valued field returned correct result.OtherBackendTest.php443Drupal\search_api_db\Tests\BackendTest->searchSuccess2()
Query with NULL filter returned correct number of results.OtherBackendTest.php448Drupal\search_api_db\Tests\BackendTest->searchSuccess2()
Query with NULL filter returned correct result.OtherBackendTest.php449Drupal\search_api_db\Tests\BackendTest->searchSuccess2()
Filter on decimal field returned correct number of results.OtherBackendTest.php770Drupal\search_api_db\Tests\BackendTest->regressionTests2()
Filter on decimal field returned correct result.OtherBackendTest.php771Drupal\search_api_db\Tests\BackendTest->regressionTests2()
Filter on decimal field returned correct number of results.OtherBackendTest.php777Drupal\search_api_db\Tests\BackendTest->regressionTests2()
Filter on decimal field returned correct result.OtherBackendTest.php778Drupal\search_api_db\Tests\BackendTest->regressionTests2()
Indexing an item with an empty value for a non string field worked.OtherBackendTest.php789Drupal\search_api_db\Tests\BackendTest->regressionTests2()
Indexing an item with a word longer than 50 characters worked.OtherBackendTest.php803Drupal\search_api_db\Tests\BackendTest->regressionTests2()
ExpandDrupal\search_api_db_defaults\Tests\IntegrationTest412
MessageGroupFilenameLineFunctionStatus
The test did not complete due to a fatal error.Completion checkIntegrationTest.php176Drupal\search_api_db_defaults\Tests\IntegrationTest->testDefaultSetupWorking()
Illegal offset typeDrupal\Core\State\State->set(Array, Array) Drupal\search_api\Task\IndexTaskManager->startTracking(Object) Drupal\search_api\Entity\Index->postSave(Object, ) Drupal\Core\Entity\EntityStorageBase->doPostSave(Object, ) Drupal\Core\Entity\EntityStorageBase->save(Object) Drupal\Core\Config\Entity\ConfigEntityStorage->save(Object) Drupal\Core\Entity\Entity->save() Drupal\Core\Config\Entity\ConfigEntityBase->save() Drupal\Core\Config\ConfigInstaller->createConfiguration('', Array) Drupal\Core\Config\ConfigInstaller->installDefaultConfig('module', 'search_api_db_defaults') Drupal\Core\ProxyClass\Config\ConfigInstaller->installDefaultConfig('module', 'search_api_db_defaults') Drupal\Core\Extension\ModuleInstaller->install(Array, 1) Drupal\Core\ProxyClass\Extension\ModuleInstaller->install(Array, 1) Drupal\search_api_db_defaults\Tests\IntegrationTest->setUp() Drupal\simpletest\TestBase->run(Array) simpletest_script_run_one_test('1', 'Drupal\search_api_db_defaults\Tests\IntegrationTest') WarningState.php88Drupal\Core\State\State->set()
InvalidArgumentException: Placeholders must have a trailing [] if they are to be expanded with an array of values. in Drupal\Core\Database\Connection->expandArguments() (line 701 of /var/lib/drupaltestbot/sites/default/files/checkout/core/lib/Drupal/Core/Database/Connection.php). Drupal\Core\Database\Connection->expandArguments('SELECT 1 AS expression FROM {key_value} key_value WHERE ( (name = :db_condition_placeholder_0:db_condition_placeholder_1) AND (collection = :db_condition_placeholder_2) )', Array) Drupal\Core\Database\Connection->query('SELECT 1 AS expression FROM {key_value} key_value WHERE ( (name = :db_condition_placeholder_0:db_condition_placeholder_1) AND (collection = :db_condition_placeholder_2) )', Array, Array) Drupal\Core\Database\Driver\mysql\Connection->query('SELECT 1 AS expression FROM {key_value} key_value WHERE ( (name = :db_condition_placeholder_0:db_condition_placeholder_1) AND (collection = :db_condition_placeholder_2) )', Array, Array) Drupal\Core\Database\Query\Select->execute() Drupal\Core\Database\Query\Merge->execute() Drupal\Core\KeyValueStore\DatabaseStorage->set(Array, Array) Drupal\Core\State\State->set(Array, Array) Drupal\search_api\Task\IndexTaskManager->startTracking(Object) Drupal\search_api\Entity\Index->postSave(Object, ) Drupal\Core\Entity\EntityStorageBase->doPostSave(Object, ) Drupal\Core\Entity\EntityStorageBase->save(Object) Drupal\Core\Config\Entity\ConfigEntityStorage->save(Object) Drupal\Core\Entity\Entity->save() Drupal\Core\Config\Entity\ConfigEntityBase->save() Drupal\Core\Config\ConfigInstaller->createConfiguration('', Array) Drupal\Core\Config\ConfigInstaller->installDefaultConfig('module', 'search_api_db_defaults') Drupal\Core\ProxyClass\Config\ConfigInstaller->installDefaultConfig('module', 'search_api_db_defaults') Drupal\Core\Extension\ModuleInstaller->install(Array, 1) Drupal\Core\ProxyClass\Extension\ModuleInstaller->install(Array, 1) Drupal\search_api_db_defaults\Tests\IntegrationTest->setUp() Drupal\simpletest\TestBase->run(Array) simpletest_script_run_one_test('1', 'Drupal\search_api_db_defaults\Tests\IntegrationTest') Uncaught exceptionConnection.php701Drupal\Core\Database\Connection->expandArguments()

All

Test namePassFailException
ExpandDrupal\search_api\Tests\CustomDataTypesUnitTest1802
MessageGroupFilenameLineFunctionStatus
Illegal offset typeDrupal\Core\State\State->set(Array, Array) Drupal\search_api\Task\IndexTaskManager->startTracking(Object) Drupal\search_api\Entity\Index->postSave(Object, ) Drupal\Core\Entity\EntityStorageBase->doPostSave(Object, ) Drupal\Core\Entity\EntityStorageBase->save(Object) Drupal\Core\Config\Entity\ConfigEntityStorage->save(Object) Drupal\Core\Entity\Entity->save() Drupal\Core\Config\Entity\ConfigEntityBase->save() Drupal\Core\Config\ConfigInstaller->createConfiguration('', Array) Drupal\Core\Config\ConfigInstaller->installDefaultConfig('module', 'search_api_test_db') Drupal\Core\ProxyClass\Config\ConfigInstaller->installDefaultConfig('module', 'search_api_test_db') Drupal\simpletest\KernelTestBase->installConfig(Array) Drupal\search_api\Tests\CustomDataTypesUnitTest->setUp() Drupal\simpletest\TestBase->run(Array) simpletest_script_run_one_test('14', 'Drupal\search_api\Tests\CustomDataTypesUnitTest') WarningState.php88Drupal\Core\State\State->set()
Illegal offset typeDrupal\Core\KeyValueStore\MemoryStorage->set(Array, Array) Drupal\Core\State\State->set(Array, Array) Drupal\search_api\Task\IndexTaskManager->startTracking(Object) Drupal\search_api\Entity\Index->postSave(Object, ) Drupal\Core\Entity\EntityStorageBase->doPostSave(Object, ) Drupal\Core\Entity\EntityStorageBase->save(Object) Drupal\Core\Config\Entity\ConfigEntityStorage->save(Object) Drupal\Core\Entity\Entity->save() Drupal\Core\Config\Entity\ConfigEntityBase->save() Drupal\Core\Config\ConfigInstaller->createConfiguration('', Array) Drupal\Core\Config\ConfigInstaller->installDefaultConfig('module', 'search_api_test_db') Drupal\Core\ProxyClass\Config\ConfigInstaller->installDefaultConfig('module', 'search_api_test_db') Drupal\simpletest\KernelTestBase->installConfig(Array) Drupal\search_api\Tests\CustomDataTypesUnitTest->setUp() Drupal\simpletest\TestBase->run(Array) simpletest_script_run_one_test('14', 'Drupal\search_api\Tests\CustomDataTypesUnitTest') WarningMemoryStorage.php54Drupal\Core\KeyValueStore\MemoryStorage->set()
LeafDrupal\search_api\Tests\IndexStorageUnitTest500
ExpandDrupal\search_api\Tests\IntegrationTest209164
MessageGroupFilenameLineFunctionStatus
Illegal offset typeWarningState.php88Drupal\Core\State\State->set()
"The index was successfully saved." foundOtherIntegrationTest.php149Drupal\search_api\Tests\IntegrationTest->createIndex()
Correct redirect to index page.OtherIntegrationTest.php150Drupal\search_api\Tests\IntegrationTest->createIndex()
Three items are tracked.OtherIntegrationTest.php196Drupal\search_api\Tests\IntegrationTest->checkContentEntityTracking()
Illegal offset typeWarningState.php88Drupal\Core\State\State->set()
Three items are tracked.OtherIntegrationTest.php224Drupal\search_api\Tests\IntegrationTest->checkContentEntityTracking()
Two items are tracked.OtherIntegrationTest.php250Drupal\search_api\Tests\IntegrationTest->checkContentEntityTracking()
One item is tracked.OtherIntegrationTest.php263Drupal\search_api\Tests\IntegrationTest->checkContentEntityTracking()
One item is tracked.OtherIntegrationTest.php276Drupal\search_api\Tests\IntegrationTest->checkContentEntityTracking()
Two items are tracked.OtherIntegrationTest.php289Drupal\search_api\Tests\IntegrationTest->checkContentEntityTracking()
One item is tracked.OtherIntegrationTest.php295Drupal\search_api\Tests\IntegrationTest->checkContentEntityTracking()
Found the Index now buttonOtherIntegrationTest.php463Drupal\search_api\Tests\IntegrationTest->setReadOnly()
Found the requested form fields at admin/config/search/search-api/index/test_indexOtherIntegrationTest.php463Drupal\search_api\Tests\IntegrationTest->setReadOnly()
Illegal offset typeWarningState.php88Drupal\Core\State\State->set()
After enabling the index, 2 items are tracked.OtherIntegrationTest.php500Drupal\search_api\Tests\IntegrationTest->disableEnableIndex()
Illegal offset typeWarningState.php88Drupal\Core\State\State->set()
Correct number of items tracked after enabling the "User" datasource.OtherIntegrationTest.php526Drupal\search_api\Tests\IntegrationTest->changeIndexDatasource()
Correct number of items tracked after disabling the "User" datasource.OtherIntegrationTest.php535Drupal\search_api\Tests\IntegrationTest->changeIndexDatasource()
All nodes are correctly tracked by the index.OtherIntegrationTest.php550Drupal\search_api\Tests\IntegrationTest->changeIndexServer()
All items still need to be indexed.OtherIntegrationTest.php570Drupal\search_api\Tests\IntegrationTest->changeIndexServer()
ExpandDrupal\search_api\Tests\LanguageIntegrationUnitTest2692
MessageGroupFilenameLineFunctionStatus
Illegal offset typeDrupal\Core\State\State->set(Array, Array) Drupal\search_api\Task\IndexTaskManager->startTracking(Object) Drupal\search_api\Entity\Index->postSave(Object, ) Drupal\Core\Entity\EntityStorageBase->doPostSave(Object, ) Drupal\Core\Entity\EntityStorageBase->save(Object) Drupal\Core\Config\Entity\ConfigEntityStorage->save(Object) Drupal\Core\Entity\Entity->save() Drupal\Core\Config\Entity\ConfigEntityBase->save() Drupal\search_api\Tests\LanguageIntegrationUnitTest->setUp() Drupal\simpletest\TestBase->run(Array) simpletest_script_run_one_test('11', 'Drupal\search_api\Tests\LanguageIntegrationUnitTest') WarningState.php88Drupal\Core\State\State->set()
Illegal offset typeDrupal\Core\KeyValueStore\MemoryStorage->set(Array, Array) Drupal\Core\State\State->set(Array, Array) Drupal\search_api\Task\IndexTaskManager->startTracking(Object) Drupal\search_api\Entity\Index->postSave(Object, ) Drupal\Core\Entity\EntityStorageBase->doPostSave(Object, ) Drupal\Core\Entity\EntityStorageBase->save(Object) Drupal\Core\Config\Entity\ConfigEntityStorage->save(Object) Drupal\Core\Entity\Entity->save() Drupal\Core\Config\Entity\ConfigEntityBase->save() Drupal\search_api\Tests\LanguageIntegrationUnitTest->setUp() Drupal\simpletest\TestBase->run(Array) simpletest_script_run_one_test('11', 'Drupal\search_api\Tests\LanguageIntegrationUnitTest') WarningMemoryStorage.php54Drupal\Core\KeyValueStore\MemoryStorage->set()
There are two items to be indexed.OtherLanguageIntegrationUnitTest.php117Drupal\search_api\Tests\LanguageIntegrationUnitTest->testItemTranslations()
Two items have been indexed.OtherLanguageIntegrationUnitTest.php119Drupal\search_api\Tests\LanguageIntegrationUnitTest->testItemTranslations()
The updated item needs to be reindexed.OtherLanguageIntegrationUnitTest.php138Drupal\search_api\Tests\LanguageIntegrationUnitTest->testItemTranslations()
There are two items in total.OtherLanguageIntegrationUnitTest.php139Drupal\search_api\Tests\LanguageIntegrationUnitTest->testItemTranslations()
The updated items needs to be reindexed.OtherLanguageIntegrationUnitTest.php160Drupal\search_api\Tests\LanguageIntegrationUnitTest->testItemTranslations()
There are four items in total.OtherLanguageIntegrationUnitTest.php161Drupal\search_api\Tests\LanguageIntegrationUnitTest->testItemTranslations()
There are three items in total.OtherLanguageIntegrationUnitTest.php178Drupal\search_api\Tests\LanguageIntegrationUnitTest->testItemTranslations()
The updated items needs to be reindexed.OtherLanguageIntegrationUnitTest.php179Drupal\search_api\Tests\LanguageIntegrationUnitTest->testItemTranslations()
Three items are indexed.OtherLanguageIntegrationUnitTest.php181Drupal\search_api\Tests\LanguageIntegrationUnitTest->testItemTranslations()
LeafDrupal\search_api\Tests\LocalActionsWebTest1500
ExpandDrupal\search_api\Tests\OverviewPageTest7504
MessageGroupFilenameLineFunctionStatus
Illegal offset typeDrupal\Core\State\State->set(Array, Array) Drupal\search_api\Task\IndexTaskManager->startTracking(Object) Drupal\search_api\Entity\Index->postSave(Object, ) Drupal\Core\Entity\EntityStorageBase->doPostSave(Object, ) Drupal\Core\Entity\EntityStorageBase->save(Object) Drupal\Core\Config\Entity\ConfigEntityStorage->save(Object) Drupal\Core\Entity\Entity->save() Drupal\Core\Config\Entity\ConfigEntityBase->save() Drupal\search_api\Tests\WebTestBase->getTestIndex() Drupal\search_api\Tests\OverviewPageTest->testServerAndIndexCreation() Drupal\simpletest\TestBase->run(Array) simpletest_script_run_one_test('9', 'Drupal\search_api\Tests\OverviewPageTest') WarningState.php88Drupal\Core\State\State->set()
InvalidArgumentException: Placeholders must have a trailing [] if they are to be expanded with an array of values. in Drupal\Core\Database\Connection->expandArguments() (line 701 of /var/lib/drupaltestbot/sites/default/files/checkout/core/lib/Drupal/Core/Database/Connection.php). Drupal\Core\Database\Connection->expandArguments('SELECT 1 AS expression FROM {key_value} key_value WHERE ( (name = :db_condition_placeholder_0:db_condition_placeholder_1) AND (collection = :db_condition_placeholder_2) )', Array) Drupal\Core\Database\Connection->query('SELECT 1 AS expression FROM {key_value} key_value WHERE ( (name = :db_condition_placeholder_0:db_condition_placeholder_1) AND (collection = :db_condition_placeholder_2) )', Array, Array) Drupal\Core\Database\Driver\mysql\Connection->query('SELECT 1 AS expression FROM {key_value} key_value WHERE ( (name = :db_condition_placeholder_0:db_condition_placeholder_1) AND (collection = :db_condition_placeholder_2) )', Array, Array) Drupal\Core\Database\Query\Select->execute() Drupal\Core\Database\Query\Merge->execute() Drupal\Core\KeyValueStore\DatabaseStorage->set(Array, Array) Drupal\Core\State\State->set(Array, Array) Drupal\search_api\Task\IndexTaskManager->startTracking(Object) Drupal\search_api\Entity\Index->postSave(Object, ) Drupal\Core\Entity\EntityStorageBase->doPostSave(Object, ) Drupal\Core\Entity\EntityStorageBase->save(Object) Drupal\Core\Config\Entity\ConfigEntityStorage->save(Object) Drupal\Core\Entity\Entity->save() Drupal\Core\Config\Entity\ConfigEntityBase->save() Drupal\search_api\Tests\WebTestBase->getTestIndex() Drupal\search_api\Tests\OverviewPageTest->testServerAndIndexCreation() Drupal\simpletest\TestBase->run(Array) simpletest_script_run_one_test('9', 'Drupal\search_api\Tests\OverviewPageTest') Uncaught exceptionConnection.php701Drupal\Core\Database\Connection->expandArguments()
Illegal offset typeDrupal\Core\State\State->set(Array, Array) Drupal\search_api\Task\IndexTaskManager->startTracking(Object) Drupal\search_api\Entity\Index->postSave(Object, ) Drupal\Core\Entity\EntityStorageBase->doPostSave(Object, ) Drupal\Core\Entity\EntityStorageBase->save(Object) Drupal\Core\Config\Entity\ConfigEntityStorage->save(Object) Drupal\Core\Entity\Entity->save() Drupal\Core\Config\Entity\ConfigEntityBase->save() Drupal\search_api\Tests\WebTestBase->getTestIndex() Drupal\search_api\Tests\OverviewPageTest->testServerAndIndexStatusChanges() Drupal\simpletest\TestBase->run(Array) simpletest_script_run_one_test('9', 'Drupal\search_api\Tests\OverviewPageTest') WarningState.php88Drupal\Core\State\State->set()
InvalidArgumentException: Placeholders must have a trailing [] if they are to be expanded with an array of values. in Drupal\Core\Database\Connection->expandArguments() (line 701 of /var/lib/drupaltestbot/sites/default/files/checkout/core/lib/Drupal/Core/Database/Connection.php). Drupal\Core\Database\Connection->expandArguments('SELECT 1 AS expression FROM {key_value} key_value WHERE ( (name = :db_condition_placeholder_0:db_condition_placeholder_1) AND (collection = :db_condition_placeholder_2) )', Array) Drupal\Core\Database\Connection->query('SELECT 1 AS expression FROM {key_value} key_value WHERE ( (name = :db_condition_placeholder_0:db_condition_placeholder_1) AND (collection = :db_condition_placeholder_2) )', Array, Array) Drupal\Core\Database\Driver\mysql\Connection->query('SELECT 1 AS expression FROM {key_value} key_value WHERE ( (name = :db_condition_placeholder_0:db_condition_placeholder_1) AND (collection = :db_condition_placeholder_2) )', Array, Array) Drupal\Core\Database\Query\Select->execute() Drupal\Core\Database\Query\Merge->execute() Drupal\Core\KeyValueStore\DatabaseStorage->set(Array, Array) Drupal\Core\State\State->set(Array, Array) Drupal\search_api\Task\IndexTaskManager->startTracking(Object) Drupal\search_api\Entity\Index->postSave(Object, ) Drupal\Core\Entity\EntityStorageBase->doPostSave(Object, ) Drupal\Core\Entity\EntityStorageBase->save(Object) Drupal\Core\Config\Entity\ConfigEntityStorage->save(Object) Drupal\Core\Entity\Entity->save() Drupal\Core\Config\Entity\ConfigEntityBase->save() Drupal\search_api\Tests\WebTestBase->getTestIndex() Drupal\search_api\Tests\OverviewPageTest->testServerAndIndexStatusChanges() Drupal\simpletest\TestBase->run(Array) simpletest_script_run_one_test('9', 'Drupal\search_api\Tests\OverviewPageTest') Uncaught exceptionConnection.php701Drupal\Core\Database\Connection->expandArguments()
ExpandDrupal\search_api\Tests\Processor\ContentAccessTest68424
MessageGroupFilenameLineFunctionStatus
Illegal offset typeDrupal\Core\State\State->set(Array, Array) Drupal\search_api\Task\IndexTaskManager->startTracking(Object) Drupal\search_api\Entity\Index->postSave(Object, ) Drupal\Core\Entity\EntityStorageBase->doPostSave(Object, ) Drupal\Core\Entity\EntityStorageBase->save(Object) Drupal\Core\Config\Entity\ConfigEntityStorage->save(Object) Drupal\Core\Entity\Entity->save() Drupal\Core\Config\Entity\ConfigEntityBase->save() Drupal\search_api\Tests\Processor\ProcessorTestBase->setUp('content_access') Drupal\search_api\Tests\Processor\ContentAccessTest->setUp() Drupal\simpletest\TestBase->run(Array) simpletest_script_run_one_test('5', 'Drupal\search_api\Tests\Processor\ContentAccessTest') WarningState.php88Drupal\Core\State\State->set()
Illegal offset typeDrupal\Core\KeyValueStore\MemoryStorage->set(Array, Array) Drupal\Core\State\State->set(Array, Array) Drupal\search_api\Task\IndexTaskManager->startTracking(Object) Drupal\search_api\Entity\Index->postSave(Object, ) Drupal\Core\Entity\EntityStorageBase->doPostSave(Object, ) Drupal\Core\Entity\EntityStorageBase->save(Object) Drupal\Core\Config\Entity\ConfigEntityStorage->save(Object) Drupal\Core\Entity\Entity->save() Drupal\Core\Config\Entity\ConfigEntityBase->save() Drupal\search_api\Tests\Processor\ProcessorTestBase->setUp('content_access') Drupal\search_api\Tests\Processor\ContentAccessTest->setUp() Drupal\simpletest\TestBase->run(Array) simpletest_script_run_one_test('5', 'Drupal\search_api\Tests\Processor\ContentAccessTest') WarningMemoryStorage.php54Drupal\Core\KeyValueStore\MemoryStorage->set()
Illegal offset typeDrupal\Core\State\State->set(Array, Array) Drupal\search_api\Task\IndexTaskManager->startTracking(Object, Array) Drupal\search_api\Entity\Index->reactToDatasourceSwitch(Object) Drupal\search_api\Entity\Index->postSave(Object, 1) Drupal\Core\Entity\EntityStorageBase->doPostSave(Object, 1) Drupal\Core\Entity\EntityStorageBase->save(Object) Drupal\Core\Config\Entity\ConfigEntityStorage->save(Object) Drupal\Core\Entity\Entity->save() Drupal\Core\Config\Entity\ConfigEntityBase->save() Drupal\search_api\Tests\Processor\ContentAccessTest->setUp() Drupal\simpletest\TestBase->run(Array) simpletest_script_run_one_test('5', 'Drupal\search_api\Tests\Processor\ContentAccessTest') WarningState.php88Drupal\Core\State\State->set()
Illegal offset typeDrupal\Core\KeyValueStore\MemoryStorage->set(Array, Array) Drupal\Core\State\State->set(Array, Array) Drupal\search_api\Task\IndexTaskManager->startTracking(Object, Array) Drupal\search_api\Entity\Index->reactToDatasourceSwitch(Object) Drupal\search_api\Entity\Index->postSave(Object, 1) Drupal\Core\Entity\EntityStorageBase->doPostSave(Object, 1) Drupal\Core\Entity\EntityStorageBase->save(Object) Drupal\Core\Config\Entity\ConfigEntityStorage->save(Object) Drupal\Core\Entity\Entity->save() Drupal\Core\Config\Entity\ConfigEntityBase->save() Drupal\search_api\Tests\Processor\ContentAccessTest->setUp() Drupal\simpletest\TestBase->run(Array) simpletest_script_run_one_test('5', 'Drupal\search_api\Tests\Processor\ContentAccessTest') WarningMemoryStorage.php54Drupal\Core\KeyValueStore\MemoryStorage->set()
Value array ( ) is equal to value array ( 0 => 'entity:comment/1:en', 1 => 'entity:node/1:en', 2 => 'entity:node/2:en', 3 => 'entity:user/0:en', ).OtherContentAccessTest.php128Drupal\search_api\Tests\Processor\ContentAccessTest->testQueryAccessAll()
Illegal offset typeDrupal\Core\State\State->set(Array, Array) Drupal\search_api\Task\IndexTaskManager->startTracking(Object) Drupal\search_api\Entity\Index->postSave(Object, ) Drupal\Core\Entity\EntityStorageBase->doPostSave(Object, ) Drupal\Core\Entity\EntityStorageBase->save(Object) Drupal\Core\Config\Entity\ConfigEntityStorage->save(Object) Drupal\Core\Entity\Entity->save() Drupal\Core\Config\Entity\ConfigEntityBase->save() Drupal\search_api\Tests\Processor\ProcessorTestBase->setUp('content_access') Drupal\search_api\Tests\Processor\ContentAccessTest->setUp() Drupal\simpletest\TestBase->run(Array) simpletest_script_run_one_test('5', 'Drupal\search_api\Tests\Processor\ContentAccessTest') WarningState.php88Drupal\Core\State\State->set()
Illegal offset typeDrupal\Core\KeyValueStore\MemoryStorage->set(Array, Array) Drupal\Core\State\State->set(Array, Array) Drupal\search_api\Task\IndexTaskManager->startTracking(Object) Drupal\search_api\Entity\Index->postSave(Object, ) Drupal\Core\Entity\EntityStorageBase->doPostSave(Object, ) Drupal\Core\Entity\EntityStorageBase->save(Object) Drupal\Core\Config\Entity\ConfigEntityStorage->save(Object) Drupal\Core\Entity\Entity->save() Drupal\Core\Config\Entity\ConfigEntityBase->save() Drupal\search_api\Tests\Processor\ProcessorTestBase->setUp('content_access') Drupal\search_api\Tests\Processor\ContentAccessTest->setUp() Drupal\simpletest\TestBase->run(Array) simpletest_script_run_one_test('5', 'Drupal\search_api\Tests\Processor\ContentAccessTest') WarningMemoryStorage.php54Drupal\Core\KeyValueStore\MemoryStorage->set()
Illegal offset typeDrupal\Core\State\State->set(Array, Array) Drupal\search_api\Task\IndexTaskManager->startTracking(Object, Array) Drupal\search_api\Entity\Index->reactToDatasourceSwitch(Object) Drupal\search_api\Entity\Index->postSave(Object, 1) Drupal\Core\Entity\EntityStorageBase->doPostSave(Object, 1) Drupal\Core\Entity\EntityStorageBase->save(Object) Drupal\Core\Config\Entity\ConfigEntityStorage->save(Object) Drupal\Core\Entity\Entity->save() Drupal\Core\Config\Entity\ConfigEntityBase->save() Drupal\search_api\Tests\Processor\ContentAccessTest->setUp() Drupal\simpletest\TestBase->run(Array) simpletest_script_run_one_test('5', 'Drupal\search_api\Tests\Processor\ContentAccessTest') WarningState.php88Drupal\Core\State\State->set()
Illegal offset typeDrupal\Core\KeyValueStore\MemoryStorage->set(Array, Array) Drupal\Core\State\State->set(Array, Array) Drupal\search_api\Task\IndexTaskManager->startTracking(Object, Array) Drupal\search_api\Entity\Index->reactToDatasourceSwitch(Object) Drupal\search_api\Entity\Index->postSave(Object, 1) Drupal\Core\Entity\EntityStorageBase->doPostSave(Object, 1) Drupal\Core\Entity\EntityStorageBase->save(Object) Drupal\Core\Config\Entity\ConfigEntityStorage->save(Object) Drupal\Core\Entity\Entity->save() Drupal\Core\Config\Entity\ConfigEntityBase->save() Drupal\search_api\Tests\Processor\ContentAccessTest->setUp() Drupal\simpletest\TestBase->run(Array) simpletest_script_run_one_test('5', 'Drupal\search_api\Tests\Processor\ContentAccessTest') WarningMemoryStorage.php54Drupal\Core\KeyValueStore\MemoryStorage->set()
Value array ( ) is equal to value array ( 0 => 'entity:comment/1:en', 1 => 'entity:user/0:en', ).OtherContentAccessTest.php141Drupal\search_api\Tests\Processor\ContentAccessTest->testQueryAccessComments()
Illegal offset typeDrupal\Core\State\State->set(Array, Array) Drupal\search_api\Task\IndexTaskManager->startTracking(Object) Drupal\search_api\Entity\Index->postSave(Object, ) Drupal\Core\Entity\EntityStorageBase->doPostSave(Object, ) Drupal\Core\Entity\EntityStorageBase->save(Object) Drupal\Core\Config\Entity\ConfigEntityStorage->save(Object) Drupal\Core\Entity\Entity->save() Drupal\Core\Config\Entity\ConfigEntityBase->save() Drupal\search_api\Tests\Processor\ProcessorTestBase->setUp('content_access') Drupal\search_api\Tests\Processor\ContentAccessTest->setUp() Drupal\simpletest\TestBase->run(Array) simpletest_script_run_one_test('5', 'Drupal\search_api\Tests\Processor\ContentAccessTest') WarningState.php88Drupal\Core\State\State->set()
Illegal offset typeDrupal\Core\KeyValueStore\MemoryStorage->set(Array, Array) Drupal\Core\State\State->set(Array, Array) Drupal\search_api\Task\IndexTaskManager->startTracking(Object) Drupal\search_api\Entity\Index->postSave(Object, ) Drupal\Core\Entity\EntityStorageBase->doPostSave(Object, ) Drupal\Core\Entity\EntityStorageBase->save(Object) Drupal\Core\Config\Entity\ConfigEntityStorage->save(Object) Drupal\Core\Entity\Entity->save() Drupal\Core\Config\Entity\ConfigEntityBase->save() Drupal\search_api\Tests\Processor\ProcessorTestBase->setUp('content_access') Drupal\search_api\Tests\Processor\ContentAccessTest->setUp() Drupal\simpletest\TestBase->run(Array) simpletest_script_run_one_test('5', 'Drupal\search_api\Tests\Processor\ContentAccessTest') WarningMemoryStorage.php54Drupal\Core\KeyValueStore\MemoryStorage->set()
Illegal offset typeDrupal\Core\State\State->set(Array, Array) Drupal\search_api\Task\IndexTaskManager->startTracking(Object, Array) Drupal\search_api\Entity\Index->reactToDatasourceSwitch(Object) Drupal\search_api\Entity\Index->postSave(Object, 1) Drupal\Core\Entity\EntityStorageBase->doPostSave(Object, 1) Drupal\Core\Entity\EntityStorageBase->save(Object) Drupal\Core\Config\Entity\ConfigEntityStorage->save(Object) Drupal\Core\Entity\Entity->save() Drupal\Core\Config\Entity\ConfigEntityBase->save() Drupal\search_api\Tests\Processor\ContentAccessTest->setUp() Drupal\simpletest\TestBase->run(Array) simpletest_script_run_one_test('5', 'Drupal\search_api\Tests\Processor\ContentAccessTest') WarningState.php88Drupal\Core\State\State->set()
Illegal offset typeDrupal\Core\KeyValueStore\MemoryStorage->set(Array, Array) Drupal\Core\State\State->set(Array, Array) Drupal\search_api\Task\IndexTaskManager->startTracking(Object, Array) Drupal\search_api\Entity\Index->reactToDatasourceSwitch(Object) Drupal\search_api\Entity\Index->postSave(Object, 1) Drupal\Core\Entity\EntityStorageBase->doPostSave(Object, 1) Drupal\Core\Entity\EntityStorageBase->save(Object) Drupal\Core\Config\Entity\ConfigEntityStorage->save(Object) Drupal\Core\Entity\Entity->save() Drupal\Core\Config\Entity\ConfigEntityBase->save() Drupal\search_api\Tests\Processor\ContentAccessTest->setUp() Drupal\simpletest\TestBase->run(Array) simpletest_script_run_one_test('5', 'Drupal\search_api\Tests\Processor\ContentAccessTest') WarningMemoryStorage.php54Drupal\Core\KeyValueStore\MemoryStorage->set()
Value array ( ) is equal to value array ( 0 => 'entity:node/4:en', 1 => 'entity:user/0:en', 2 => 'entity:user/2:en', ).OtherContentAccessTest.php159Drupal\search_api\Tests\Processor\ContentAccessTest->testQueryAccessOwn()
Illegal offset typeDrupal\Core\State\State->set(Array, Array) Drupal\search_api\Task\IndexTaskManager->startTracking(Object) Drupal\search_api\Entity\Index->postSave(Object, ) Drupal\Core\Entity\EntityStorageBase->doPostSave(Object, ) Drupal\Core\Entity\EntityStorageBase->save(Object) Drupal\Core\Config\Entity\ConfigEntityStorage->save(Object) Drupal\Core\Entity\Entity->save() Drupal\Core\Config\Entity\ConfigEntityBase->save() Drupal\search_api\Tests\Processor\ProcessorTestBase->setUp('content_access') Drupal\search_api\Tests\Processor\ContentAccessTest->setUp() Drupal\simpletest\TestBase->run(Array) simpletest_script_run_one_test('5', 'Drupal\search_api\Tests\Processor\ContentAccessTest') WarningState.php88Drupal\Core\State\State->set()
Illegal offset typeDrupal\Core\KeyValueStore\MemoryStorage->set(Array, Array) Drupal\Core\State\State->set(Array, Array) Drupal\search_api\Task\IndexTaskManager->startTracking(Object) Drupal\search_api\Entity\Index->postSave(Object, ) Drupal\Core\Entity\EntityStorageBase->doPostSave(Object, ) Drupal\Core\Entity\EntityStorageBase->save(Object) Drupal\Core\Config\Entity\ConfigEntityStorage->save(Object) Drupal\Core\Entity\Entity->save() Drupal\Core\Config\Entity\ConfigEntityBase->save() Drupal\search_api\Tests\Processor\ProcessorTestBase->setUp('content_access') Drupal\search_api\Tests\Processor\ContentAccessTest->setUp() Drupal\simpletest\TestBase->run(Array) simpletest_script_run_one_test('5', 'Drupal\search_api\Tests\Processor\ContentAccessTest') WarningMemoryStorage.php54Drupal\Core\KeyValueStore\MemoryStorage->set()
Illegal offset typeDrupal\Core\State\State->set(Array, Array) Drupal\search_api\Task\IndexTaskManager->startTracking(Object, Array) Drupal\search_api\Entity\Index->reactToDatasourceSwitch(Object) Drupal\search_api\Entity\Index->postSave(Object, 1) Drupal\Core\Entity\EntityStorageBase->doPostSave(Object, 1) Drupal\Core\Entity\EntityStorageBase->save(Object) Drupal\Core\Config\Entity\ConfigEntityStorage->save(Object) Drupal\Core\Entity\Entity->save() Drupal\Core\Config\Entity\ConfigEntityBase->save() Drupal\search_api\Tests\Processor\ContentAccessTest->setUp() Drupal\simpletest\TestBase->run(Array) simpletest_script_run_one_test('5', 'Drupal\search_api\Tests\Processor\ContentAccessTest') WarningState.php88Drupal\Core\State\State->set()
Illegal offset typeDrupal\Core\KeyValueStore\MemoryStorage->set(Array, Array) Drupal\Core\State\State->set(Array, Array) Drupal\search_api\Task\IndexTaskManager->startTracking(Object, Array) Drupal\search_api\Entity\Index->reactToDatasourceSwitch(Object) Drupal\search_api\Entity\Index->postSave(Object, 1) Drupal\Core\Entity\EntityStorageBase->doPostSave(Object, 1) Drupal\Core\Entity\EntityStorageBase->save(Object) Drupal\Core\Config\Entity\ConfigEntityStorage->save(Object) Drupal\Core\Entity\Entity->save() Drupal\Core\Config\Entity\ConfigEntityBase->save() Drupal\search_api\Tests\Processor\ContentAccessTest->setUp() Drupal\simpletest\TestBase->run(Array) simpletest_script_run_one_test('5', 'Drupal\search_api\Tests\Processor\ContentAccessTest') WarningMemoryStorage.php54Drupal\Core\KeyValueStore\MemoryStorage->set()
Value array ( ) is equal to value array ( 0 => 'entity:node/1:en', 1 => 'entity:user/0:en', 2 => 'entity:user/2:en', ).OtherContentAccessTest.php185Drupal\search_api\Tests\Processor\ContentAccessTest->testQueryAccessWithNodeGrants()
Illegal offset typeDrupal\Core\State\State->set(Array, Array) Drupal\search_api\Task\IndexTaskManager->startTracking(Object) Drupal\search_api\Entity\Index->postSave(Object, ) Drupal\Core\Entity\EntityStorageBase->doPostSave(Object, ) Drupal\Core\Entity\EntityStorageBase->save(Object) Drupal\Core\Config\Entity\ConfigEntityStorage->save(Object) Drupal\Core\Entity\Entity->save() Drupal\Core\Config\Entity\ConfigEntityBase->save() Drupal\search_api\Tests\Processor\ProcessorTestBase->setUp('content_access') Drupal\search_api\Tests\Processor\ContentAccessTest->setUp() Drupal\simpletest\TestBase->run(Array) simpletest_script_run_one_test('5', 'Drupal\search_api\Tests\Processor\ContentAccessTest') WarningState.php88Drupal\Core\State\State->set()
Illegal offset typeDrupal\Core\KeyValueStore\MemoryStorage->set(Array, Array) Drupal\Core\State\State->set(Array, Array) Drupal\search_api\Task\IndexTaskManager->startTracking(Object) Drupal\search_api\Entity\Index->postSave(Object, ) Drupal\Core\Entity\EntityStorageBase->doPostSave(Object, ) Drupal\Core\Entity\EntityStorageBase->save(Object) Drupal\Core\Config\Entity\ConfigEntityStorage->save(Object) Drupal\Core\Entity\Entity->save() Drupal\Core\Config\Entity\ConfigEntityBase->save() Drupal\search_api\Tests\Processor\ProcessorTestBase->setUp('content_access') Drupal\search_api\Tests\Processor\ContentAccessTest->setUp() Drupal\simpletest\TestBase->run(Array) simpletest_script_run_one_test('5', 'Drupal\search_api\Tests\Processor\ContentAccessTest') WarningMemoryStorage.php54Drupal\Core\KeyValueStore\MemoryStorage->set()
Illegal offset typeDrupal\Core\State\State->set(Array, Array) Drupal\search_api\Task\IndexTaskManager->startTracking(Object, Array) Drupal\search_api\Entity\Index->reactToDatasourceSwitch(Object) Drupal\search_api\Entity\Index->postSave(Object, 1) Drupal\Core\Entity\EntityStorageBase->doPostSave(Object, 1) Drupal\Core\Entity\EntityStorageBase->save(Object) Drupal\Core\Config\Entity\ConfigEntityStorage->save(Object) Drupal\Core\Entity\Entity->save() Drupal\Core\Config\Entity\ConfigEntityBase->save() Drupal\search_api\Tests\Processor\ContentAccessTest->setUp() Drupal\simpletest\TestBase->run(Array) simpletest_script_run_one_test('5', 'Drupal\search_api\Tests\Processor\ContentAccessTest') WarningState.php88Drupal\Core\State\State->set()
Illegal offset typeDrupal\Core\KeyValueStore\MemoryStorage->set(Array, Array) Drupal\Core\State\State->set(Array, Array) Drupal\search_api\Task\IndexTaskManager->startTracking(Object, Array) Drupal\search_api\Entity\Index->reactToDatasourceSwitch(Object) Drupal\search_api\Entity\Index->postSave(Object, 1) Drupal\Core\Entity\EntityStorageBase->doPostSave(Object, 1) Drupal\Core\Entity\EntityStorageBase->save(Object) Drupal\Core\Config\Entity\ConfigEntityStorage->save(Object) Drupal\Core\Entity\Entity->save() Drupal\Core\Config\Entity\ConfigEntityBase->save() Drupal\search_api\Tests\Processor\ContentAccessTest->setUp() Drupal\simpletest\TestBase->run(Array) simpletest_script_run_one_test('5', 'Drupal\search_api\Tests\Processor\ContentAccessTest') WarningMemoryStorage.php54Drupal\Core\KeyValueStore\MemoryStorage->set()
Illegal offset typeDrupal\Core\State\State->set(Array, Array) Drupal\search_api\Task\IndexTaskManager->startTracking(Object) Drupal\search_api\Entity\Index->postSave(Object, ) Drupal\Core\Entity\EntityStorageBase->doPostSave(Object, ) Drupal\Core\Entity\EntityStorageBase->save(Object) Drupal\Core\Config\Entity\ConfigEntityStorage->save(Object) Drupal\Core\Entity\Entity->save() Drupal\Core\Config\Entity\ConfigEntityBase->save() Drupal\search_api\Tests\Processor\ProcessorTestBase->setUp('content_access') Drupal\search_api\Tests\Processor\ContentAccessTest->setUp() Drupal\simpletest\TestBase->run(Array) simpletest_script_run_one_test('5', 'Drupal\search_api\Tests\Processor\ContentAccessTest') WarningState.php88Drupal\Core\State\State->set()
Illegal offset typeDrupal\Core\KeyValueStore\MemoryStorage->set(Array, Array) Drupal\Core\State\State->set(Array, Array) Drupal\search_api\Task\IndexTaskManager->startTracking(Object) Drupal\search_api\Entity\Index->postSave(Object, ) Drupal\Core\Entity\EntityStorageBase->doPostSave(Object, ) Drupal\Core\Entity\EntityStorageBase->save(Object) Drupal\Core\Config\Entity\ConfigEntityStorage->save(Object) Drupal\Core\Entity\Entity->save() Drupal\Core\Config\Entity\ConfigEntityBase->save() Drupal\search_api\Tests\Processor\ProcessorTestBase->setUp('content_access') Drupal\search_api\Tests\Processor\ContentAccessTest->setUp() Drupal\simpletest\TestBase->run(Array) simpletest_script_run_one_test('5', 'Drupal\search_api\Tests\Processor\ContentAccessTest') WarningMemoryStorage.php54Drupal\Core\KeyValueStore\MemoryStorage->set()
Illegal offset typeDrupal\Core\State\State->set(Array, Array) Drupal\search_api\Task\IndexTaskManager->startTracking(Object, Array) Drupal\search_api\Entity\Index->reactToDatasourceSwitch(Object) Drupal\search_api\Entity\Index->postSave(Object, 1) Drupal\Core\Entity\EntityStorageBase->doPostSave(Object, 1) Drupal\Core\Entity\EntityStorageBase->save(Object) Drupal\Core\Config\Entity\ConfigEntityStorage->save(Object) Drupal\Core\Entity\Entity->save() Drupal\Core\Config\Entity\ConfigEntityBase->save() Drupal\search_api\Tests\Processor\ContentAccessTest->setUp() Drupal\simpletest\TestBase->run(Array) simpletest_script_run_one_test('5', 'Drupal\search_api\Tests\Processor\ContentAccessTest') WarningState.php88Drupal\Core\State\State->set()
Illegal offset typeDrupal\Core\KeyValueStore\MemoryStorage->set(Array, Array) Drupal\Core\State\State->set(Array, Array) Drupal\search_api\Task\IndexTaskManager->startTracking(Object, Array) Drupal\search_api\Entity\Index->reactToDatasourceSwitch(Object) Drupal\search_api\Entity\Index->postSave(Object, 1) Drupal\Core\Entity\EntityStorageBase->doPostSave(Object, 1) Drupal\Core\Entity\EntityStorageBase->save(Object) Drupal\Core\Config\Entity\ConfigEntityStorage->save(Object) Drupal\Core\Entity\Entity->save() Drupal\Core\Config\Entity\ConfigEntityBase->save() Drupal\search_api\Tests\Processor\ContentAccessTest->setUp() Drupal\simpletest\TestBase->run(Array) simpletest_script_run_one_test('5', 'Drupal\search_api\Tests\Processor\ContentAccessTest') WarningMemoryStorage.php54Drupal\Core\KeyValueStore\MemoryStorage->set()
LeafDrupal\search_api\Tests\Processor\ProcessorIntegrationTest7300
ExpandDrupal\search_api\Tests\Processor\RenderedItemTest4204
MessageGroupFilenameLineFunctionStatus
Illegal offset typeDrupal\Core\State\State->set(Array, Array) Drupal\search_api\Task\IndexTaskManager->startTracking(Object) Drupal\search_api\Entity\Index->postSave(Object, ) Drupal\Core\Entity\EntityStorageBase->doPostSave(Object, ) Drupal\Core\Entity\EntityStorageBase->save(Object) Drupal\Core\Config\Entity\ConfigEntityStorage->save(Object) Drupal\Core\Entity\Entity->save() Drupal\Core\Config\Entity\ConfigEntityBase->save() Drupal\search_api\Tests\Processor\ProcessorTestBase->setUp('rendered_item') Drupal\search_api\Tests\Processor\RenderedItemTest->setUp() Drupal\simpletest\TestBase->run(Array) simpletest_script_run_one_test('3', 'Drupal\search_api\Tests\Processor\RenderedItemTest') WarningState.php88Drupal\Core\State\State->set()
Illegal offset typeDrupal\Core\KeyValueStore\MemoryStorage->set(Array, Array) Drupal\Core\State\State->set(Array, Array) Drupal\search_api\Task\IndexTaskManager->startTracking(Object) Drupal\search_api\Entity\Index->postSave(Object, ) Drupal\Core\Entity\EntityStorageBase->doPostSave(Object, ) Drupal\Core\Entity\EntityStorageBase->save(Object) Drupal\Core\Config\Entity\ConfigEntityStorage->save(Object) Drupal\Core\Entity\Entity->save() Drupal\Core\Config\Entity\ConfigEntityBase->save() Drupal\search_api\Tests\Processor\ProcessorTestBase->setUp('rendered_item') Drupal\search_api\Tests\Processor\RenderedItemTest->setUp() Drupal\simpletest\TestBase->run(Array) simpletest_script_run_one_test('3', 'Drupal\search_api\Tests\Processor\RenderedItemTest') WarningMemoryStorage.php54Drupal\Core\KeyValueStore\MemoryStorage->set()
Illegal offset typeDrupal\Core\State\State->set(Array, Array) Drupal\search_api\Task\IndexTaskManager->startTracking(Object) Drupal\search_api\Entity\Index->postSave(Object, ) Drupal\Core\Entity\EntityStorageBase->doPostSave(Object, ) Drupal\Core\Entity\EntityStorageBase->save(Object) Drupal\Core\Config\Entity\ConfigEntityStorage->save(Object) Drupal\Core\Entity\Entity->save() Drupal\Core\Config\Entity\ConfigEntityBase->save() Drupal\search_api\Tests\Processor\ProcessorTestBase->setUp('rendered_item') Drupal\search_api\Tests\Processor\RenderedItemTest->setUp() Drupal\simpletest\TestBase->run(Array) simpletest_script_run_one_test('3', 'Drupal\search_api\Tests\Processor\RenderedItemTest') WarningState.php88Drupal\Core\State\State->set()
Illegal offset typeDrupal\Core\KeyValueStore\MemoryStorage->set(Array, Array) Drupal\Core\State\State->set(Array, Array) Drupal\search_api\Task\IndexTaskManager->startTracking(Object) Drupal\search_api\Entity\Index->postSave(Object, ) Drupal\Core\Entity\EntityStorageBase->doPostSave(Object, ) Drupal\Core\Entity\EntityStorageBase->save(Object) Drupal\Core\Config\Entity\ConfigEntityStorage->save(Object) Drupal\Core\Entity\Entity->save() Drupal\Core\Config\Entity\ConfigEntityBase->save() Drupal\search_api\Tests\Processor\ProcessorTestBase->setUp('rendered_item') Drupal\search_api\Tests\Processor\RenderedItemTest->setUp() Drupal\simpletest\TestBase->run(Array) simpletest_script_run_one_test('3', 'Drupal\search_api\Tests\Processor\RenderedItemTest') WarningMemoryStorage.php54Drupal\Core\KeyValueStore\MemoryStorage->set()
LeafDrupal\search_api\Tests\ServerStorageUnitTest600
ExpandDrupal\search_api\Tests\ServerTaskUnitTest59010
MessageGroupFilenameLineFunctionStatus
Illegal offset typeDrupal\Core\State\State->set(Array, Array) Drupal\search_api\Task\IndexTaskManager->startTracking(Object) Drupal\search_api\Entity\Index->postSave(Object, ) Drupal\Core\Entity\EntityStorageBase->doPostSave(Object, ) Drupal\Core\Entity\EntityStorageBase->save(Object) Drupal\Core\Config\Entity\ConfigEntityStorage->save(Object) Drupal\Core\Entity\Entity->save() Drupal\Core\Config\Entity\ConfigEntityBase->save() Drupal\search_api\Tests\ServerTaskUnitTest->setUp() Drupal\simpletest\TestBase->run(Array) simpletest_script_run_one_test('7', 'Drupal\search_api\Tests\ServerTaskUnitTest') WarningState.php88Drupal\Core\State\State->set()
Illegal offset typeDrupal\Core\KeyValueStore\MemoryStorage->set(Array, Array) Drupal\Core\State\State->set(Array, Array) Drupal\search_api\Task\IndexTaskManager->startTracking(Object) Drupal\search_api\Entity\Index->postSave(Object, ) Drupal\Core\Entity\EntityStorageBase->doPostSave(Object, ) Drupal\Core\Entity\EntityStorageBase->save(Object) Drupal\Core\Config\Entity\ConfigEntityStorage->save(Object) Drupal\Core\Entity\Entity->save() Drupal\Core\Config\Entity\ConfigEntityBase->save() Drupal\search_api\Tests\ServerTaskUnitTest->setUp() Drupal\simpletest\TestBase->run(Array) simpletest_script_run_one_test('7', 'Drupal\search_api\Tests\ServerTaskUnitTest') WarningMemoryStorage.php54Drupal\Core\KeyValueStore\MemoryStorage->set()
Illegal offset typeDrupal\Core\State\State->set(Array, Array) Drupal\search_api\Task\IndexTaskManager->startTracking(Object) Drupal\search_api\Entity\Index->postSave(Object, ) Drupal\Core\Entity\EntityStorageBase->doPostSave(Object, ) Drupal\Core\Entity\EntityStorageBase->save(Object) Drupal\Core\Config\Entity\ConfigEntityStorage->save(Object) Drupal\Core\Entity\Entity->save() Drupal\Core\Config\Entity\ConfigEntityBase->save() Drupal\search_api\Tests\ServerTaskUnitTest->setUp() Drupal\simpletest\TestBase->run(Array) simpletest_script_run_one_test('7', 'Drupal\search_api\Tests\ServerTaskUnitTest') WarningState.php88Drupal\Core\State\State->set()
Illegal offset typeDrupal\Core\KeyValueStore\MemoryStorage->set(Array, Array) Drupal\Core\State\State->set(Array, Array) Drupal\search_api\Task\IndexTaskManager->startTracking(Object) Drupal\search_api\Entity\Index->postSave(Object, ) Drupal\Core\Entity\EntityStorageBase->doPostSave(Object, ) Drupal\Core\Entity\EntityStorageBase->save(Object) Drupal\Core\Config\Entity\ConfigEntityStorage->save(Object) Drupal\Core\Entity\Entity->save() Drupal\Core\Config\Entity\ConfigEntityBase->save() Drupal\search_api\Tests\ServerTaskUnitTest->setUp() Drupal\simpletest\TestBase->run(Array) simpletest_script_run_one_test('7', 'Drupal\search_api\Tests\ServerTaskUnitTest') WarningMemoryStorage.php54Drupal\Core\KeyValueStore\MemoryStorage->set()
Illegal offset typeDrupal\Core\State\State->set(Array, Array) Drupal\search_api\Task\IndexTaskManager->startTracking(Object) Drupal\search_api\Entity\Index->postSave(Object, ) Drupal\Core\Entity\EntityStorageBase->doPostSave(Object, ) Drupal\Core\Entity\EntityStorageBase->save(Object) Drupal\Core\Config\Entity\ConfigEntityStorage->save(Object) Drupal\Core\Entity\Entity->save() Drupal\Core\Config\Entity\ConfigEntityBase->save() Drupal\search_api\Tests\ServerTaskUnitTest->setUp() Drupal\simpletest\TestBase->run(Array) simpletest_script_run_one_test('7', 'Drupal\search_api\Tests\ServerTaskUnitTest') WarningState.php88Drupal\Core\State\State->set()
Illegal offset typeDrupal\Core\KeyValueStore\MemoryStorage->set(Array, Array) Drupal\Core\State\State->set(Array, Array) Drupal\search_api\Task\IndexTaskManager->startTracking(Object) Drupal\search_api\Entity\Index->postSave(Object, ) Drupal\Core\Entity\EntityStorageBase->doPostSave(Object, ) Drupal\Core\Entity\EntityStorageBase->save(Object) Drupal\Core\Config\Entity\ConfigEntityStorage->save(Object) Drupal\Core\Entity\Entity->save() Drupal\Core\Config\Entity\ConfigEntityBase->save() Drupal\search_api\Tests\ServerTaskUnitTest->setUp() Drupal\simpletest\TestBase->run(Array) simpletest_script_run_one_test('7', 'Drupal\search_api\Tests\ServerTaskUnitTest') WarningMemoryStorage.php54Drupal\Core\KeyValueStore\MemoryStorage->set()
Illegal offset typeDrupal\Core\State\State->set(Array, Array) Drupal\search_api\Task\IndexTaskManager->startTracking(Object) Drupal\search_api\Entity\Index->postSave(Object, ) Drupal\Core\Entity\EntityStorageBase->doPostSave(Object, ) Drupal\Core\Entity\EntityStorageBase->save(Object) Drupal\Core\Config\Entity\ConfigEntityStorage->save(Object) Drupal\Core\Entity\Entity->save() Drupal\Core\Config\Entity\ConfigEntityBase->save() Drupal\search_api\Tests\ServerTaskUnitTest->setUp() Drupal\simpletest\TestBase->run(Array) simpletest_script_run_one_test('7', 'Drupal\search_api\Tests\ServerTaskUnitTest') WarningState.php88Drupal\Core\State\State->set()
Illegal offset typeDrupal\Core\KeyValueStore\MemoryStorage->set(Array, Array) Drupal\Core\State\State->set(Array, Array) Drupal\search_api\Task\IndexTaskManager->startTracking(Object) Drupal\search_api\Entity\Index->postSave(Object, ) Drupal\Core\Entity\EntityStorageBase->doPostSave(Object, ) Drupal\Core\Entity\EntityStorageBase->save(Object) Drupal\Core\Config\Entity\ConfigEntityStorage->save(Object) Drupal\Core\Entity\Entity->save() Drupal\Core\Config\Entity\ConfigEntityBase->save() Drupal\search_api\Tests\ServerTaskUnitTest->setUp() Drupal\simpletest\TestBase->run(Array) simpletest_script_run_one_test('7', 'Drupal\search_api\Tests\ServerTaskUnitTest') WarningMemoryStorage.php54Drupal\Core\KeyValueStore\MemoryStorage->set()
Illegal offset typeDrupal\Core\State\State->set(Array, Array) Drupal\search_api\Task\IndexTaskManager->startTracking(Object) Drupal\search_api\Entity\Index->postSave(Object, ) Drupal\Core\Entity\EntityStorageBase->doPostSave(Object, ) Drupal\Core\Entity\EntityStorageBase->save(Object) Drupal\Core\Config\Entity\ConfigEntityStorage->save(Object) Drupal\Core\Entity\Entity->save() Drupal\Core\Config\Entity\ConfigEntityBase->save() Drupal\search_api\Tests\ServerTaskUnitTest->setUp() Drupal\simpletest\TestBase->run(Array) simpletest_script_run_one_test('7', 'Drupal\search_api\Tests\ServerTaskUnitTest') WarningState.php88Drupal\Core\State\State->set()
Illegal offset typeDrupal\Core\KeyValueStore\MemoryStorage->set(Array, Array) Drupal\Core\State\State->set(Array, Array) Drupal\search_api\Task\IndexTaskManager->startTracking(Object) Drupal\search_api\Entity\Index->postSave(Object, ) Drupal\Core\Entity\EntityStorageBase->doPostSave(Object, ) Drupal\Core\Entity\EntityStorageBase->save(Object) Drupal\Core\Config\Entity\ConfigEntityStorage->save(Object) Drupal\Core\Entity\Entity->save() Drupal\Core\Config\Entity\ConfigEntityBase->save() Drupal\search_api\Tests\ServerTaskUnitTest->setUp() Drupal\simpletest\TestBase->run(Array) simpletest_script_run_one_test('7', 'Drupal\search_api\Tests\ServerTaskUnitTest') WarningMemoryStorage.php54Drupal\Core\KeyValueStore\MemoryStorage->set()
ExpandDrupal\search_api\Tests\ViewsTest012
MessageGroupFilenameLineFunctionStatus
The test did not complete due to a fatal error.Completion checkViewsTest.php45Drupal\search_api\Tests\ViewsTest->testFulltextSearch()
Illegal offset typeDrupal\Core\State\State->set(Array, Array) Drupal\search_api\Task\IndexTaskManager->startTracking(Object) Drupal\search_api\Entity\Index->postSave(Object, ) Drupal\Core\Entity\EntityStorageBase->doPostSave(Object, ) Drupal\Core\Entity\EntityStorageBase->save(Object) Drupal\Core\Config\Entity\ConfigEntityStorage->save(Object) Drupal\Core\Entity\Entity->save() Drupal\Core\Config\Entity\ConfigEntityBase->save() Drupal\Core\Config\ConfigInstaller->createConfiguration('', Array) Drupal\Core\Config\ConfigInstaller->installDefaultConfig('module', 'search_api_test_db') Drupal\Core\ProxyClass\Config\ConfigInstaller->installDefaultConfig('module', 'search_api_test_db') Drupal\Core\Extension\ModuleInstaller->install(Array, 1) Drupal\Core\ProxyClass\Extension\ModuleInstaller->install(Array, 1) Drupal\simpletest\WebTestBase->installModulesFromClassProperty(Object) Drupal\simpletest\WebTestBase->setUp() Drupal\search_api\Tests\WebTestBase->setUp() Drupal\search_api\Tests\ViewsTest->setUp() Drupal\simpletest\TestBase->run(Array) simpletest_script_run_one_test('6', 'Drupal\search_api\Tests\ViewsTest') WarningState.php88Drupal\Core\State\State->set()
InvalidArgumentException: Placeholders must have a trailing [] if they are to be expanded with an array of values. in Drupal\Core\Database\Connection->expandArguments() (line 701 of /var/lib/drupaltestbot/sites/default/files/checkout/core/lib/Drupal/Core/Database/Connection.php). Drupal\Core\Database\Connection->expandArguments('SELECT 1 AS expression FROM {key_value} key_value WHERE ( (name = :db_condition_placeholder_0:db_condition_placeholder_1) AND (collection = :db_condition_placeholder_2) )', Array) Drupal\Core\Database\Connection->query('SELECT 1 AS expression FROM {key_value} key_value WHERE ( (name = :db_condition_placeholder_0:db_condition_placeholder_1) AND (collection = :db_condition_placeholder_2) )', Array, Array) Drupal\Core\Database\Driver\mysql\Connection->query('SELECT 1 AS expression FROM {key_value} key_value WHERE ( (name = :db_condition_placeholder_0:db_condition_placeholder_1) AND (collection = :db_condition_placeholder_2) )', Array, Array) Drupal\Core\Database\Query\Select->execute() Drupal\Core\Database\Query\Merge->execute() Drupal\Core\KeyValueStore\DatabaseStorage->set(Array, Array) Drupal\Core\State\State->set(Array, Array) Drupal\search_api\Task\IndexTaskManager->startTracking(Object) Drupal\search_api\Entity\Index->postSave(Object, ) Drupal\Core\Entity\EntityStorageBase->doPostSave(Object, ) Drupal\Core\Entity\EntityStorageBase->save(Object) Drupal\Core\Config\Entity\ConfigEntityStorage->save(Object) Drupal\Core\Entity\Entity->save() Drupal\Core\Config\Entity\ConfigEntityBase->save() Drupal\Core\Config\ConfigInstaller->createConfiguration('', Array) Drupal\Core\Config\ConfigInstaller->installDefaultConfig('module', 'search_api_test_db') Drupal\Core\ProxyClass\Config\ConfigInstaller->installDefaultConfig('module', 'search_api_test_db') Drupal\Core\Extension\ModuleInstaller->install(Array, 1) Drupal\Core\ProxyClass\Extension\ModuleInstaller->install(Array, 1) Drupal\simpletest\WebTestBase->installModulesFromClassProperty(Object) Drupal\simpletest\WebTestBase->setUp() Drupal\search_api\Tests\WebTestBase->setUp() Drupal\search_api\Tests\ViewsTest->setUp() Drupal\simpletest\TestBase->run(Array) simpletest_script_run_one_test('6', 'Drupal\search_api\Tests\ViewsTest') Uncaught exceptionConnection.php701Drupal\Core\Database\Connection->expandArguments()
ExpandDrupal\search_api_db\Tests\BackendTest100648
MessageGroupFilenameLineFunctionStatus
Illegal offset typeDrupal\Core\State\State->set(Array, Array) Drupal\search_api\Task\IndexTaskManager->startTracking(Object) Drupal\search_api\Entity\Index->postSave(Object, ) Drupal\Core\Entity\EntityStorageBase->doPostSave(Object, ) Drupal\Core\Entity\EntityStorageBase->save(Object) Drupal\Core\Config\Entity\ConfigEntityStorage->save(Object) Drupal\Core\Entity\Entity->save() Drupal\Core\Config\Entity\ConfigEntityBase->save() Drupal\Core\Config\ConfigInstaller->createConfiguration('', Array) Drupal\Core\Config\ConfigInstaller->installDefaultConfig('module', 'search_api_test_db') Drupal\Core\ProxyClass\Config\ConfigInstaller->installDefaultConfig('module', 'search_api_test_db') Drupal\simpletest\KernelTestBase->installConfig(Array) Drupal\search_api_db\Tests\BackendTest->setUp() Drupal\simpletest\TestBase->run(Array) simpletest_script_run_one_test('2', 'Drupal\search_api_db\Tests\BackendTest') WarningState.php88Drupal\Core\State\State->set()
Illegal offset typeDrupal\Core\KeyValueStore\MemoryStorage->set(Array, Array) Drupal\Core\State\State->set(Array, Array) Drupal\search_api\Task\IndexTaskManager->startTracking(Object) Drupal\search_api\Entity\Index->postSave(Object, ) Drupal\Core\Entity\EntityStorageBase->doPostSave(Object, ) Drupal\Core\Entity\EntityStorageBase->save(Object) Drupal\Core\Config\Entity\ConfigEntityStorage->save(Object) Drupal\Core\Entity\Entity->save() Drupal\Core\Config\Entity\ConfigEntityBase->save() Drupal\Core\Config\ConfigInstaller->createConfiguration('', Array) Drupal\Core\Config\ConfigInstaller->installDefaultConfig('module', 'search_api_test_db') Drupal\Core\ProxyClass\Config\ConfigInstaller->installDefaultConfig('module', 'search_api_test_db') Drupal\simpletest\KernelTestBase->installConfig(Array) Drupal\search_api_db\Tests\BackendTest->setUp() Drupal\simpletest\TestBase->run(Array) simpletest_script_run_one_test('2', 'Drupal\search_api_db\Tests\BackendTest') WarningMemoryStorage.php54Drupal\Core\KeyValueStore\MemoryStorage->set()
Correct item count.OtherBackendTest.php130Drupal\search_api_db\Tests\BackendTest->checkDefaultIndex()
Search for »test« returned correct number of results.OtherBackendTest.php242Drupal\search_api_db\Tests\BackendTest->searchSuccess1()
Search for »test« returned correct result.OtherBackendTest.php243Drupal\search_api_db\Tests\BackendTest->searchSuccess1()
Value NULL is equal to value 'entity:entity_test/2:en'.OtherBackendTest.php249Drupal\search_api_db\Tests\BackendTest->searchSuccess1()
Search for »test foo« returned correct number of results.OtherBackendTest.php255Drupal\search_api_db\Tests\BackendTest->searchSuccess1()
Search for »test foo« returned correct result.OtherBackendTest.php256Drupal\search_api_db\Tests\BackendTest->searchSuccess1()
Search for »foo« returned correct number of results.OtherBackendTest.php261Drupal\search_api_db\Tests\BackendTest->searchSuccess1()
Search for »foo« returned correct result.OtherBackendTest.php262Drupal\search_api_db\Tests\BackendTest->searchSuccess1()
Complex search 1 returned correct number of results.OtherBackendTest.php282Drupal\search_api_db\Tests\BackendTest->searchSuccess1()
Complex search 1 returned correct result.OtherBackendTest.php283Drupal\search_api_db\Tests\BackendTest->searchSuccess1()
OR facets query returned correct number of results.OtherBackendTest.php306Drupal\search_api_db\Tests\BackendTest->checkFacets()
usort() expects parameter 1 to be array, null givenusort(NULL, Array) Drupal\search_api_db\Tests\BackendTest->checkFacets() Drupal\search_api_db\Tests\BackendTest->testFramework() Drupal\simpletest\TestBase->run(Array) simpletest_script_run_one_test('2', 'Drupal\search_api_db\Tests\BackendTest') WarningBackendTest.php313Drupal\search_api_db\Tests\BackendTest->checkFacets()
Correct OR facets were returnedOtherBackendTest.php314Drupal\search_api_db\Tests\BackendTest->checkFacets()
OR facets query returned correct number of results.OtherBackendTest.php333Drupal\search_api_db\Tests\BackendTest->checkFacets()
usort() expects parameter 1 to be array, null givenusort(NULL, Array) Drupal\search_api_db\Tests\BackendTest->checkFacets() Drupal\search_api_db\Tests\BackendTest->testFramework() Drupal\simpletest\TestBase->run(Array) simpletest_script_run_one_test('2', 'Drupal\search_api_db\Tests\BackendTest') WarningBackendTest.php339Drupal\search_api_db\Tests\BackendTest->checkFacets()
Correct OR facets were returnedOtherBackendTest.php340Drupal\search_api_db\Tests\BackendTest->checkFacets()
Sorting on field with NULLs returned correct number of results.OtherBackendTest.php460Drupal\search_api_db\Tests\BackendTest->regressionTests()
Sorting on field with NULLs returned correct result.OtherBackendTest.php461Drupal\search_api_db\Tests\BackendTest->regressionTests()
OR filter on field with NULLs returned correct number of results.OtherBackendTest.php472Drupal\search_api_db\Tests\BackendTest->regressionTests()
OR filter on field with NULLs returned correct result.OtherBackendTest.php473Drupal\search_api_db\Tests\BackendTest->regressionTests()
OR filter on multi-valued field returned correct number of results.OtherBackendTest.php485Drupal\search_api_db\Tests\BackendTest->regressionTests()
OR filter on multi-valued field returned correct result.OtherBackendTest.php486Drupal\search_api_db\Tests\BackendTest->regressionTests()
Multiple OR filters on multi-valued field returned correct number of results.OtherBackendTest.php501Drupal\search_api_db\Tests\BackendTest->regressionTests()
Multiple OR filters on multi-valued field returned correct result.OtherBackendTest.php502Drupal\search_api_db\Tests\BackendTest->regressionTests()
Complex nested filters on multi-valued field returned correct number of results.OtherBackendTest.php519Drupal\search_api_db\Tests\BackendTest->regressionTests()
Complex nested filters on multi-valued field returned correct result.OtherBackendTest.php520Drupal\search_api_db\Tests\BackendTest->regressionTests()
usort() expects parameter 1 to be array, null givenusort(NULL, Array) Drupal\search_api_db\Tests\BackendTest->regressionTests() Drupal\search_api_db\Tests\BackendTest->testFramework() Drupal\simpletest\TestBase->run(Array) simpletest_script_run_one_test('2', 'Drupal\search_api_db\Tests\BackendTest') WarningBackendTest.php541Drupal\search_api_db\Tests\BackendTest->regressionTests()
Correct facets were returnedOtherBackendTest.php542Drupal\search_api_db\Tests\BackendTest->regressionTests()
usort() expects parameter 1 to be array, null givenusort(NULL, Array) Drupal\search_api_db\Tests\BackendTest->regressionTests() Drupal\search_api_db\Tests\BackendTest->testFramework() Drupal\simpletest\TestBase->run(Array) simpletest_script_run_one_test('2', 'Drupal\search_api_db\Tests\BackendTest') WarningBackendTest.php554Drupal\search_api_db\Tests\BackendTest->regressionTests()
Correct facets were returnedOtherBackendTest.php555Drupal\search_api_db\Tests\BackendTest->regressionTests()
OR keywords returned correct number of results.OtherBackendTest.php566Drupal\search_api_db\Tests\BackendTest->regressionTests()
OR keywords returned correct result.OtherBackendTest.php567Drupal\search_api_db\Tests\BackendTest->regressionTests()
Multi-field OR keywords returned correct number of results.OtherBackendTest.php574Drupal\search_api_db\Tests\BackendTest->regressionTests()
Nested OR keywords returned correct number of results.OtherBackendTest.php592Drupal\search_api_db\Tests\BackendTest->regressionTests()
Nested OR keywords returned correct result.OtherBackendTest.php593Drupal\search_api_db\Tests\BackendTest->regressionTests()
Nested multi-field OR keywords returned correct number of results.OtherBackendTest.php613Drupal\search_api_db\Tests\BackendTest->regressionTests()
Nested multi-field OR keywords returned correct result.OtherBackendTest.php614Drupal\search_api_db\Tests\BackendTest->regressionTests()
Negated AND fulltext search returned correct number of results.OtherBackendTest.php626Drupal\search_api_db\Tests\BackendTest->regressionTests()
Negated AND fulltext search returned correct result.OtherBackendTest.php627Drupal\search_api_db\Tests\BackendTest->regressionTests()
Negated OR fulltext search returned correct number of results.OtherBackendTest.php638Drupal\search_api_db\Tests\BackendTest->regressionTests()
Negated OR fulltext search returned correct result.OtherBackendTest.php639Drupal\search_api_db\Tests\BackendTest->regressionTests()
Nested NOT AND fulltext search returned correct number of results.OtherBackendTest.php654Drupal\search_api_db\Tests\BackendTest->regressionTests()
Nested NOT AND fulltext search returned correct result.OtherBackendTest.php655Drupal\search_api_db\Tests\BackendTest->regressionTests()
Undefined index: typeDrupal\search_api_db\Tests\BackendTest->regressionTests() Drupal\search_api_db\Tests\BackendTest->testFramework() Drupal\simpletest\TestBase->run(Array) simpletest_script_run_one_test('2', 'Drupal\search_api_db\Tests\BackendTest') NoticeBackendTest.php692Drupal\search_api_db\Tests\BackendTest->regressionTests()
usort() expects parameter 1 to be array, null givenusort(NULL, Array) Drupal\search_api_db\Tests\BackendTest->regressionTests() Drupal\search_api_db\Tests\BackendTest->testFramework() Drupal\simpletest\TestBase->run(Array) simpletest_script_run_one_test('2', 'Drupal\search_api_db\Tests\BackendTest') WarningBackendTest.php693Drupal\search_api_db\Tests\BackendTest->regressionTests()
Correct facets were returnedOtherBackendTest.php694Drupal\search_api_db\Tests\BackendTest->regressionTests()
Search for »test« returned correct number of results.OtherBackendTest.php366Drupal\search_api_db\Tests\BackendTest->searchSuccess2()
Search for »test« returned correct result.OtherBackendTest.php367Drupal\search_api_db\Tests\BackendTest->searchSuccess2()
Search with multi-term fulltext filter returned correct number of results.OtherBackendTest.php372Drupal\search_api_db\Tests\BackendTest->searchSuccess2()
Search with multi-term fulltext filter returned correct result.OtherBackendTest.php373Drupal\search_api_db\Tests\BackendTest->searchSuccess2()
Search for »test foo« returned correct number of results.OtherBackendTest.php378Drupal\search_api_db\Tests\BackendTest->searchSuccess2()
Search for »test foo« returned correct result.OtherBackendTest.php379Drupal\search_api_db\Tests\BackendTest->searchSuccess2()
Search for »foo« returned correct number of results.OtherBackendTest.php384Drupal\search_api_db\Tests\BackendTest->searchSuccess2()
Search for »foo« returned correct result.OtherBackendTest.php385Drupal\search_api_db\Tests\BackendTest->searchSuccess2()
Complex search 1 returned correct number of results.OtherBackendTest.php405Drupal\search_api_db\Tests\BackendTest->searchSuccess2()
Complex search 1 returned correct result.OtherBackendTest.php406Drupal\search_api_db\Tests\BackendTest->searchSuccess2()
Complex search 2 returned correct number of results.OtherBackendTest.php426Drupal\search_api_db\Tests\BackendTest->searchSuccess2()
Complex search 2 returned correct result.OtherBackendTest.php427Drupal\search_api_db\Tests\BackendTest->searchSuccess2()
Filter query 1 on multi-valued field returned correct number of results.OtherBackendTest.php432Drupal\search_api_db\Tests\BackendTest->searchSuccess2()
Filter query 1 on multi-valued field returned correct result.OtherBackendTest.php433Drupal\search_api_db\Tests\BackendTest->searchSuccess2()
Filter query 2 on multi-valued field returned correct number of results.OtherBackendTest.php442Drupal\search_api_db\Tests\BackendTest->searchSuccess2()
Filter query 2 on multi-valued field returned correct result.OtherBackendTest.php443Drupal\search_api_db\Tests\BackendTest->searchSuccess2()
Query with NULL filter returned correct number of results.OtherBackendTest.php448Drupal\search_api_db\Tests\BackendTest->searchSuccess2()
Query with NULL filter returned correct result.OtherBackendTest.php449Drupal\search_api_db\Tests\BackendTest->searchSuccess2()
Filter on decimal field returned correct number of results.OtherBackendTest.php770Drupal\search_api_db\Tests\BackendTest->regressionTests2()
Filter on decimal field returned correct result.OtherBackendTest.php771Drupal\search_api_db\Tests\BackendTest->regressionTests2()
Filter on decimal field returned correct number of results.OtherBackendTest.php777Drupal\search_api_db\Tests\BackendTest->regressionTests2()
Filter on decimal field returned correct result.OtherBackendTest.php778Drupal\search_api_db\Tests\BackendTest->regressionTests2()
Indexing an item with an empty value for a non string field worked.OtherBackendTest.php789Drupal\search_api_db\Tests\BackendTest->regressionTests2()
Indexing an item with a word longer than 50 characters worked.OtherBackendTest.php803Drupal\search_api_db\Tests\BackendTest->regressionTests2()
ExpandDrupal\search_api_db_defaults\Tests\IntegrationTest412
MessageGroupFilenameLineFunctionStatus
The test did not complete due to a fatal error.Completion checkIntegrationTest.php176Drupal\search_api_db_defaults\Tests\IntegrationTest->testDefaultSetupWorking()
Illegal offset typeDrupal\Core\State\State->set(Array, Array) Drupal\search_api\Task\IndexTaskManager->startTracking(Object) Drupal\search_api\Entity\Index->postSave(Object, ) Drupal\Core\Entity\EntityStorageBase->doPostSave(Object, ) Drupal\Core\Entity\EntityStorageBase->save(Object) Drupal\Core\Config\Entity\ConfigEntityStorage->save(Object) Drupal\Core\Entity\Entity->save() Drupal\Core\Config\Entity\ConfigEntityBase->save() Drupal\Core\Config\ConfigInstaller->createConfiguration('', Array) Drupal\Core\Config\ConfigInstaller->installDefaultConfig('module', 'search_api_db_defaults') Drupal\Core\ProxyClass\Config\ConfigInstaller->installDefaultConfig('module', 'search_api_db_defaults') Drupal\Core\Extension\ModuleInstaller->install(Array, 1) Drupal\Core\ProxyClass\Extension\ModuleInstaller->install(Array, 1) Drupal\search_api_db_defaults\Tests\IntegrationTest->setUp() Drupal\simpletest\TestBase->run(Array) simpletest_script_run_one_test('1', 'Drupal\search_api_db_defaults\Tests\IntegrationTest') WarningState.php88Drupal\Core\State\State->set()
InvalidArgumentException: Placeholders must have a trailing [] if they are to be expanded with an array of values. in Drupal\Core\Database\Connection->expandArguments() (line 701 of /var/lib/drupaltestbot/sites/default/files/checkout/core/lib/Drupal/Core/Database/Connection.php). Drupal\Core\Database\Connection->expandArguments('SELECT 1 AS expression FROM {key_value} key_value WHERE ( (name = :db_condition_placeholder_0:db_condition_placeholder_1) AND (collection = :db_condition_placeholder_2) )', Array) Drupal\Core\Database\Connection->query('SELECT 1 AS expression FROM {key_value} key_value WHERE ( (name = :db_condition_placeholder_0:db_condition_placeholder_1) AND (collection = :db_condition_placeholder_2) )', Array, Array) Drupal\Core\Database\Driver\mysql\Connection->query('SELECT 1 AS expression FROM {key_value} key_value WHERE ( (name = :db_condition_placeholder_0:db_condition_placeholder_1) AND (collection = :db_condition_placeholder_2) )', Array, Array) Drupal\Core\Database\Query\Select->execute() Drupal\Core\Database\Query\Merge->execute() Drupal\Core\KeyValueStore\DatabaseStorage->set(Array, Array) Drupal\Core\State\State->set(Array, Array) Drupal\search_api\Task\IndexTaskManager->startTracking(Object) Drupal\search_api\Entity\Index->postSave(Object, ) Drupal\Core\Entity\EntityStorageBase->doPostSave(Object, ) Drupal\Core\Entity\EntityStorageBase->save(Object) Drupal\Core\Config\Entity\ConfigEntityStorage->save(Object) Drupal\Core\Entity\Entity->save() Drupal\Core\Config\Entity\ConfigEntityBase->save() Drupal\Core\Config\ConfigInstaller->createConfiguration('', Array) Drupal\Core\Config\ConfigInstaller->installDefaultConfig('module', 'search_api_db_defaults') Drupal\Core\ProxyClass\Config\ConfigInstaller->installDefaultConfig('module', 'search_api_db_defaults') Drupal\Core\Extension\ModuleInstaller->install(Array, 1) Drupal\Core\ProxyClass\Extension\ModuleInstaller->install(Array, 1) Drupal\search_api_db_defaults\Tests\IntegrationTest->setUp() Drupal\simpletest\TestBase->run(Array) simpletest_script_run_one_test('1', 'Drupal\search_api_db_defaults\Tests\IntegrationTest') Uncaught exceptionConnection.php701Drupal\Core\Database\Connection->expandArguments()
LeafDrupal\Tests\search_api\Unit\Plugin\Processor\AddURLTest200
LeafDrupal\Tests\search_api\Unit\Plugin\Processor\AggregatedFieldTest900
LeafDrupal\Tests\search_api\Unit\Plugin\Processor\FieldsProcessorPluginBaseTest1300
LeafDrupal\Tests\search_api\Unit\Plugin\Processor\HighlightTest1300
LeafDrupal\Tests\search_api\Unit\Plugin\Processor\HtmlFilterTest2500
LeafDrupal\Tests\search_api\Unit\Plugin\Processor\IgnoreCaseTest400
LeafDrupal\Tests\search_api\Unit\Plugin\Processor\IgnoreCharacterTest3900
LeafDrupal\Tests\search_api\Unit\Plugin\Processor\LanguageTest200
LeafDrupal\Tests\search_api\Unit\Plugin\Processor\NodeStatusTest300
LeafDrupal\Tests\search_api\Unit\Plugin\Processor\RoleFilterTest200
LeafDrupal\Tests\search_api\Unit\Plugin\Processor\StopwordsTest800
LeafDrupal\Tests\search_api\Unit\Plugin\Processor\TokenizerTest2200
LeafDrupal\Tests\search_api\Unit\Plugin\Processor\TransliterationTest300