translation_field_config-2564721-ONLYTEST.patch

Test status
StatusResult
Last receivedThu, 09/10/2015 - 14:15:00
Last requestedThu, 09/10/2015 - 16:20:31
Last testedThu, 09/10/2015 - 16:23:39
Test count1
Environment status
PHP 5.5 MySQLfail
File information
Filetranslation_field_config-2564721-ONLYTEST.patch
BranchTranslation Management Tool - 8.x-1.x
LinkIssue Link
SummaryFAILED: [[SimpleTest]]: [PHP 5.5 MySQL] 2,674 pass(es), 15 fail(s), and 1 exception(s).
Details

PHP 5.5 MySQL

  1. Setup environment
  2. Detect an invalid patch URL
  3. Detect invalid repository information
  4. Detect invalid patch format
  5. Detect a non-applicable patch
  6. Detect invalid PHP syntax
  7. Detect a Drupal installation failure
  8. Detect a test run failure
  9. Detect a failing test
    Review the test failures below then if necessary run them locally until the problem has been fixed.
  10. Complete test suite with all tests passing
2,674 pass(es), 15 fail(s), and 1 exception(s)

Non-pass

Test namePassFailException
ExpandDrupal\tmgmt_config\Tests\ConfigSourceListTest27271
MessageGroupFilenameLineFunctionStatus
Undefined index: field_configNoticeConfigSource.php304Drupal\tmgmt_config\Plugin\tmgmt\Source\ConfigSource->getItemTypeLabel()
Failed to set field items[field.field.node.article.body] to 1OtherConfigSourceListTest.php337Drupal\tmgmt_config\Tests\ConfigSourceListTest->testFieldConfigList()
Found the Request translation buttonOtherConfigSourceListTest.php337Drupal\tmgmt_config\Tests\ConfigSourceListTest->testFieldConfigList()
Found the requested form fields at OtherConfigSourceListTest.php337Drupal\tmgmt_config\Tests\ConfigSourceListTest->testFieldConfigList()
"One job needs to be checked out." foundOtherConfigSourceListTest.php338Drupal\tmgmt_config\Tests\ConfigSourceListTest->testFieldConfigList()
Found the Submit to translator buttonOtherConfigSourceListTest.php339Drupal\tmgmt_config\Tests\ConfigSourceListTest->testFieldConfigList()
Found the requested form fields at OtherConfigSourceListTest.php339Drupal\tmgmt_config\Tests\ConfigSourceListTest->testFieldConfigList()
[11-Sep-2015 02:23:00 Australia/Sydney] Uncaught PHP Exception Drupal\Core\Entity\Exception\UndefinedLinkTemplateException: "No link template 'edit-form' found for the 'field_config' entity type" at /var/lib/drupaltestbot/sites/default/files/checkout/core/lib/Drupal/Core/Entity/Entity.php line 198 Fatal errorUnknown0Unknown
ExpandDrupal\tmgmt_config\Tests\ConfigSourceUiTest26880
MessageGroupFilenameLineFunctionStatus
HTTP response expected 200, actual 500BrowserConfigSourceUiTest.php267Drupal\tmgmt_config\Tests\ConfigSourceUiTest->testFieldConfigTranslateTabSingleCheckout()
"One job needs to be checked out." foundOtherConfigSourceUiTest.php268Drupal\tmgmt_config\Tests\ConfigSourceUiTest->testFieldConfigTranslateTabSingleCheckout()
Found the Submit to translator buttonOtherConfigSourceUiTest.php269Drupal\tmgmt_config\Tests\ConfigSourceUiTest->testFieldConfigTranslateTabSingleCheckout()
Found the requested form fields at OtherConfigSourceUiTest.php269Drupal\tmgmt_config\Tests\ConfigSourceUiTest->testFieldConfigTranslateTabSingleCheckout()
Link Needs review does not exist on http://ec2-54-191-149-30.us-west-2.compute.amazonaws.com/checkout/admin/structure/types/manage/article/fields/node.article.body/translateBrowserConfigSourceUiTest.php272Drupal\tmgmt_config\Tests\ConfigSourceUiTest->testFieldConfigTranslateTabSingleCheckout()
Found the Save as completed buttonOtherConfigSourceUiTest.php273Drupal\tmgmt_config\Tests\ConfigSourceUiTest->testFieldConfigTranslateTabSingleCheckout()
Found the requested form fields at OtherConfigSourceUiTest.php273Drupal\tmgmt_config\Tests\ConfigSourceUiTest->testFieldConfigTranslateTabSingleCheckout()
[11-Sep-2015 02:22:28 Australia/Sydney] Uncaught PHP Exception Drupal\Core\Entity\EntityStorageException: "The "node_fields" entity type does not exist." at /var/lib/drupaltestbot/sites/default/files/checkout/core/lib/Drupal/Core/Entity/Sql/SqlContentEntityStorage.php line 757 Fatal errorUnknown0Unknown

All

Test namePassFailException
LeafDrupal\tmgmt\Tests\CrudTest19900
LeafDrupal\tmgmt\Tests\HelperTest4300
LeafDrupal\tmgmt\Tests\LocalTasksTests3100
LeafDrupal\tmgmt\Tests\PluginsTest5000
LeafDrupal\tmgmt\Tests\TMGMTCartTest5200
LeafDrupal\tmgmt\Tests\TMGMTUiTest66400
LeafDrupal\tmgmt\Tests\TranslatorTest8500
LeafDrupal\tmgmt\Tests\TranslatorUITest3000
ExpandDrupal\tmgmt_config\Tests\ConfigSourceListTest27271
MessageGroupFilenameLineFunctionStatus
Undefined index: field_configNoticeConfigSource.php304Drupal\tmgmt_config\Plugin\tmgmt\Source\ConfigSource->getItemTypeLabel()
Failed to set field items[field.field.node.article.body] to 1OtherConfigSourceListTest.php337Drupal\tmgmt_config\Tests\ConfigSourceListTest->testFieldConfigList()
Found the Request translation buttonOtherConfigSourceListTest.php337Drupal\tmgmt_config\Tests\ConfigSourceListTest->testFieldConfigList()
Found the requested form fields at OtherConfigSourceListTest.php337Drupal\tmgmt_config\Tests\ConfigSourceListTest->testFieldConfigList()
"One job needs to be checked out." foundOtherConfigSourceListTest.php338Drupal\tmgmt_config\Tests\ConfigSourceListTest->testFieldConfigList()
Found the Submit to translator buttonOtherConfigSourceListTest.php339Drupal\tmgmt_config\Tests\ConfigSourceListTest->testFieldConfigList()
Found the requested form fields at OtherConfigSourceListTest.php339Drupal\tmgmt_config\Tests\ConfigSourceListTest->testFieldConfigList()
[11-Sep-2015 02:23:00 Australia/Sydney] Uncaught PHP Exception Drupal\Core\Entity\Exception\UndefinedLinkTemplateException: "No link template 'edit-form' found for the 'field_config' entity type" at /var/lib/drupaltestbot/sites/default/files/checkout/core/lib/Drupal/Core/Entity/Entity.php line 198 Fatal errorUnknown0Unknown
ExpandDrupal\tmgmt_config\Tests\ConfigSourceUiTest26880
MessageGroupFilenameLineFunctionStatus
HTTP response expected 200, actual 500BrowserConfigSourceUiTest.php267Drupal\tmgmt_config\Tests\ConfigSourceUiTest->testFieldConfigTranslateTabSingleCheckout()
"One job needs to be checked out." foundOtherConfigSourceUiTest.php268Drupal\tmgmt_config\Tests\ConfigSourceUiTest->testFieldConfigTranslateTabSingleCheckout()
Found the Submit to translator buttonOtherConfigSourceUiTest.php269Drupal\tmgmt_config\Tests\ConfigSourceUiTest->testFieldConfigTranslateTabSingleCheckout()
Found the requested form fields at OtherConfigSourceUiTest.php269Drupal\tmgmt_config\Tests\ConfigSourceUiTest->testFieldConfigTranslateTabSingleCheckout()
Link Needs review does not exist on http://ec2-54-191-149-30.us-west-2.compute.amazonaws.com/checkout/admin/structure/types/manage/article/fields/node.article.body/translateBrowserConfigSourceUiTest.php272Drupal\tmgmt_config\Tests\ConfigSourceUiTest->testFieldConfigTranslateTabSingleCheckout()
Found the Save as completed buttonOtherConfigSourceUiTest.php273Drupal\tmgmt_config\Tests\ConfigSourceUiTest->testFieldConfigTranslateTabSingleCheckout()
Found the requested form fields at OtherConfigSourceUiTest.php273Drupal\tmgmt_config\Tests\ConfigSourceUiTest->testFieldConfigTranslateTabSingleCheckout()
[11-Sep-2015 02:22:28 Australia/Sydney] Uncaught PHP Exception Drupal\Core\Entity\EntityStorageException: "The "node_fields" entity type does not exist." at /var/lib/drupaltestbot/sites/default/files/checkout/core/lib/Drupal/Core/Entity/Sql/SqlContentEntityStorage.php line 757 Fatal errorUnknown0Unknown
LeafDrupal\tmgmt_config\Tests\ConfigSourceUnitTest3900
LeafDrupal\tmgmt_content\Tests\ContentEntitySourceListTest16100
LeafDrupal\tmgmt_content\Tests\ContentEntitySourceUiTest28300
LeafDrupal\tmgmt_content\Tests\ContentEntitySourceUnitTest14600
LeafDrupal\tmgmt_content\Tests\ContentEntitySuggestionsTest2400
LeafDrupal\tmgmt_demo\Tests\TMGMTDemoTest4800
LeafDrupal\tmgmt_file\Tests\FileTranslatorTest16600
LeafDrupal\tmgmt_locale\Tests\LocaleSourceTest6300
LeafDrupal\tmgmt_locale\Tests\LocaleSourceUiTest5000