add_tasks_and_actions-2562423-13.patch

Test status
StatusResult
Last receivedSat, 09/12/2015 - 13:29:43
Last requestedSat, 09/12/2015 - 13:30:01
Last testedSat, 09/12/2015 - 13:31:41
Test count1
Environment status
PHP 5.5 MySQLfail
File information
Fileadd_tasks_and_actions-2562423-13.patch
BranchInmail - 8.x-1.x
LinkIssue Link
SummaryFAILED: [[SimpleTest]]: [PHP 5.5 MySQL] 1,145 pass(es), 14 fail(s), and 12 exception(s).
Details

PHP 5.5 MySQL

  1. Setup environment
  2. Detect an invalid patch URL
  3. Detect invalid repository information
  4. Detect invalid patch format
  5. Detect a non-applicable patch
  6. Detect invalid PHP syntax
  7. Detect a Drupal installation failure
  8. Detect a test run failure
  9. Detect a failing test
    Review the test failures below then if necessary run them locally until the problem has been fixed.
  10. Complete test suite with all tests passing
1,145 pass(es), 14 fail(s), and 12 exception(s)

Non-pass

Test namePassFailException
ExpandDrupal\inmail_collect\Tests\InmailCollectWebTest341412
MessageGroupFilenameLineFunctionStatus
""header-message-id": "<21386_1392800717_530473CD_21386_78_1_OF72A6C464.8DF6E397-ONC1257C84.0031EBBB-C1257C84.0031=EC2C+@acacia.example.org>"" foundOtherInmailCollectWebTest.php61Drupal\inmail_collect\Tests\InmailCollectWebTest->testUi()
simplexml_import_dom(): Invalid Nodetype to importsimplexml_import_dom(Object) Drupal\simpletest\WebTestBase->parse() Drupal\simpletest\WebTestBase->drupalPostForm(NULL, Array, 'Save') Drupal\inmail_collect\Tests\InmailCollectWebTest->testUi() Drupal\simpletest\TestBase->run(Array) simpletest_script_run_one_test('2', 'Drupal\inmail_collect\Tests\InmailCollectWebTest') WarningAssertContentTrait.php138Drupal\simpletest\WebTestBase->parse()
simplexml_import_dom(): Invalid Nodetype to importsimplexml_import_dom(Object) Drupal\simpletest\WebTestBase->parse() Drupal\simpletest\WebTestBase->xpath('//div[@class="field__item"]//details') Drupal\inmail_collect\Tests\InmailCollectWebTest->testUi() Drupal\simpletest\TestBase->run(Array) simpletest_script_run_one_test('2', 'Drupal\inmail_collect\Tests\InmailCollectWebTest') WarningAssertContentTrait.php138Drupal\simpletest\WebTestBase->parse()
Trying to get property of non-objectDrupal\inmail_collect\Tests\InmailCollectWebTest->testUi() Drupal\simpletest\TestBase->run(Array) simpletest_script_run_one_test('2', 'Drupal\inmail_collect\Tests\InmailCollectWebTest') NoticeInmailCollectWebTest.php72Drupal\inmail_collect\Tests\InmailCollectWebTest->testUi()
Value '' is equal to value 'DELIVERY FAILURE: User environment (user@example.org) not listed in Domino Directory'.OtherInmailCollectWebTest.php72Drupal\inmail_collect\Tests\InmailCollectWebTest->testUi()
Trying to get property of non-objectDrupal\inmail_collect\Tests\InmailCollectWebTest->testUi() Drupal\simpletest\TestBase->run(Array) simpletest_script_run_one_test('2', 'Drupal\inmail_collect\Tests\InmailCollectWebTest') NoticeInmailCollectWebTest.php73Drupal\inmail_collect\Tests\InmailCollectWebTest->testUi()
Trying to get property of non-objectDrupal\inmail_collect\Tests\InmailCollectWebTest->testUi() Drupal\simpletest\TestBase->run(Array) simpletest_script_run_one_test('2', 'Drupal\inmail_collect\Tests\InmailCollectWebTest') NoticeInmailCollectWebTest.php73Drupal\inmail_collect\Tests\InmailCollectWebTest->testUi()
Trying to get property of non-objectDrupal\inmail_collect\Tests\InmailCollectWebTest->testUi() Drupal\simpletest\TestBase->run(Array) simpletest_script_run_one_test('2', 'Drupal\inmail_collect\Tests\InmailCollectWebTest') NoticeInmailCollectWebTest.php73Drupal\inmail_collect\Tests\InmailCollectWebTest->testUi()
Value '' is equal to value 'Part 1'.OtherInmailCollectWebTest.php73Drupal\inmail_collect\Tests\InmailCollectWebTest->testUi()
Trying to get property of non-objectDrupal\inmail_collect\Tests\InmailCollectWebTest->testUi() Drupal\simpletest\TestBase->run(Array) simpletest_script_run_one_test('2', 'Drupal\inmail_collect\Tests\InmailCollectWebTest') NoticeInmailCollectWebTest.php74Drupal\inmail_collect\Tests\InmailCollectWebTest->testUi()
Trying to get property of non-objectDrupal\inmail_collect\Tests\InmailCollectWebTest->testUi() Drupal\simpletest\TestBase->run(Array) simpletest_script_run_one_test('2', 'Drupal\inmail_collect\Tests\InmailCollectWebTest') NoticeInmailCollectWebTest.php74Drupal\inmail_collect\Tests\InmailCollectWebTest->testUi()
Trying to get property of non-objectDrupal\inmail_collect\Tests\InmailCollectWebTest->testUi() Drupal\simpletest\TestBase->run(Array) simpletest_script_run_one_test('2', 'Drupal\inmail_collect\Tests\InmailCollectWebTest') NoticeInmailCollectWebTest.php74Drupal\inmail_collect\Tests\InmailCollectWebTest->testUi()
Value '' is equal to value 'Part 2'.OtherInmailCollectWebTest.php74Drupal\inmail_collect\Tests\InmailCollectWebTest->testUi()
Trying to get property of non-objectDrupal\inmail_collect\Tests\InmailCollectWebTest->testUi() Drupal\simpletest\TestBase->run(Array) simpletest_script_run_one_test('2', 'Drupal\inmail_collect\Tests\InmailCollectWebTest') NoticeInmailCollectWebTest.php75Drupal\inmail_collect\Tests\InmailCollectWebTest->testUi()
Trying to get property of non-objectDrupal\inmail_collect\Tests\InmailCollectWebTest->testUi() Drupal\simpletest\TestBase->run(Array) simpletest_script_run_one_test('2', 'Drupal\inmail_collect\Tests\InmailCollectWebTest') NoticeInmailCollectWebTest.php75Drupal\inmail_collect\Tests\InmailCollectWebTest->testUi()
Trying to get property of non-objectDrupal\inmail_collect\Tests\InmailCollectWebTest->testUi() Drupal\simpletest\TestBase->run(Array) simpletest_script_run_one_test('2', 'Drupal\inmail_collect\Tests\InmailCollectWebTest') NoticeInmailCollectWebTest.php75Drupal\inmail_collect\Tests\InmailCollectWebTest->testUi()
Value '' is equal to value 'Part 3'.OtherInmailCollectWebTest.php75Drupal\inmail_collect\Tests\InmailCollectWebTest->testUi()
"From Postmaster@acacia.example.org" foundOtherInmailCollectWebTest.php79Drupal\inmail_collect\Tests\InmailCollectWebTest->testUi()
"To bounces+user=example.org@example.com" foundOtherInmailCollectWebTest.php80Drupal\inmail_collect\Tests\InmailCollectWebTest->testUi()
"Subject DELIVERY FAILURE: User environment (user@example.org) not listed in Domino Directory" foundOtherInmailCollectWebTest.php81Drupal\inmail_collect\Tests\InmailCollectWebTest->testUi()
"Content-Type multipart/report" foundOtherInmailCollectWebTest.php82Drupal\inmail_collect\Tests\InmailCollectWebTest->testUi()
"Content-Type text/plain" foundOtherInmailCollectWebTest.php83Drupal\inmail_collect\Tests\InmailCollectWebTest->testUi()
"Content-Type message/delivery-status" foundOtherInmailCollectWebTest.php84Drupal\inmail_collect\Tests\InmailCollectWebTest->testUi()
"Content-Type message/rfc822" foundOtherInmailCollectWebTest.php85Drupal\inmail_collect\Tests\InmailCollectWebTest->testUi()
"Your message Subject: We want a toxic-free future was not delivered to: environment@lvmh.fr" foundOtherInmailCollectWebTest.php87Drupal\inmail_collect\Tests\InmailCollectWebTest->testUi()
Call to undefined method Drupal\Component\Utility\SafeMarkup::set()PHP Fatal errorModelForm.php294Unknown

All

Test namePassFailException
LeafDrupal\inmail\Tests\AnalyzerTest500
LeafDrupal\inmail\Tests\DelivererTest300
LeafDrupal\inmail\Tests\InmailDataTypeTest1100
LeafDrupal\inmail\Tests\InmailWebTest13900
LeafDrupal\inmail\Tests\IntegrationTest2700
LeafDrupal\inmail\Tests\ModeratorForwardTest1400
LeafDrupal\inmail\Tests\ProcessorTest300
LeafDrupal\inmail\Tests\VerpTest1100
ExpandDrupal\inmail_collect\Tests\InmailCollectWebTest341412
MessageGroupFilenameLineFunctionStatus
""header-message-id": "<21386_1392800717_530473CD_21386_78_1_OF72A6C464.8DF6E397-ONC1257C84.0031EBBB-C1257C84.0031=EC2C+@acacia.example.org>"" foundOtherInmailCollectWebTest.php61Drupal\inmail_collect\Tests\InmailCollectWebTest->testUi()
simplexml_import_dom(): Invalid Nodetype to importsimplexml_import_dom(Object) Drupal\simpletest\WebTestBase->parse() Drupal\simpletest\WebTestBase->drupalPostForm(NULL, Array, 'Save') Drupal\inmail_collect\Tests\InmailCollectWebTest->testUi() Drupal\simpletest\TestBase->run(Array) simpletest_script_run_one_test('2', 'Drupal\inmail_collect\Tests\InmailCollectWebTest') WarningAssertContentTrait.php138Drupal\simpletest\WebTestBase->parse()
simplexml_import_dom(): Invalid Nodetype to importsimplexml_import_dom(Object) Drupal\simpletest\WebTestBase->parse() Drupal\simpletest\WebTestBase->xpath('//div[@class="field__item"]//details') Drupal\inmail_collect\Tests\InmailCollectWebTest->testUi() Drupal\simpletest\TestBase->run(Array) simpletest_script_run_one_test('2', 'Drupal\inmail_collect\Tests\InmailCollectWebTest') WarningAssertContentTrait.php138Drupal\simpletest\WebTestBase->parse()
Trying to get property of non-objectDrupal\inmail_collect\Tests\InmailCollectWebTest->testUi() Drupal\simpletest\TestBase->run(Array) simpletest_script_run_one_test('2', 'Drupal\inmail_collect\Tests\InmailCollectWebTest') NoticeInmailCollectWebTest.php72Drupal\inmail_collect\Tests\InmailCollectWebTest->testUi()
Value '' is equal to value 'DELIVERY FAILURE: User environment (user@example.org) not listed in Domino Directory'.OtherInmailCollectWebTest.php72Drupal\inmail_collect\Tests\InmailCollectWebTest->testUi()
Trying to get property of non-objectDrupal\inmail_collect\Tests\InmailCollectWebTest->testUi() Drupal\simpletest\TestBase->run(Array) simpletest_script_run_one_test('2', 'Drupal\inmail_collect\Tests\InmailCollectWebTest') NoticeInmailCollectWebTest.php73Drupal\inmail_collect\Tests\InmailCollectWebTest->testUi()
Trying to get property of non-objectDrupal\inmail_collect\Tests\InmailCollectWebTest->testUi() Drupal\simpletest\TestBase->run(Array) simpletest_script_run_one_test('2', 'Drupal\inmail_collect\Tests\InmailCollectWebTest') NoticeInmailCollectWebTest.php73Drupal\inmail_collect\Tests\InmailCollectWebTest->testUi()
Trying to get property of non-objectDrupal\inmail_collect\Tests\InmailCollectWebTest->testUi() Drupal\simpletest\TestBase->run(Array) simpletest_script_run_one_test('2', 'Drupal\inmail_collect\Tests\InmailCollectWebTest') NoticeInmailCollectWebTest.php73Drupal\inmail_collect\Tests\InmailCollectWebTest->testUi()
Value '' is equal to value 'Part 1'.OtherInmailCollectWebTest.php73Drupal\inmail_collect\Tests\InmailCollectWebTest->testUi()
Trying to get property of non-objectDrupal\inmail_collect\Tests\InmailCollectWebTest->testUi() Drupal\simpletest\TestBase->run(Array) simpletest_script_run_one_test('2', 'Drupal\inmail_collect\Tests\InmailCollectWebTest') NoticeInmailCollectWebTest.php74Drupal\inmail_collect\Tests\InmailCollectWebTest->testUi()
Trying to get property of non-objectDrupal\inmail_collect\Tests\InmailCollectWebTest->testUi() Drupal\simpletest\TestBase->run(Array) simpletest_script_run_one_test('2', 'Drupal\inmail_collect\Tests\InmailCollectWebTest') NoticeInmailCollectWebTest.php74Drupal\inmail_collect\Tests\InmailCollectWebTest->testUi()
Trying to get property of non-objectDrupal\inmail_collect\Tests\InmailCollectWebTest->testUi() Drupal\simpletest\TestBase->run(Array) simpletest_script_run_one_test('2', 'Drupal\inmail_collect\Tests\InmailCollectWebTest') NoticeInmailCollectWebTest.php74Drupal\inmail_collect\Tests\InmailCollectWebTest->testUi()
Value '' is equal to value 'Part 2'.OtherInmailCollectWebTest.php74Drupal\inmail_collect\Tests\InmailCollectWebTest->testUi()
Trying to get property of non-objectDrupal\inmail_collect\Tests\InmailCollectWebTest->testUi() Drupal\simpletest\TestBase->run(Array) simpletest_script_run_one_test('2', 'Drupal\inmail_collect\Tests\InmailCollectWebTest') NoticeInmailCollectWebTest.php75Drupal\inmail_collect\Tests\InmailCollectWebTest->testUi()
Trying to get property of non-objectDrupal\inmail_collect\Tests\InmailCollectWebTest->testUi() Drupal\simpletest\TestBase->run(Array) simpletest_script_run_one_test('2', 'Drupal\inmail_collect\Tests\InmailCollectWebTest') NoticeInmailCollectWebTest.php75Drupal\inmail_collect\Tests\InmailCollectWebTest->testUi()
Trying to get property of non-objectDrupal\inmail_collect\Tests\InmailCollectWebTest->testUi() Drupal\simpletest\TestBase->run(Array) simpletest_script_run_one_test('2', 'Drupal\inmail_collect\Tests\InmailCollectWebTest') NoticeInmailCollectWebTest.php75Drupal\inmail_collect\Tests\InmailCollectWebTest->testUi()
Value '' is equal to value 'Part 3'.OtherInmailCollectWebTest.php75Drupal\inmail_collect\Tests\InmailCollectWebTest->testUi()
"From Postmaster@acacia.example.org" foundOtherInmailCollectWebTest.php79Drupal\inmail_collect\Tests\InmailCollectWebTest->testUi()
"To bounces+user=example.org@example.com" foundOtherInmailCollectWebTest.php80Drupal\inmail_collect\Tests\InmailCollectWebTest->testUi()
"Subject DELIVERY FAILURE: User environment (user@example.org) not listed in Domino Directory" foundOtherInmailCollectWebTest.php81Drupal\inmail_collect\Tests\InmailCollectWebTest->testUi()
"Content-Type multipart/report" foundOtherInmailCollectWebTest.php82Drupal\inmail_collect\Tests\InmailCollectWebTest->testUi()
"Content-Type text/plain" foundOtherInmailCollectWebTest.php83Drupal\inmail_collect\Tests\InmailCollectWebTest->testUi()
"Content-Type message/delivery-status" foundOtherInmailCollectWebTest.php84Drupal\inmail_collect\Tests\InmailCollectWebTest->testUi()
"Content-Type message/rfc822" foundOtherInmailCollectWebTest.php85Drupal\inmail_collect\Tests\InmailCollectWebTest->testUi()
"Your message Subject: We want a toxic-free future was not delivered to: environment@lvmh.fr" foundOtherInmailCollectWebTest.php87Drupal\inmail_collect\Tests\InmailCollectWebTest->testUi()
Call to undefined method Drupal\Component\Utility\SafeMarkup::set()PHP Fatal errorModelForm.php294Unknown
LeafDrupal\inmail_collect\Tests\InmailMessageModelTest1100
LeafDrupal\inmail_demo\Tests\InmailDemoTest2200
LeafDrupal\inmail_mailmute\Tests\InmailMailmuteTest2800
LeafDrupal\Tests\inmail\Unit\DSNStatusTest79400
LeafDrupal\Tests\inmail\Unit\MIME\DSNEntityTest600
LeafDrupal\Tests\inmail\Unit\MIME\HeaderTest700
LeafDrupal\Tests\inmail\Unit\MIME\MessageTest500
LeafDrupal\Tests\inmail\Unit\MIME\MultipartEntityTest700
LeafDrupal\Tests\inmail\Unit\MIME\ParserTest1000
LeafDrupal\Tests\inmail\Unit\Plugin\inmail\Analyzer\StandardDSNAnalyzerTest400
LeafDrupal\Tests\inmail\Unit\Plugin\inmail\Analyzer\StandardDSNReasonAnalyzerTest400