add_test_for-2565755-2.patch

Test status
StatusResult
Last receivedWed, 09/09/2015 - 15:16:01
Last requestedThu, 09/17/2015 - 13:57:14
Last testedThu, 09/17/2015 - 14:00:51
Test count1
Environment status
PHP 5.5 MySQLfail
File information
Fileadd_test_for-2565755-2.patch
BranchCollect - 8.x-1.x
LinkIssue Link
SummaryFAILED: [[SimpleTest]]: [PHP 5.5 MySQL] 1,499 pass(es), 19 fail(s), and 0 exception(s).
Details

PHP 5.5 MySQL

  1. Setup environment
  2. Detect an invalid patch URL
  3. Detect invalid repository information
  4. Detect invalid patch format
  5. Detect a non-applicable patch
  6. Detect invalid PHP syntax
  7. Detect a Drupal installation failure
  8. Detect a test run failure
  9. Detect a failing test
    Review the test failures below then if necessary run them locally until the problem has been fixed.
  10. Complete test suite with all tests passing
1,499 pass(es), 19 fail(s), and 0 exception(s)

Non-pass

Test namePassFailException
ExpandDrupal\collect\Tests\RelationTest1410
MessageGroupFilenameLineFunctionStatus
Value array ( 'module' => array ( 0 => 'collect_test', ), ) is equal to value array ( ).OtherRelationTest.php44Drupal\collect\Tests\RelationTest->testDependencies()
ExpandDrupal\collect\Tests\RelationWebTest82180
MessageGroupFilenameLineFunctionStatus
Raw "The relation type Aaa has been added." foundOtherRelationWebTest.php134Drupal\collect\Tests\RelationWebTest->testTypeCrudUi()
"schema:aaa" foundOtherRelationWebTest.php135Drupal\collect\Tests\RelationWebTest->testTypeCrudUi()
"Generic" foundOtherRelationWebTest.php136Drupal\collect\Tests\RelationWebTest->testTypeCrudUi()
Link Edit does not exist on http://ec2-54-191-149-30.us-west-2.compute.amazonaws.com/checkout/admin/structure/collect/relationBrowserRelationWebTest.php139Drupal\collect\Tests\RelationWebTest->testTypeCrudUi()
Raw "Edit Aaa relation type" foundOtherRelationWebTest.php140Drupal\collect\Tests\RelationWebTest->testTypeCrudUi()
Found field with name 'label' and value 'Aaa'BrowserRelationWebTest.php141Drupal\collect\Tests\RelationWebTest->testTypeCrudUi()
Found field with name 'id' and value 'aaa'BrowserRelationWebTest.php142Drupal\collect\Tests\RelationWebTest->testTypeCrudUi()
Found field with name 'uri_pattern' and value 'schema:aaa'BrowserRelationWebTest.php143Drupal\collect\Tests\RelationWebTest->testTypeCrudUi()
Failed to set field label to AabOtherRelationWebTest.php147Drupal\collect\Tests\RelationWebTest->testTypeCrudUi()
Failed to set field uri_pattern to schema:aabOtherRelationWebTest.php147Drupal\collect\Tests\RelationWebTest->testTypeCrudUi()
Found the Save buttonOtherRelationWebTest.php147Drupal\collect\Tests\RelationWebTest->testTypeCrudUi()
Found the requested form fields at OtherRelationWebTest.php147Drupal\collect\Tests\RelationWebTest->testTypeCrudUi()
Raw "The relation type Aab has been updated." foundOtherRelationWebTest.php148Drupal\collect\Tests\RelationWebTest->testTypeCrudUi()
"schema:aab" foundOtherRelationWebTest.php149Drupal\collect\Tests\RelationWebTest->testTypeCrudUi()
Link Delete does not exist on http://ec2-54-191-149-30.us-west-2.compute.amazonaws.com/checkout/admin/structure/collect/relationBrowserRelationWebTest.php152Drupal\collect\Tests\RelationWebTest->testTypeCrudUi()
Found the Delete buttonOtherRelationWebTest.php153Drupal\collect\Tests\RelationWebTest->testTypeCrudUi()
Found the requested form fields at OtherRelationWebTest.php153Drupal\collect\Tests\RelationWebTest->testTypeCrudUi()
[17-Sep-2015 23:58:32 Australia/Sydney] Uncaught PHP Exception Drupal\Component\Plugin\Exception\PluginNotFoundException: "The "" plugin does not exist." at /var/lib/drupaltestbot/sites/default/files/checkout/core/lib/Drupal/Component/Plugin/Discovery/DiscoveryTrait.php line 57 Fatal errorUnknown0Unknown

All

Test namePassFailException
LeafDrupal\collect\Tests\CollectJsonModelTest3100
LeafDrupal\collect\Tests\CollectWebTest44700
LeafDrupal\collect\Tests\ContainerTest2100
LeafDrupal\collect\Tests\DependencyInjectionTest800
LeafDrupal\collect\Tests\EntityWebTest46000
LeafDrupal\collect\Tests\FetchUrlModelTest600
LeafDrupal\collect\Tests\FieldDefinitionModelTest900
LeafDrupal\collect\Tests\JsonModelTest700
LeafDrupal\collect\Tests\ModelManagerTest500
LeafDrupal\collect\Tests\ModelTest7300
LeafDrupal\collect\Tests\ProcessingTest400
LeafDrupal\collect\Tests\ProcessingWebTest6200
ExpandDrupal\collect\Tests\RelationTest1410
MessageGroupFilenameLineFunctionStatus
Value array ( 'module' => array ( 0 => 'collect_test', ), ) is equal to value array ( ).OtherRelationTest.php44Drupal\collect\Tests\RelationTest->testDependencies()
ExpandDrupal\collect\Tests\RelationWebTest82180
MessageGroupFilenameLineFunctionStatus
Raw "The relation type Aaa has been added." foundOtherRelationWebTest.php134Drupal\collect\Tests\RelationWebTest->testTypeCrudUi()
"schema:aaa" foundOtherRelationWebTest.php135Drupal\collect\Tests\RelationWebTest->testTypeCrudUi()
"Generic" foundOtherRelationWebTest.php136Drupal\collect\Tests\RelationWebTest->testTypeCrudUi()
Link Edit does not exist on http://ec2-54-191-149-30.us-west-2.compute.amazonaws.com/checkout/admin/structure/collect/relationBrowserRelationWebTest.php139Drupal\collect\Tests\RelationWebTest->testTypeCrudUi()
Raw "Edit Aaa relation type" foundOtherRelationWebTest.php140Drupal\collect\Tests\RelationWebTest->testTypeCrudUi()
Found field with name 'label' and value 'Aaa'BrowserRelationWebTest.php141Drupal\collect\Tests\RelationWebTest->testTypeCrudUi()
Found field with name 'id' and value 'aaa'BrowserRelationWebTest.php142Drupal\collect\Tests\RelationWebTest->testTypeCrudUi()
Found field with name 'uri_pattern' and value 'schema:aaa'BrowserRelationWebTest.php143Drupal\collect\Tests\RelationWebTest->testTypeCrudUi()
Failed to set field label to AabOtherRelationWebTest.php147Drupal\collect\Tests\RelationWebTest->testTypeCrudUi()
Failed to set field uri_pattern to schema:aabOtherRelationWebTest.php147Drupal\collect\Tests\RelationWebTest->testTypeCrudUi()
Found the Save buttonOtherRelationWebTest.php147Drupal\collect\Tests\RelationWebTest->testTypeCrudUi()
Found the requested form fields at OtherRelationWebTest.php147Drupal\collect\Tests\RelationWebTest->testTypeCrudUi()
Raw "The relation type Aab has been updated." foundOtherRelationWebTest.php148Drupal\collect\Tests\RelationWebTest->testTypeCrudUi()
"schema:aab" foundOtherRelationWebTest.php149Drupal\collect\Tests\RelationWebTest->testTypeCrudUi()
Link Delete does not exist on http://ec2-54-191-149-30.us-west-2.compute.amazonaws.com/checkout/admin/structure/collect/relationBrowserRelationWebTest.php152Drupal\collect\Tests\RelationWebTest->testTypeCrudUi()
Found the Delete buttonOtherRelationWebTest.php153Drupal\collect\Tests\RelationWebTest->testTypeCrudUi()
Found the requested form fields at OtherRelationWebTest.php153Drupal\collect\Tests\RelationWebTest->testTypeCrudUi()
[17-Sep-2015 23:58:32 Australia/Sydney] Uncaught PHP Exception Drupal\Component\Plugin\Exception\PluginNotFoundException: "The "" plugin does not exist." at /var/lib/drupaltestbot/sites/default/files/checkout/core/lib/Drupal/Component/Plugin/Discovery/DiscoveryTrait.php line 57 Fatal errorUnknown0Unknown
LeafDrupal\collect\Tests\TypedDataProviderTest1000
LeafDrupal\collect_client\Tests\CollectClientWebTest22800
LeafDrupal\collect_client_contact\Tests\ContactItemHandlerTest2000
LeafDrupal\collect_common\Tests\CollectCommonKernelTest600
LeafDrupal\Tests\collect\Unit\Plugin\rest\resource\CollectResourceTest200
LeafDrupal\Tests\collect_client\Unit\Plugin\QueueWorker\QueueWorkerTest400