add_tasks_and_actions-2562423-7.patch

Test status
StatusResult
Last receivedThu, 09/10/2015 - 07:57:19
Last requestedThu, 09/10/2015 - 07:58:01
Last testedThu, 09/10/2015 - 07:58:27
Test count1
Environment status
PHP 5.5 MySQLfail
File information
Fileadd_tasks_and_actions-2562423-7.patch
BranchInmail - 8.x-1.x
LinkIssue Link
SummaryFAILED: [[SimpleTest]]: [PHP 5.5 MySQL] 938 pass(es), 12 fail(s), and 7 exception(s).
Details

PHP 5.5 MySQL

  1. Setup environment
  2. Detect an invalid patch URL
  3. Detect invalid repository information
  4. Detect invalid patch format
  5. Detect a non-applicable patch
  6. Detect invalid PHP syntax
  7. Detect a Drupal installation failure
  8. Detect a test run failure
  9. Detect a failing test
    Review the test failures below then if necessary run them locally until the problem has been fixed.
  10. Complete test suite with all tests passing
938 pass(es), 12 fail(s), and 7 exception(s)

Non-pass

Test namePassFailException
ExpandDrupal\inmail\Tests\InmailWebTest2753
MessageGroupFilenameLineFunctionStatus
Link Mail deliverers does not exist on http://ec2-52-88-182-40.us-west-2.compute.amazonaws.com/checkout/admin/config/system/inmailBrowserInmailWebTest.php72Drupal\inmail\Tests\InmailWebTest->doTestDelivererUi()
Expected 'http://ec2-52-88-182-40.us-west-2.compute.amazonaws.com/checkout/admin/config/system/inmail/deliverers' matches current URL (http://ec2-52-88-182-40.us-west-2.compute.amazonaws.com/checkout/admin/config/system/inmail).OtherInmailWebTest.php73Drupal\inmail\Tests\InmailWebTest->doTestDelivererUi()
"There is no Mail deliverer yet." foundOtherInmailWebTest.php74Drupal\inmail\Tests\InmailWebTest->doTestDelivererUi()
Link Add deliverer does not exist on http://ec2-52-88-182-40.us-west-2.compute.amazonaws.com/checkout/admin/config/system/inmailBrowserInmailWebTest.php77Drupal\inmail\Tests\InmailWebTest->doTestDelivererUi()
Expected 'http://ec2-52-88-182-40.us-west-2.compute.amazonaws.com/checkout/admin/config/system/inmail/deliverers/add' matches current URL (http://ec2-52-88-182-40.us-west-2.compute.amazonaws.com/checkout/admin/config/system/inmail).OtherInmailWebTest.php78Drupal\inmail\Tests\InmailWebTest->doTestDelivererUi()
Undefined offset: 0Drupal\simpletest\WebTestBase->drupalPostAjaxForm(NULL, Array, 'plugin') Drupal\inmail\Tests\InmailWebTest->doTestDelivererUi() Drupal\inmail\Tests\InmailWebTest->testAdminUi() Drupal\simpletest\TestBase->run(Array) simpletest_script_run_one_test('9', 'Drupal\inmail\Tests\InmailWebTest') NoticeWebTestBase.php1862Drupal\simpletest\WebTestBase->drupalPostAjaxForm()
Undefined index: ajaxDrupal\simpletest\WebTestBase->drupalPostAjaxForm(NULL, Array, 'plugin') Drupal\inmail\Tests\InmailWebTest->doTestDelivererUi() Drupal\inmail\Tests\InmailWebTest->testAdminUi() Drupal\simpletest\TestBase->run(Array) simpletest_script_run_one_test('9', 'Drupal\inmail\Tests\InmailWebTest') NoticeWebTestBase.php1863Drupal\simpletest\WebTestBase->drupalPostAjaxForm()
Exception: No #ajax path specified. in Drupal\simpletest\WebTestBase->drupalPostAjaxForm() (line 1899 of /var/lib/drupaltestbot/sites/default/files/checkout/core/modules/simpletest/src/WebTestBase.php). Drupal\simpletest\WebTestBase->drupalPostAjaxForm(NULL, Array, 'plugin') Drupal\inmail\Tests\InmailWebTest->doTestDelivererUi() Drupal\inmail\Tests\InmailWebTest->testAdminUi() Drupal\simpletest\TestBase->run(Array) simpletest_script_run_one_test('9', 'Drupal\inmail\Tests\InmailWebTest') Uncaught exceptionWebTestBase.php1899Drupal\simpletest\WebTestBase->drupalPostAjaxForm()
ExpandDrupal\inmail\Tests\IntegrationTest541
MessageGroupFilenameLineFunctionStatus
The test did not complete due to a fatal error.Completion checkIntegrationTest.php41Drupal\inmail\Tests\IntegrationTest->testBounceFlow()
Unable to install modules: module 'inmail_mailmute' is missing its dependency module mailmute.OtherIntegrationTest.php30Drupal\inmail\Tests\IntegrationTest->setUp()
Invalid permission administer user display.RoleIntegrationTest.php56Drupal\inmail\Tests\IntegrationTest->testBounceFlow()
Invalid permission administer mailmute.RoleIntegrationTest.php56Drupal\inmail\Tests\IntegrationTest->testBounceFlow()
Argument 1 passed to Drupal\simpletest\WebTestBase::drupalLogin() must implement interface Drupal\Core\Session\AccountInterface, boolean given, called in /var/lib/drupaltestbot/sites/default/files/checkout/sites/default/modules/inmail/src/Tests/IntegrationTest.php on line 57 and definedDrupal\simpletest\WebTestBase->drupalLogin() Drupal\inmail\Tests\IntegrationTest->testBounceFlow() Drupal\simpletest\TestBase->run(Array) simpletest_script_run_one_test('8', 'Drupal\inmail\Tests\IntegrationTest') Recoverable errorWebTestBase.php602Drupal\simpletest\WebTestBase->drupalLogin()
ExpandDrupal\inmail_collect\Tests\InmailCollectWebTest011
MessageGroupFilenameLineFunctionStatus
Unable to install modules: module 'inmail_collect' is missing its dependency module collect.Otherrun-tests.sh647simpletest_script_run_one_test()
Drupal\Component\Plugin\Exception\PluginNotFoundException: The "block" entity type does not exist. in Drupal\Core\Entity\EntityManager->getDefinition() (line 276 of /var/lib/drupaltestbot/sites/default/files/checkout/core/lib/Drupal/Core/Entity/EntityManager.php). Drupal\Core\Entity\EntityManager->getDefinition('block') Drupal\Core\Entity\EntityManager->getHandler('block', 'storage') Drupal\Core\Entity\EntityManager->getStorage('block') entity_create('block', Array) Drupal\simpletest\WebTestBase->drupalPlaceBlock('local_actions_block') Drupal\inmail_collect\Tests\InmailCollectWebTest->testUi() Drupal\simpletest\TestBase->run(Array) simpletest_script_run_one_test('1', 'Drupal\inmail_collect\Tests\InmailCollectWebTest') Uncaught exceptionEntityManager.php276Drupal\Core\Entity\EntityManager->getDefinition()
ExpandDrupal\inmail_collect\Tests\InmailMessageModelTest011
MessageGroupFilenameLineFunctionStatus
The test did not complete due to a fatal error.Completion checkInmailMessageModelTest.php42Drupal\inmail_collect\Tests\InmailMessageModelTest->testProperties()
Undefined index: collectDrupal\simpletest\KernelTestBase->enableModules(Array) Drupal\simpletest\KernelTestBase->setUp() Drupal\simpletest\TestBase->run(Array) simpletest_script_run_one_test('2', 'Drupal\inmail_collect\Tests\InmailMessageModelTest') NoticeKernelTestBase.php510Drupal\simpletest\KernelTestBase->enableModules()
ExpandDrupal\inmail_mailmute\Tests\InmailMailmuteTest011
MessageGroupFilenameLineFunctionStatus
The test did not complete due to a fatal error.Completion checkInmailMailmuteTest.php64Drupal\inmail_mailmute\Tests\InmailMailmuteTest->testProcessAndTriggerSendStateTransition()
Undefined index: mailmuteDrupal\simpletest\KernelTestBase->enableModules(Array) Drupal\simpletest\KernelTestBase->setUp() Drupal\inmail_mailmute\Tests\InmailMailmuteTest->setUp() Drupal\simpletest\TestBase->run(Array) simpletest_script_run_one_test('4', 'Drupal\inmail_mailmute\Tests\InmailMailmuteTest') NoticeKernelTestBase.php510Drupal\simpletest\KernelTestBase->enableModules()

All

Test namePassFailException
LeafDrupal\inmail\Tests\AnalyzerTest500
LeafDrupal\inmail\Tests\DelivererTest300
LeafDrupal\inmail\Tests\InmailDataTypeTest1100
ExpandDrupal\inmail\Tests\InmailWebTest2753
MessageGroupFilenameLineFunctionStatus
Link Mail deliverers does not exist on http://ec2-52-88-182-40.us-west-2.compute.amazonaws.com/checkout/admin/config/system/inmailBrowserInmailWebTest.php72Drupal\inmail\Tests\InmailWebTest->doTestDelivererUi()
Expected 'http://ec2-52-88-182-40.us-west-2.compute.amazonaws.com/checkout/admin/config/system/inmail/deliverers' matches current URL (http://ec2-52-88-182-40.us-west-2.compute.amazonaws.com/checkout/admin/config/system/inmail).OtherInmailWebTest.php73Drupal\inmail\Tests\InmailWebTest->doTestDelivererUi()
"There is no Mail deliverer yet." foundOtherInmailWebTest.php74Drupal\inmail\Tests\InmailWebTest->doTestDelivererUi()
Link Add deliverer does not exist on http://ec2-52-88-182-40.us-west-2.compute.amazonaws.com/checkout/admin/config/system/inmailBrowserInmailWebTest.php77Drupal\inmail\Tests\InmailWebTest->doTestDelivererUi()
Expected 'http://ec2-52-88-182-40.us-west-2.compute.amazonaws.com/checkout/admin/config/system/inmail/deliverers/add' matches current URL (http://ec2-52-88-182-40.us-west-2.compute.amazonaws.com/checkout/admin/config/system/inmail).OtherInmailWebTest.php78Drupal\inmail\Tests\InmailWebTest->doTestDelivererUi()
Undefined offset: 0Drupal\simpletest\WebTestBase->drupalPostAjaxForm(NULL, Array, 'plugin') Drupal\inmail\Tests\InmailWebTest->doTestDelivererUi() Drupal\inmail\Tests\InmailWebTest->testAdminUi() Drupal\simpletest\TestBase->run(Array) simpletest_script_run_one_test('9', 'Drupal\inmail\Tests\InmailWebTest') NoticeWebTestBase.php1862Drupal\simpletest\WebTestBase->drupalPostAjaxForm()
Undefined index: ajaxDrupal\simpletest\WebTestBase->drupalPostAjaxForm(NULL, Array, 'plugin') Drupal\inmail\Tests\InmailWebTest->doTestDelivererUi() Drupal\inmail\Tests\InmailWebTest->testAdminUi() Drupal\simpletest\TestBase->run(Array) simpletest_script_run_one_test('9', 'Drupal\inmail\Tests\InmailWebTest') NoticeWebTestBase.php1863Drupal\simpletest\WebTestBase->drupalPostAjaxForm()
Exception: No #ajax path specified. in Drupal\simpletest\WebTestBase->drupalPostAjaxForm() (line 1899 of /var/lib/drupaltestbot/sites/default/files/checkout/core/modules/simpletest/src/WebTestBase.php). Drupal\simpletest\WebTestBase->drupalPostAjaxForm(NULL, Array, 'plugin') Drupal\inmail\Tests\InmailWebTest->doTestDelivererUi() Drupal\inmail\Tests\InmailWebTest->testAdminUi() Drupal\simpletest\TestBase->run(Array) simpletest_script_run_one_test('9', 'Drupal\inmail\Tests\InmailWebTest') Uncaught exceptionWebTestBase.php1899Drupal\simpletest\WebTestBase->drupalPostAjaxForm()
ExpandDrupal\inmail\Tests\IntegrationTest541
MessageGroupFilenameLineFunctionStatus
The test did not complete due to a fatal error.Completion checkIntegrationTest.php41Drupal\inmail\Tests\IntegrationTest->testBounceFlow()
Unable to install modules: module 'inmail_mailmute' is missing its dependency module mailmute.OtherIntegrationTest.php30Drupal\inmail\Tests\IntegrationTest->setUp()
Invalid permission administer user display.RoleIntegrationTest.php56Drupal\inmail\Tests\IntegrationTest->testBounceFlow()
Invalid permission administer mailmute.RoleIntegrationTest.php56Drupal\inmail\Tests\IntegrationTest->testBounceFlow()
Argument 1 passed to Drupal\simpletest\WebTestBase::drupalLogin() must implement interface Drupal\Core\Session\AccountInterface, boolean given, called in /var/lib/drupaltestbot/sites/default/files/checkout/sites/default/modules/inmail/src/Tests/IntegrationTest.php on line 57 and definedDrupal\simpletest\WebTestBase->drupalLogin() Drupal\inmail\Tests\IntegrationTest->testBounceFlow() Drupal\simpletest\TestBase->run(Array) simpletest_script_run_one_test('8', 'Drupal\inmail\Tests\IntegrationTest') Recoverable errorWebTestBase.php602Drupal\simpletest\WebTestBase->drupalLogin()
LeafDrupal\inmail\Tests\ModeratorForwardTest1400
LeafDrupal\inmail\Tests\ProcessorTest300
LeafDrupal\inmail\Tests\VerpTest1100
ExpandDrupal\inmail_collect\Tests\InmailCollectWebTest011
MessageGroupFilenameLineFunctionStatus
Unable to install modules: module 'inmail_collect' is missing its dependency module collect.Otherrun-tests.sh647simpletest_script_run_one_test()
Drupal\Component\Plugin\Exception\PluginNotFoundException: The "block" entity type does not exist. in Drupal\Core\Entity\EntityManager->getDefinition() (line 276 of /var/lib/drupaltestbot/sites/default/files/checkout/core/lib/Drupal/Core/Entity/EntityManager.php). Drupal\Core\Entity\EntityManager->getDefinition('block') Drupal\Core\Entity\EntityManager->getHandler('block', 'storage') Drupal\Core\Entity\EntityManager->getStorage('block') entity_create('block', Array) Drupal\simpletest\WebTestBase->drupalPlaceBlock('local_actions_block') Drupal\inmail_collect\Tests\InmailCollectWebTest->testUi() Drupal\simpletest\TestBase->run(Array) simpletest_script_run_one_test('1', 'Drupal\inmail_collect\Tests\InmailCollectWebTest') Uncaught exceptionEntityManager.php276Drupal\Core\Entity\EntityManager->getDefinition()
ExpandDrupal\inmail_collect\Tests\InmailMessageModelTest011
MessageGroupFilenameLineFunctionStatus
The test did not complete due to a fatal error.Completion checkInmailMessageModelTest.php42Drupal\inmail_collect\Tests\InmailMessageModelTest->testProperties()
Undefined index: collectDrupal\simpletest\KernelTestBase->enableModules(Array) Drupal\simpletest\KernelTestBase->setUp() Drupal\simpletest\TestBase->run(Array) simpletest_script_run_one_test('2', 'Drupal\inmail_collect\Tests\InmailMessageModelTest') NoticeKernelTestBase.php510Drupal\simpletest\KernelTestBase->enableModules()
LeafDrupal\inmail_demo\Tests\InmailDemoTest2200
ExpandDrupal\inmail_mailmute\Tests\InmailMailmuteTest011
MessageGroupFilenameLineFunctionStatus
The test did not complete due to a fatal error.Completion checkInmailMailmuteTest.php64Drupal\inmail_mailmute\Tests\InmailMailmuteTest->testProcessAndTriggerSendStateTransition()
Undefined index: mailmuteDrupal\simpletest\KernelTestBase->enableModules(Array) Drupal\simpletest\KernelTestBase->setUp() Drupal\inmail_mailmute\Tests\InmailMailmuteTest->setUp() Drupal\simpletest\TestBase->run(Array) simpletest_script_run_one_test('4', 'Drupal\inmail_mailmute\Tests\InmailMailmuteTest') NoticeKernelTestBase.php510Drupal\simpletest\KernelTestBase->enableModules()
LeafDrupal\Tests\inmail\Unit\DSNStatusTest79400
LeafDrupal\Tests\inmail\Unit\MIME\DSNEntityTest600
LeafDrupal\Tests\inmail\Unit\MIME\HeaderTest700
LeafDrupal\Tests\inmail\Unit\MIME\MessageTest500
LeafDrupal\Tests\inmail\Unit\MIME\MultipartEntityTest700
LeafDrupal\Tests\inmail\Unit\MIME\ParserTest1000
LeafDrupal\Tests\inmail\Unit\Plugin\inmail\Analyzer\StandardDSNAnalyzerTest400
LeafDrupal\Tests\inmail\Unit\Plugin\inmail\Analyzer\StandardDSNReasonAnalyzerTest400