2102685-16.patch

Test status
StatusResult
Last receivedWed, 09/09/2015 - 05:59:05
Last requestedWed, 09/09/2015 - 06:00:01
Last testedWed, 09/09/2015 - 06:01:02
Test count1
Environment status
PHP 5.5 MySQLfail
File information
File2102685-16.patch
BranchExamples for Developers - 8.x-1.x
LinkIssue Link
SummaryFAILED: [[SimpleTest]]: [PHP 5.5 MySQL] 1,037 pass(es), 15 fail(s), and 1 exception(s).
Details

PHP 5.5 MySQL

  1. Setup environment
  2. Detect an invalid patch URL
  3. Detect invalid repository information
  4. Detect invalid patch format
  5. Detect a non-applicable patch
  6. Detect invalid PHP syntax
  7. Detect a Drupal installation failure
  8. Detect a test run failure
  9. Detect a failing test
    Review the test failures below then if necessary run them locally until the problem has been fixed.
  10. Complete test suite with all tests passing
1,037 pass(es), 15 fail(s), and 1 exception(s)

Non-pass

Test namePassFailException
ExpandDrupal\content_entity_example\Tests\ContentEntityExampleTest209120
MessageGroupFilenameLineFunctionStatus
Link with label Edit found.OtherContentEntityExampleTest.php72Drupal\content_entity_example\Tests\ContentEntityExampleTest->testContentEntityExample()
Link with label Delete found.OtherContentEntityExampleTest.php73Drupal\content_entity_example\Tests\ContentEntityExampleTest->testContentEntityExample()
Link test name does not exist on http://ec2-54-191-113-78.us-west-2.compute.amazonaws.com/checkout/content_entity_example_contact/listBrowserContentEntityExampleTest.php75Drupal\content_entity_example\Tests\ContentEntityExampleTest->testContentEntityExample()
"test name" foundOtherContentEntityExampleTest.php78Drupal\content_entity_example\Tests\ContentEntityExampleTest->testContentEntityExample()
"test first name" foundOtherContentEntityExampleTest.php79Drupal\content_entity_example\Tests\ContentEntityExampleTest->testContentEntityExample()
"male" foundOtherContentEntityExampleTest.php80Drupal\content_entity_example\Tests\ContentEntityExampleTest->testContentEntityExample()
Link with label Edit found.OtherContentEntityExampleTest.php82Drupal\content_entity_example\Tests\ContentEntityExampleTest->testContentEntityExample()
Link with label Delete found.OtherContentEntityExampleTest.php83Drupal\content_entity_example\Tests\ContentEntityExampleTest->testContentEntityExample()
Link Delete does not exist on http://ec2-54-191-113-78.us-west-2.compute.amazonaws.com/checkout/content_entity_example_contact/listBrowserContentEntityExampleTest.php86Drupal\content_entity_example\Tests\ContentEntityExampleTest->testContentEntityExample()
Link with label Cancel found.OtherContentEntityExampleTest.php89Drupal\content_entity_example\Tests\ContentEntityExampleTest->testContentEntityExample()
Found the Delete buttonOtherContentEntityExampleTest.php90Drupal\content_entity_example\Tests\ContentEntityExampleTest->testContentEntityExample()
Found the requested form fields at OtherContentEntityExampleTest.php90Drupal\content_entity_example\Tests\ContentEntityExampleTest->testContentEntityExample()
ExpandDrupal\dbtng_example\Tests\DBTNGExampleTest5720
MessageGroupFilenameLineFunctionStatus
Text 'Some Anonymous' found in tableOtherDBTNGExampleTest.php113Drupal\dbtng_example\Tests\DBTNGExampleTest->testUI()
Text 'NewFirstName Anonymous' found in tableOtherDBTNGExampleTest.php127Drupal\dbtng_example\Tests\DBTNGExampleTest->testUI()
ExpandDrupal\token_example\Tests\TokenExampleTest111
MessageGroupFilenameLineFunctionStatus
The test did not complete due to a fatal error.Completion checkTokenExampleTest.php31Drupal\token_example\Tests\TokenExampleTest->testTokenExampleToolBar()
Drupal\Component\Plugin\Exception\PluginNotFoundException: The "block" entity type does not exist. in Drupal\Core\Entity\EntityManager->getDefinition() (line 276 of /var/lib/drupaltestbot/sites/default/files/checkout/core/lib/Drupal/Core/Entity/EntityManager.php). Drupal\Core\Entity\EntityManager->getDefinition('block') Drupal\Core\Entity\EntityManager->getHandler('block', 'storage') Drupal\Core\Entity\EntityManager->getStorage('block') entity_create('block', Array) Drupal\simpletest\WebTestBase->drupalPlaceBlock('system_menu_block:tools', Array) Drupal\examples\Tests\ExamplesTestBase->setupExamplesMenus() Drupal\examples\Tests\ExamplesTestBase->setUp() Drupal\simpletest\TestBase->run(Array) simpletest_script_run_one_test('24', 'Drupal\token_example\Tests\TokenExampleTest') Uncaught exceptionEntityManager.php276Drupal\Core\Entity\EntityManager->getDefinition()

All

Test namePassFailException
LeafDrupal\block_example\Tests\BlockExampleMenuTest800
LeafDrupal\block_example\Tests\BlockExampleTest2700
LeafDrupal\cache_example\Tests\CacheExampleTestCase5900
LeafDrupal\config_entity_example\Tests\ConfigEntityExampleTest7100
ExpandDrupal\content_entity_example\Tests\ContentEntityExampleTest209120
MessageGroupFilenameLineFunctionStatus
Link with label Edit found.OtherContentEntityExampleTest.php72Drupal\content_entity_example\Tests\ContentEntityExampleTest->testContentEntityExample()
Link with label Delete found.OtherContentEntityExampleTest.php73Drupal\content_entity_example\Tests\ContentEntityExampleTest->testContentEntityExample()
Link test name does not exist on http://ec2-54-191-113-78.us-west-2.compute.amazonaws.com/checkout/content_entity_example_contact/listBrowserContentEntityExampleTest.php75Drupal\content_entity_example\Tests\ContentEntityExampleTest->testContentEntityExample()
"test name" foundOtherContentEntityExampleTest.php78Drupal\content_entity_example\Tests\ContentEntityExampleTest->testContentEntityExample()
"test first name" foundOtherContentEntityExampleTest.php79Drupal\content_entity_example\Tests\ContentEntityExampleTest->testContentEntityExample()
"male" foundOtherContentEntityExampleTest.php80Drupal\content_entity_example\Tests\ContentEntityExampleTest->testContentEntityExample()
Link with label Edit found.OtherContentEntityExampleTest.php82Drupal\content_entity_example\Tests\ContentEntityExampleTest->testContentEntityExample()
Link with label Delete found.OtherContentEntityExampleTest.php83Drupal\content_entity_example\Tests\ContentEntityExampleTest->testContentEntityExample()
Link Delete does not exist on http://ec2-54-191-113-78.us-west-2.compute.amazonaws.com/checkout/content_entity_example_contact/listBrowserContentEntityExampleTest.php86Drupal\content_entity_example\Tests\ContentEntityExampleTest->testContentEntityExample()
Link with label Cancel found.OtherContentEntityExampleTest.php89Drupal\content_entity_example\Tests\ContentEntityExampleTest->testContentEntityExample()
Found the Delete buttonOtherContentEntityExampleTest.php90Drupal\content_entity_example\Tests\ContentEntityExampleTest->testContentEntityExample()
Found the requested form fields at OtherContentEntityExampleTest.php90Drupal\content_entity_example\Tests\ContentEntityExampleTest->testContentEntityExample()
LeafDrupal\cron_example\Tests\CronExampleTestCase3500
ExpandDrupal\dbtng_example\Tests\DBTNGExampleTest5720
MessageGroupFilenameLineFunctionStatus
Text 'Some Anonymous' found in tableOtherDBTNGExampleTest.php113Drupal\dbtng_example\Tests\DBTNGExampleTest->testUI()
Text 'NewFirstName Anonymous' found in tableOtherDBTNGExampleTest.php127Drupal\dbtng_example\Tests\DBTNGExampleTest->testUI()
LeafDrupal\email_example\Tests\EmailExampleTest2100
LeafDrupal\examples\Tests\ExamplesTest2000
LeafDrupal\field_example\Tests\FieldExampleMenuTest800
ExpandDrupal\field_example\Tests\Text3WidgetTest11700
MessageGroupFilenameLineFunctionStatus
Saved settings for field <em class="placeholder">gwwzvrpplf</em> with widget <em class="placeholder">field_example_3text</em> and cardinality <em class="placeholder">1</em>DebugFieldExampleWebTestBase.php134Drupal\field_example\FieldExampleWebTestBase->createField()
Saved settings for field <em class="placeholder">xmn0vghdpk</em> with widget <em class="placeholder">field_example_3text</em> and cardinality <em class="placeholder">-1</em>DebugFieldExampleWebTestBase.php134Drupal\field_example\FieldExampleWebTestBase->createField()
ExpandDrupal\field_example\Tests\TextWidgetTest11700
MessageGroupFilenameLineFunctionStatus
Saved settings for field <em class="placeholder">ehixen4wvs</em> with widget <em class="placeholder">field_example_text</em> and cardinality <em class="placeholder">1</em>DebugFieldExampleWebTestBase.php134Drupal\field_example\FieldExampleWebTestBase->createField()
Saved settings for field <em class="placeholder">degw7k8wl6</em> with widget <em class="placeholder">field_example_text</em> and cardinality <em class="placeholder">-1</em>DebugFieldExampleWebTestBase.php134Drupal\field_example\FieldExampleWebTestBase->createField()
LeafDrupal\js_example\Tests\JsExampleTest1000
LeafDrupal\node_type_example\Tests\NodeTypeExampleTest4300
LeafDrupal\page_example\Tests\PageExampleTest9000
LeafDrupal\phpunit_example\Tests\PHPUnitExampleMenuTest800
LeafDrupal\simpletest_example\Tests\SimpleTestExampleMockModuleTest1200
LeafDrupal\simpletest_example\Tests\SimpleTestExampleTest3500
LeafDrupal\tablesort_example\Tests\TableSortExampleTest2700
LeafDrupal\Tests\phpunit_example\Unit\AddClassTest2700
LeafDrupal\Tests\phpunit_example\Unit\DisplayManagerTest100
LeafDrupal\Tests\phpunit_example\Unit\ProtectedPrivatesTest400
ExpandDrupal\token_example\Tests\TokenExampleTest111
MessageGroupFilenameLineFunctionStatus
The test did not complete due to a fatal error.Completion checkTokenExampleTest.php31Drupal\token_example\Tests\TokenExampleTest->testTokenExampleToolBar()
Drupal\Component\Plugin\Exception\PluginNotFoundException: The "block" entity type does not exist. in Drupal\Core\Entity\EntityManager->getDefinition() (line 276 of /var/lib/drupaltestbot/sites/default/files/checkout/core/lib/Drupal/Core/Entity/EntityManager.php). Drupal\Core\Entity\EntityManager->getDefinition('block') Drupal\Core\Entity\EntityManager->getHandler('block', 'storage') Drupal\Core\Entity\EntityManager->getStorage('block') entity_create('block', Array) Drupal\simpletest\WebTestBase->drupalPlaceBlock('system_menu_block:tools', Array) Drupal\examples\Tests\ExamplesTestBase->setupExamplesMenus() Drupal\examples\Tests\ExamplesTestBase->setUp() Drupal\simpletest\TestBase->run(Array) simpletest_script_run_one_test('24', 'Drupal\token_example\Tests\TokenExampleTest') Uncaught exceptionEntityManager.php276Drupal\Core\Entity\EntityManager->getDefinition()
LeafDrupal\tour_example\Tests\TourExampleTest3000