convert-2469609-29.patch

Test status
StatusResult
Last receivedMon, 09/07/2015 - 12:31:00
Last requestedMon, 09/07/2015 - 12:40:29
Last testedMon, 09/07/2015 - 12:41:15
Test count1
Environment status
PHP 5.5 MySQLfail
File information
Fileconvert-2469609-29.patch
BranchDynamic Entity Reference - 8.x-1.x
LinkIssue Link
SummaryFAILED: [[SimpleTest]]: [PHP 5.5 MySQL] 366 pass(es), 3 fail(s), and 0 exception(s).
Details

PHP 5.5 MySQL

  1. Setup environment
  2. Detect an invalid patch URL
  3. Detect invalid repository information
  4. Detect invalid patch format
  5. Detect a non-applicable patch
  6. Detect invalid PHP syntax
  7. Detect a Drupal installation failure
  8. Detect a test run failure
  9. Detect a failing test
    Review the test failures below then if necessary run them locally until the problem has been fixed.
  10. Complete test suite with all tests passing
366 pass(es), 3 fail(s), and 0 exception(s)

Non-pass

Test namePassFailException
ExpandDrupal\Tests\dynamic_entity_reference\Functional\DynamicEntityReferenceTest030
MessageGroupFilenameLineFunctionStatus
Drupal\Tests\dynamic_entity_reference\Functional\DynamicEntityReferenceTest::testFieldSettings Drupal\Core\Extension\MissingDependencyException: Unable to install modules entity_reference, field_ui, dynamic_entity_reference, entity_test due to missing modules dynamic_entity_reference. /var/lib/drupaltestbot/sites/default/files/checkout/core/lib/Drupal/Core/Extension/ModuleInstaller.php:90 /var/lib/drupaltestbot/sites/default/files/checkout/core/lib/Drupal/Core/ProxyClass/Extension/ModuleInstaller.php:87 /var/lib/drupaltestbot/sites/default/files/checkout/core/modules/simpletest/src/BrowserTestBase.php:872 /var/lib/drupaltestbot/sites/default/files/checkout/core/modules/simpletest/src/BrowserTestBase.php:260 /var/lib/drupaltestbot/sites/default/files/checkout/sites/default/modules/dynamic_entity_reference/tests/src/Functional/DynamicEntityReferenceTest.php:68 OtherDynamicEntityReferenceTest.php75Drupal\Tests\dynamic_entity_reference\Functional\DynamicEntityReferenceTest->testFieldSettings()
Drupal\Tests\dynamic_entity_reference\Functional\DynamicEntityReferenceTest::testDynamicEntityReference Drupal\Core\Extension\MissingDependencyException: Unable to install modules entity_reference, field_ui, dynamic_entity_reference, entity_test due to missing modules dynamic_entity_reference. /var/lib/drupaltestbot/sites/default/files/checkout/core/lib/Drupal/Core/Extension/ModuleInstaller.php:90 /var/lib/drupaltestbot/sites/default/files/checkout/core/lib/Drupal/Core/ProxyClass/Extension/ModuleInstaller.php:87 /var/lib/drupaltestbot/sites/default/files/checkout/core/modules/simpletest/src/BrowserTestBase.php:872 /var/lib/drupaltestbot/sites/default/files/checkout/core/modules/simpletest/src/BrowserTestBase.php:260 /var/lib/drupaltestbot/sites/default/files/checkout/sites/default/modules/dynamic_entity_reference/tests/src/Functional/DynamicEntityReferenceTest.php:68 OtherDynamicEntityReferenceTest.php155Drupal\Tests\dynamic_entity_reference\Functional\DynamicEntityReferenceTest->testDynamicEntityReference()
Drupal\Tests\dynamic_entity_reference\Functional\DynamicEntityReferenceTest::testDynamicEntityReferenceAutoCreate Drupal\Core\Extension\MissingDependencyException: Unable to install modules entity_reference, field_ui, dynamic_entity_reference, entity_test due to missing modules dynamic_entity_reference. /var/lib/drupaltestbot/sites/default/files/checkout/core/lib/Drupal/Core/Extension/ModuleInstaller.php:90 /var/lib/drupaltestbot/sites/default/files/checkout/core/lib/Drupal/Core/ProxyClass/Extension/ModuleInstaller.php:87 /var/lib/drupaltestbot/sites/default/files/checkout/core/modules/simpletest/src/BrowserTestBase.php:872 /var/lib/drupaltestbot/sites/default/files/checkout/core/modules/simpletest/src/BrowserTestBase.php:260 /var/lib/drupaltestbot/sites/default/files/checkout/sites/default/modules/dynamic_entity_reference/tests/src/Functional/DynamicEntityReferenceTest.php:68 OtherDynamicEntityReferenceTest.php363Drupal\Tests\dynamic_entity_reference\Functional\DynamicEntityReferenceTest->testDynamicEntityReferenceAutoCreate()

All

Test namePassFailException
LeafDrupal\dynamic_entity_reference\Tests\DynamicEntityReferenceFieldDefaultValueTest2600
LeafDrupal\dynamic_entity_reference\Tests\DynamicEntityReferenceFieldTest2900
LeafDrupal\dynamic_entity_reference\Tests\DynamicEntityReferenceFormatterTest4500
LeafDrupal\dynamic_entity_reference\Tests\DynamicEntityReferenceItemTest6100
LeafDrupal\dynamic_entity_reference\Tests\DynamicEntityReferenceSchemaTest1100
LeafDrupal\dynamic_entity_reference\Tests\DynamicEntityReferenceWidgetTest5400
LeafDrupal\dynamic_entity_reference\Tests\Views\DynamicEntityReferenceRelationshipTest14000
ExpandDrupal\Tests\dynamic_entity_reference\Functional\DynamicEntityReferenceTest030
MessageGroupFilenameLineFunctionStatus
Drupal\Tests\dynamic_entity_reference\Functional\DynamicEntityReferenceTest::testFieldSettings Drupal\Core\Extension\MissingDependencyException: Unable to install modules entity_reference, field_ui, dynamic_entity_reference, entity_test due to missing modules dynamic_entity_reference. /var/lib/drupaltestbot/sites/default/files/checkout/core/lib/Drupal/Core/Extension/ModuleInstaller.php:90 /var/lib/drupaltestbot/sites/default/files/checkout/core/lib/Drupal/Core/ProxyClass/Extension/ModuleInstaller.php:87 /var/lib/drupaltestbot/sites/default/files/checkout/core/modules/simpletest/src/BrowserTestBase.php:872 /var/lib/drupaltestbot/sites/default/files/checkout/core/modules/simpletest/src/BrowserTestBase.php:260 /var/lib/drupaltestbot/sites/default/files/checkout/sites/default/modules/dynamic_entity_reference/tests/src/Functional/DynamicEntityReferenceTest.php:68 OtherDynamicEntityReferenceTest.php75Drupal\Tests\dynamic_entity_reference\Functional\DynamicEntityReferenceTest->testFieldSettings()
Drupal\Tests\dynamic_entity_reference\Functional\DynamicEntityReferenceTest::testDynamicEntityReference Drupal\Core\Extension\MissingDependencyException: Unable to install modules entity_reference, field_ui, dynamic_entity_reference, entity_test due to missing modules dynamic_entity_reference. /var/lib/drupaltestbot/sites/default/files/checkout/core/lib/Drupal/Core/Extension/ModuleInstaller.php:90 /var/lib/drupaltestbot/sites/default/files/checkout/core/lib/Drupal/Core/ProxyClass/Extension/ModuleInstaller.php:87 /var/lib/drupaltestbot/sites/default/files/checkout/core/modules/simpletest/src/BrowserTestBase.php:872 /var/lib/drupaltestbot/sites/default/files/checkout/core/modules/simpletest/src/BrowserTestBase.php:260 /var/lib/drupaltestbot/sites/default/files/checkout/sites/default/modules/dynamic_entity_reference/tests/src/Functional/DynamicEntityReferenceTest.php:68 OtherDynamicEntityReferenceTest.php155Drupal\Tests\dynamic_entity_reference\Functional\DynamicEntityReferenceTest->testDynamicEntityReference()
Drupal\Tests\dynamic_entity_reference\Functional\DynamicEntityReferenceTest::testDynamicEntityReferenceAutoCreate Drupal\Core\Extension\MissingDependencyException: Unable to install modules entity_reference, field_ui, dynamic_entity_reference, entity_test due to missing modules dynamic_entity_reference. /var/lib/drupaltestbot/sites/default/files/checkout/core/lib/Drupal/Core/Extension/ModuleInstaller.php:90 /var/lib/drupaltestbot/sites/default/files/checkout/core/lib/Drupal/Core/ProxyClass/Extension/ModuleInstaller.php:87 /var/lib/drupaltestbot/sites/default/files/checkout/core/modules/simpletest/src/BrowserTestBase.php:872 /var/lib/drupaltestbot/sites/default/files/checkout/core/modules/simpletest/src/BrowserTestBase.php:260 /var/lib/drupaltestbot/sites/default/files/checkout/sites/default/modules/dynamic_entity_reference/tests/src/Functional/DynamicEntityReferenceTest.php:68 OtherDynamicEntityReferenceTest.php363Drupal\Tests\dynamic_entity_reference\Functional\DynamicEntityReferenceTest->testDynamicEntityReferenceAutoCreate()