2564085.2.removeViewsUIdep.patch

Test status
StatusResult
Last receivedMon, 09/07/2015 - 09:14:59
Last requestedMon, 09/07/2015 - 09:15:01
Last testedMon, 09/07/2015 - 09:15:37
Test count1
Environment status
PHP 5.5 MySQLfail
File information
File2564085.2.removeViewsUIdep.patch
BranchFlag - 8.x-4.x
LinkIssue Link
SummaryFAILED: [[SimpleTest]]: [PHP 5.5 MySQL] 254 pass(es), 38 fail(s), and 9 exception(s).
Details

PHP 5.5 MySQL

  1. Setup environment
  2. Detect an invalid patch URL
  3. Detect invalid repository information
  4. Detect invalid patch format
  5. Detect a non-applicable patch
  6. Detect invalid PHP syntax
  7. Detect a Drupal installation failure
  8. Detect a test run failure
  9. Detect a failing test
    Review the test failures below then if necessary run them locally until the problem has been fixed.
  10. Complete test suite with all tests passing
254 pass(es), 38 fail(s), and 9 exception(s)

Non-pass

Test namePassFailException
ExpandDrupal\flag\Tests\FlagConfirmFormTest1413
MessageGroupFilenameLineFunctionStatus
Undefined offset: 0Drupal\simpletest\WebTestBase->drupalPostAjaxForm(NULL, Array, 'link_type') Drupal\flag\Tests\FlagConfirmFormTest->doCreateFlag() Drupal\flag\Tests\FlagConfirmFormTest->testCreateConfirmFlag() Drupal\simpletest\TestBase->run(Array) simpletest_script_run_one_test('7', 'Drupal\flag\Tests\FlagConfirmFormTest') NoticeWebTestBase.php1862Drupal\simpletest\WebTestBase->drupalPostAjaxForm()
Undefined index: ajaxDrupal\simpletest\WebTestBase->drupalPostAjaxForm(NULL, Array, 'link_type') Drupal\flag\Tests\FlagConfirmFormTest->doCreateFlag() Drupal\flag\Tests\FlagConfirmFormTest->testCreateConfirmFlag() Drupal\simpletest\TestBase->run(Array) simpletest_script_run_one_test('7', 'Drupal\flag\Tests\FlagConfirmFormTest') NoticeWebTestBase.php1863Drupal\simpletest\WebTestBase->drupalPostAjaxForm()
Exception: No #ajax path specified. in Drupal\simpletest\WebTestBase->drupalPostAjaxForm() (line 1899 of /var/lib/drupaltestbot/sites/default/files/checkout/core/modules/simpletest/src/WebTestBase.php). Drupal\simpletest\WebTestBase->drupalPostAjaxForm(NULL, Array, 'link_type') Drupal\flag\Tests\FlagConfirmFormTest->doCreateFlag() Drupal\flag\Tests\FlagConfirmFormTest->testCreateConfirmFlag() Drupal\simpletest\TestBase->run(Array) simpletest_script_run_one_test('7', 'Drupal\flag\Tests\FlagConfirmFormTest') Uncaught exceptionWebTestBase.php1899Drupal\simpletest\WebTestBase->drupalPostAjaxForm()
[07-Sep-2015 19:15:31 Australia/Sydney] Uncaught PHP Exception Symfony\Component\Routing\Exception\RouteNotFoundException: "Route "entity.view.collection" does not exist." at /var/lib/drupaltestbot/sites/default/files/checkout/core/lib/Drupal/Core/Routing/RouteProvider.php line 193 Fatal errorUnknown0Unknown
ExpandDrupal\flag\Tests\FlagEnableDisableTest1413
MessageGroupFilenameLineFunctionStatus
Undefined offset: 0Drupal\simpletest\WebTestBase->drupalPostAjaxForm(NULL, Array, 'link_type') Drupal\flag\Tests\FlagTestBase->createFlagWithForm('node', Array) Drupal\flag\Tests\FlagEnableDisableTest->doCreateFlag() Drupal\flag\Tests\FlagEnableDisableTest->testDiableEnableFlag() Drupal\simpletest\TestBase->run(Array) simpletest_script_run_one_test('5', 'Drupal\flag\Tests\FlagEnableDisableTest') NoticeWebTestBase.php1862Drupal\simpletest\WebTestBase->drupalPostAjaxForm()
Undefined index: ajaxDrupal\simpletest\WebTestBase->drupalPostAjaxForm(NULL, Array, 'link_type') Drupal\flag\Tests\FlagTestBase->createFlagWithForm('node', Array) Drupal\flag\Tests\FlagEnableDisableTest->doCreateFlag() Drupal\flag\Tests\FlagEnableDisableTest->testDiableEnableFlag() Drupal\simpletest\TestBase->run(Array) simpletest_script_run_one_test('5', 'Drupal\flag\Tests\FlagEnableDisableTest') NoticeWebTestBase.php1863Drupal\simpletest\WebTestBase->drupalPostAjaxForm()
Exception: No #ajax path specified. in Drupal\simpletest\WebTestBase->drupalPostAjaxForm() (line 1899 of /var/lib/drupaltestbot/sites/default/files/checkout/core/modules/simpletest/src/WebTestBase.php). Drupal\simpletest\WebTestBase->drupalPostAjaxForm(NULL, Array, 'link_type') Drupal\flag\Tests\FlagTestBase->createFlagWithForm('node', Array) Drupal\flag\Tests\FlagEnableDisableTest->doCreateFlag() Drupal\flag\Tests\FlagEnableDisableTest->testDiableEnableFlag() Drupal\simpletest\TestBase->run(Array) simpletest_script_run_one_test('5', 'Drupal\flag\Tests\FlagEnableDisableTest') Uncaught exceptionWebTestBase.php1899Drupal\simpletest\WebTestBase->drupalPostAjaxForm()
[07-Sep-2015 19:15:31 Australia/Sydney] Uncaught PHP Exception Symfony\Component\Routing\Exception\RouteNotFoundException: "Route "entity.view.collection" does not exist." at /var/lib/drupaltestbot/sites/default/files/checkout/core/lib/Drupal/Core/Routing/RouteProvider.php line 193 Fatal errorUnknown0Unknown
ExpandDrupal\flag\Tests\FlagFieldEntryTest1413
MessageGroupFilenameLineFunctionStatus
Undefined offset: 0Drupal\simpletest\WebTestBase->drupalPostAjaxForm(NULL, Array, 'link_type') Drupal\flag\Tests\FlagFieldEntryTest->doCreateFlag() Drupal\flag\Tests\FlagFieldEntryTest->testCreateFieldEntryFlag() Drupal\simpletest\TestBase->run(Array) simpletest_script_run_one_test('4', 'Drupal\flag\Tests\FlagFieldEntryTest') NoticeWebTestBase.php1862Drupal\simpletest\WebTestBase->drupalPostAjaxForm()
Undefined index: ajaxDrupal\simpletest\WebTestBase->drupalPostAjaxForm(NULL, Array, 'link_type') Drupal\flag\Tests\FlagFieldEntryTest->doCreateFlag() Drupal\flag\Tests\FlagFieldEntryTest->testCreateFieldEntryFlag() Drupal\simpletest\TestBase->run(Array) simpletest_script_run_one_test('4', 'Drupal\flag\Tests\FlagFieldEntryTest') NoticeWebTestBase.php1863Drupal\simpletest\WebTestBase->drupalPostAjaxForm()
Exception: No #ajax path specified. in Drupal\simpletest\WebTestBase->drupalPostAjaxForm() (line 1899 of /var/lib/drupaltestbot/sites/default/files/checkout/core/modules/simpletest/src/WebTestBase.php). Drupal\simpletest\WebTestBase->drupalPostAjaxForm(NULL, Array, 'link_type') Drupal\flag\Tests\FlagFieldEntryTest->doCreateFlag() Drupal\flag\Tests\FlagFieldEntryTest->testCreateFieldEntryFlag() Drupal\simpletest\TestBase->run(Array) simpletest_script_run_one_test('4', 'Drupal\flag\Tests\FlagFieldEntryTest') Uncaught exceptionWebTestBase.php1899Drupal\simpletest\WebTestBase->drupalPostAjaxForm()
[07-Sep-2015 19:15:32 Australia/Sydney] Uncaught PHP Exception Symfony\Component\Routing\Exception\RouteNotFoundException: "Route "entity.view.collection" does not exist." at /var/lib/drupaltestbot/sites/default/files/checkout/core/lib/Drupal/Core/Routing/RouteProvider.php line 193 Fatal errorUnknown0Unknown
ExpandDrupal\flag\Tests\FlagResetTest1610
MessageGroupFilenameLineFunctionStatus
[07-Sep-2015 19:15:31 Australia/Sydney] Uncaught PHP Exception Symfony\Component\Routing\Exception\RouteNotFoundException: "Route "entity.view.collection" does not exist." at /var/lib/drupaltestbot/sites/default/files/checkout/core/lib/Drupal/Core/Routing/RouteProvider.php line 193 Fatal errorUnknown0Unknown
ExpandDrupal\flag\Tests\FlagSimpleTest175340
MessageGroupFilenameLineFunctionStatus
"Messages" foundOtherFlagSimpleTest.php94Drupal\flag\Tests\FlagSimpleTest->doFlagAdd()
"Flag access" foundOtherFlagSimpleTest.php95Drupal\flag\Tests\FlagSimpleTest->doFlagAdd()
"Display options" foundOtherFlagSimpleTest.php96Drupal\flag\Tests\FlagSimpleTest->doFlagAdd()
Failed to set field label to Test label 123OtherFlagSimpleTest.php103Drupal\flag\Tests\FlagSimpleTest->doFlagAdd()
Failed to set field id to test_label_123OtherFlagSimpleTest.php103Drupal\flag\Tests\FlagSimpleTest->doFlagAdd()
Failed to set field bundles[article] to articleOtherFlagSimpleTest.php103Drupal\flag\Tests\FlagSimpleTest->doFlagAdd()
Found the Create Flag buttonOtherFlagSimpleTest.php103Drupal\flag\Tests\FlagSimpleTest->doFlagAdd()
Found the requested form fields at OtherFlagSimpleTest.php103Drupal\flag\Tests\FlagSimpleTest->doFlagAdd()
"Flag Test label 123 has been added." foundOtherFlagSimpleTest.php105Drupal\flag\Tests\FlagSimpleTest->doFlagAdd()
Link Flag this item does not exist on http://ec2-54-191-149-30.us-west-2.compute.amazonaws.com/checkout/node/1BrowserFlagSimpleTest.php127Drupal\flag\Tests\FlagSimpleTest->doFlagLinksTest()
Link with label Unflag this item found.OtherFlagSimpleTest.php129Drupal\flag\Tests\FlagSimpleTest->doFlagLinksTest()
Link with label Flag this item found.OtherFlagSimpleTest.php136Drupal\flag\Tests\FlagSimpleTest->doFlagLinksTest()
Link Unflag this item does not exist on http://ec2-54-191-149-30.us-west-2.compute.amazonaws.com/checkout/node/1BrowserFlagSimpleTest.php142Drupal\flag\Tests\FlagSimpleTest->doFlagLinksTest()
Link with label Flag this item found.OtherFlagSimpleTest.php144Drupal\flag\Tests\FlagSimpleTest->doFlagLinksTest()
Link Flag this item does not exist on http://ec2-54-191-149-30.us-west-2.compute.amazonaws.com/checkout/node/2BrowserFlagSimpleTest.php174Drupal\flag\Tests\FlagSimpleTest->doGlobalFlagLinksTest()
Link with label Unflag this item found.OtherFlagSimpleTest.php176Drupal\flag\Tests\FlagSimpleTest->doGlobalFlagLinksTest()
Link with label Flag this item found.OtherFlagSimpleTest.php180Drupal\flag\Tests\FlagSimpleTest->doGlobalFlagLinksTest()
Failed to set field global to 1OtherFlagSimpleTest.php186Drupal\flag\Tests\FlagSimpleTest->doGlobalFlagLinksTest()
Found the Save Flag buttonOtherFlagSimpleTest.php186Drupal\flag\Tests\FlagSimpleTest->doGlobalFlagLinksTest()
Found the requested form fields at admin/structure/flags/manage/test_label_123OtherFlagSimpleTest.php186Drupal\flag\Tests\FlagSimpleTest->doGlobalFlagLinksTest()
Checkbox field edit-global is checked.BrowserFlagSimpleTest.php188Drupal\flag\Tests\FlagSimpleTest->doGlobalFlagLinksTest()
Link with label Unflag this item found.OtherFlagSimpleTest.php192Drupal\flag\Tests\FlagSimpleTest->doGlobalFlagLinksTest()
Failed to set field global to OtherFlagSimpleTest.php198Drupal\flag\Tests\FlagSimpleTest->doGlobalFlagLinksTest()
Found the Save Flag buttonOtherFlagSimpleTest.php198Drupal\flag\Tests\FlagSimpleTest->doGlobalFlagLinksTest()
Found the requested form fields at admin/structure/flags/manage/test_label_123OtherFlagSimpleTest.php198Drupal\flag\Tests\FlagSimpleTest->doGlobalFlagLinksTest()
Checkbox field edit-global is not checked.BrowserFlagSimpleTest.php200Drupal\flag\Tests\FlagSimpleTest->doGlobalFlagLinksTest()
Link with label Flag this item found.OtherFlagSimpleTest.php204Drupal\flag\Tests\FlagSimpleTest->doGlobalFlagLinksTest()
Link with label Flag this item found.OtherFlagSimpleTest.php222Drupal\flag\Tests\FlagSimpleTest->doFlagLinkTeaserTest()
Failed to set field fields[flag_test_label_123][type] to hiddenOtherFlagSimpleTest.php229Drupal\flag\Tests\FlagSimpleTest->doFlagLinkTeaserTest()
Found the requested form fields at admin/structure/types/manage/article/display/teaserOtherFlagSimpleTest.php229Drupal\flag\Tests\FlagSimpleTest->doFlagLinkTeaserTest()
"Your settings have been saved." foundOtherFlagSimpleTest.php232Drupal\flag\Tests\FlagSimpleTest->doFlagLinkTeaserTest()
Link Flag this item does not exist on http://ec2-54-191-149-30.us-west-2.compute.amazonaws.com/checkout/node/4BrowserFlagSimpleTest.php254Drupal\flag\Tests\FlagSimpleTest->doUserDeletionTest()
Link with label Unflag this item found.OtherFlagSimpleTest.php256Drupal\flag\Tests\FlagSimpleTest->doUserDeletionTest()
[07-Sep-2015 19:15:31 Australia/Sydney] Uncaught PHP Exception Symfony\Component\Routing\Exception\RouteNotFoundException: "Route "entity.view.collection" does not exist." at /var/lib/drupaltestbot/sites/default/files/checkout/core/lib/Drupal/Core/Routing/RouteProvider.php line 193 Fatal errorUnknown0Unknown

All

Test namePassFailException
ExpandDrupal\flag\Tests\FlagConfirmFormTest1413
MessageGroupFilenameLineFunctionStatus
Undefined offset: 0Drupal\simpletest\WebTestBase->drupalPostAjaxForm(NULL, Array, 'link_type') Drupal\flag\Tests\FlagConfirmFormTest->doCreateFlag() Drupal\flag\Tests\FlagConfirmFormTest->testCreateConfirmFlag() Drupal\simpletest\TestBase->run(Array) simpletest_script_run_one_test('7', 'Drupal\flag\Tests\FlagConfirmFormTest') NoticeWebTestBase.php1862Drupal\simpletest\WebTestBase->drupalPostAjaxForm()
Undefined index: ajaxDrupal\simpletest\WebTestBase->drupalPostAjaxForm(NULL, Array, 'link_type') Drupal\flag\Tests\FlagConfirmFormTest->doCreateFlag() Drupal\flag\Tests\FlagConfirmFormTest->testCreateConfirmFlag() Drupal\simpletest\TestBase->run(Array) simpletest_script_run_one_test('7', 'Drupal\flag\Tests\FlagConfirmFormTest') NoticeWebTestBase.php1863Drupal\simpletest\WebTestBase->drupalPostAjaxForm()
Exception: No #ajax path specified. in Drupal\simpletest\WebTestBase->drupalPostAjaxForm() (line 1899 of /var/lib/drupaltestbot/sites/default/files/checkout/core/modules/simpletest/src/WebTestBase.php). Drupal\simpletest\WebTestBase->drupalPostAjaxForm(NULL, Array, 'link_type') Drupal\flag\Tests\FlagConfirmFormTest->doCreateFlag() Drupal\flag\Tests\FlagConfirmFormTest->testCreateConfirmFlag() Drupal\simpletest\TestBase->run(Array) simpletest_script_run_one_test('7', 'Drupal\flag\Tests\FlagConfirmFormTest') Uncaught exceptionWebTestBase.php1899Drupal\simpletest\WebTestBase->drupalPostAjaxForm()
[07-Sep-2015 19:15:31 Australia/Sydney] Uncaught PHP Exception Symfony\Component\Routing\Exception\RouteNotFoundException: "Route "entity.view.collection" does not exist." at /var/lib/drupaltestbot/sites/default/files/checkout/core/lib/Drupal/Core/Routing/RouteProvider.php line 193 Fatal errorUnknown0Unknown
LeafDrupal\flag\Tests\FlagCountsTest1000
ExpandDrupal\flag\Tests\FlagEnableDisableTest1413
MessageGroupFilenameLineFunctionStatus
Undefined offset: 0Drupal\simpletest\WebTestBase->drupalPostAjaxForm(NULL, Array, 'link_type') Drupal\flag\Tests\FlagTestBase->createFlagWithForm('node', Array) Drupal\flag\Tests\FlagEnableDisableTest->doCreateFlag() Drupal\flag\Tests\FlagEnableDisableTest->testDiableEnableFlag() Drupal\simpletest\TestBase->run(Array) simpletest_script_run_one_test('5', 'Drupal\flag\Tests\FlagEnableDisableTest') NoticeWebTestBase.php1862Drupal\simpletest\WebTestBase->drupalPostAjaxForm()
Undefined index: ajaxDrupal\simpletest\WebTestBase->drupalPostAjaxForm(NULL, Array, 'link_type') Drupal\flag\Tests\FlagTestBase->createFlagWithForm('node', Array) Drupal\flag\Tests\FlagEnableDisableTest->doCreateFlag() Drupal\flag\Tests\FlagEnableDisableTest->testDiableEnableFlag() Drupal\simpletest\TestBase->run(Array) simpletest_script_run_one_test('5', 'Drupal\flag\Tests\FlagEnableDisableTest') NoticeWebTestBase.php1863Drupal\simpletest\WebTestBase->drupalPostAjaxForm()
Exception: No #ajax path specified. in Drupal\simpletest\WebTestBase->drupalPostAjaxForm() (line 1899 of /var/lib/drupaltestbot/sites/default/files/checkout/core/modules/simpletest/src/WebTestBase.php). Drupal\simpletest\WebTestBase->drupalPostAjaxForm(NULL, Array, 'link_type') Drupal\flag\Tests\FlagTestBase->createFlagWithForm('node', Array) Drupal\flag\Tests\FlagEnableDisableTest->doCreateFlag() Drupal\flag\Tests\FlagEnableDisableTest->testDiableEnableFlag() Drupal\simpletest\TestBase->run(Array) simpletest_script_run_one_test('5', 'Drupal\flag\Tests\FlagEnableDisableTest') Uncaught exceptionWebTestBase.php1899Drupal\simpletest\WebTestBase->drupalPostAjaxForm()
[07-Sep-2015 19:15:31 Australia/Sydney] Uncaught PHP Exception Symfony\Component\Routing\Exception\RouteNotFoundException: "Route "entity.view.collection" does not exist." at /var/lib/drupaltestbot/sites/default/files/checkout/core/lib/Drupal/Core/Routing/RouteProvider.php line 193 Fatal errorUnknown0Unknown
ExpandDrupal\flag\Tests\FlagFieldEntryTest1413
MessageGroupFilenameLineFunctionStatus
Undefined offset: 0Drupal\simpletest\WebTestBase->drupalPostAjaxForm(NULL, Array, 'link_type') Drupal\flag\Tests\FlagFieldEntryTest->doCreateFlag() Drupal\flag\Tests\FlagFieldEntryTest->testCreateFieldEntryFlag() Drupal\simpletest\TestBase->run(Array) simpletest_script_run_one_test('4', 'Drupal\flag\Tests\FlagFieldEntryTest') NoticeWebTestBase.php1862Drupal\simpletest\WebTestBase->drupalPostAjaxForm()
Undefined index: ajaxDrupal\simpletest\WebTestBase->drupalPostAjaxForm(NULL, Array, 'link_type') Drupal\flag\Tests\FlagFieldEntryTest->doCreateFlag() Drupal\flag\Tests\FlagFieldEntryTest->testCreateFieldEntryFlag() Drupal\simpletest\TestBase->run(Array) simpletest_script_run_one_test('4', 'Drupal\flag\Tests\FlagFieldEntryTest') NoticeWebTestBase.php1863Drupal\simpletest\WebTestBase->drupalPostAjaxForm()
Exception: No #ajax path specified. in Drupal\simpletest\WebTestBase->drupalPostAjaxForm() (line 1899 of /var/lib/drupaltestbot/sites/default/files/checkout/core/modules/simpletest/src/WebTestBase.php). Drupal\simpletest\WebTestBase->drupalPostAjaxForm(NULL, Array, 'link_type') Drupal\flag\Tests\FlagFieldEntryTest->doCreateFlag() Drupal\flag\Tests\FlagFieldEntryTest->testCreateFieldEntryFlag() Drupal\simpletest\TestBase->run(Array) simpletest_script_run_one_test('4', 'Drupal\flag\Tests\FlagFieldEntryTest') Uncaught exceptionWebTestBase.php1899Drupal\simpletest\WebTestBase->drupalPostAjaxForm()
[07-Sep-2015 19:15:32 Australia/Sydney] Uncaught PHP Exception Symfony\Component\Routing\Exception\RouteNotFoundException: "Route "entity.view.collection" does not exist." at /var/lib/drupaltestbot/sites/default/files/checkout/core/lib/Drupal/Core/Routing/RouteProvider.php line 193 Fatal errorUnknown0Unknown
ExpandDrupal\flag\Tests\FlagResetTest1610
MessageGroupFilenameLineFunctionStatus
[07-Sep-2015 19:15:31 Australia/Sydney] Uncaught PHP Exception Symfony\Component\Routing\Exception\RouteNotFoundException: "Route "entity.view.collection" does not exist." at /var/lib/drupaltestbot/sites/default/files/checkout/core/lib/Drupal/Core/Routing/RouteProvider.php line 193 Fatal errorUnknown0Unknown
LeafDrupal\flag\Tests\FlagServiceTest1100
ExpandDrupal\flag\Tests\FlagSimpleTest175340
MessageGroupFilenameLineFunctionStatus
"Messages" foundOtherFlagSimpleTest.php94Drupal\flag\Tests\FlagSimpleTest->doFlagAdd()
"Flag access" foundOtherFlagSimpleTest.php95Drupal\flag\Tests\FlagSimpleTest->doFlagAdd()
"Display options" foundOtherFlagSimpleTest.php96Drupal\flag\Tests\FlagSimpleTest->doFlagAdd()
Failed to set field label to Test label 123OtherFlagSimpleTest.php103Drupal\flag\Tests\FlagSimpleTest->doFlagAdd()
Failed to set field id to test_label_123OtherFlagSimpleTest.php103Drupal\flag\Tests\FlagSimpleTest->doFlagAdd()
Failed to set field bundles[article] to articleOtherFlagSimpleTest.php103Drupal\flag\Tests\FlagSimpleTest->doFlagAdd()
Found the Create Flag buttonOtherFlagSimpleTest.php103Drupal\flag\Tests\FlagSimpleTest->doFlagAdd()
Found the requested form fields at OtherFlagSimpleTest.php103Drupal\flag\Tests\FlagSimpleTest->doFlagAdd()
"Flag Test label 123 has been added." foundOtherFlagSimpleTest.php105Drupal\flag\Tests\FlagSimpleTest->doFlagAdd()
Link Flag this item does not exist on http://ec2-54-191-149-30.us-west-2.compute.amazonaws.com/checkout/node/1BrowserFlagSimpleTest.php127Drupal\flag\Tests\FlagSimpleTest->doFlagLinksTest()
Link with label Unflag this item found.OtherFlagSimpleTest.php129Drupal\flag\Tests\FlagSimpleTest->doFlagLinksTest()
Link with label Flag this item found.OtherFlagSimpleTest.php136Drupal\flag\Tests\FlagSimpleTest->doFlagLinksTest()
Link Unflag this item does not exist on http://ec2-54-191-149-30.us-west-2.compute.amazonaws.com/checkout/node/1BrowserFlagSimpleTest.php142Drupal\flag\Tests\FlagSimpleTest->doFlagLinksTest()
Link with label Flag this item found.OtherFlagSimpleTest.php144Drupal\flag\Tests\FlagSimpleTest->doFlagLinksTest()
Link Flag this item does not exist on http://ec2-54-191-149-30.us-west-2.compute.amazonaws.com/checkout/node/2BrowserFlagSimpleTest.php174Drupal\flag\Tests\FlagSimpleTest->doGlobalFlagLinksTest()
Link with label Unflag this item found.OtherFlagSimpleTest.php176Drupal\flag\Tests\FlagSimpleTest->doGlobalFlagLinksTest()
Link with label Flag this item found.OtherFlagSimpleTest.php180Drupal\flag\Tests\FlagSimpleTest->doGlobalFlagLinksTest()
Failed to set field global to 1OtherFlagSimpleTest.php186Drupal\flag\Tests\FlagSimpleTest->doGlobalFlagLinksTest()
Found the Save Flag buttonOtherFlagSimpleTest.php186Drupal\flag\Tests\FlagSimpleTest->doGlobalFlagLinksTest()
Found the requested form fields at admin/structure/flags/manage/test_label_123OtherFlagSimpleTest.php186Drupal\flag\Tests\FlagSimpleTest->doGlobalFlagLinksTest()
Checkbox field edit-global is checked.BrowserFlagSimpleTest.php188Drupal\flag\Tests\FlagSimpleTest->doGlobalFlagLinksTest()
Link with label Unflag this item found.OtherFlagSimpleTest.php192Drupal\flag\Tests\FlagSimpleTest->doGlobalFlagLinksTest()
Failed to set field global to OtherFlagSimpleTest.php198Drupal\flag\Tests\FlagSimpleTest->doGlobalFlagLinksTest()
Found the Save Flag buttonOtherFlagSimpleTest.php198Drupal\flag\Tests\FlagSimpleTest->doGlobalFlagLinksTest()
Found the requested form fields at admin/structure/flags/manage/test_label_123OtherFlagSimpleTest.php198Drupal\flag\Tests\FlagSimpleTest->doGlobalFlagLinksTest()
Checkbox field edit-global is not checked.BrowserFlagSimpleTest.php200Drupal\flag\Tests\FlagSimpleTest->doGlobalFlagLinksTest()
Link with label Flag this item found.OtherFlagSimpleTest.php204Drupal\flag\Tests\FlagSimpleTest->doGlobalFlagLinksTest()
Link with label Flag this item found.OtherFlagSimpleTest.php222Drupal\flag\Tests\FlagSimpleTest->doFlagLinkTeaserTest()
Failed to set field fields[flag_test_label_123][type] to hiddenOtherFlagSimpleTest.php229Drupal\flag\Tests\FlagSimpleTest->doFlagLinkTeaserTest()
Found the requested form fields at admin/structure/types/manage/article/display/teaserOtherFlagSimpleTest.php229Drupal\flag\Tests\FlagSimpleTest->doFlagLinkTeaserTest()
"Your settings have been saved." foundOtherFlagSimpleTest.php232Drupal\flag\Tests\FlagSimpleTest->doFlagLinkTeaserTest()
Link Flag this item does not exist on http://ec2-54-191-149-30.us-west-2.compute.amazonaws.com/checkout/node/4BrowserFlagSimpleTest.php254Drupal\flag\Tests\FlagSimpleTest->doUserDeletionTest()
Link with label Unflag this item found.OtherFlagSimpleTest.php256Drupal\flag\Tests\FlagSimpleTest->doUserDeletionTest()
[07-Sep-2015 19:15:31 Australia/Sydney] Uncaught PHP Exception Symfony\Component\Routing\Exception\RouteNotFoundException: "Route "entity.view.collection" does not exist." at /var/lib/drupaltestbot/sites/default/files/checkout/core/lib/Drupal/Core/Routing/RouteProvider.php line 193 Fatal errorUnknown0Unknown