2102659-44-form-example-simple.patch

Test status
StatusResult
Last receivedSat, 09/05/2015 - 21:09:00
Last requestedSat, 09/05/2015 - 21:09:01
Last testedSat, 09/05/2015 - 21:10:00
Test count1
Environment status
PHP 5.5 MySQLfail
File information
File2102659-44-form-example-simple.patch
BranchExamples for Developers - 8.x-1.x
LinkIssue Link
SummaryFAILED: [[SimpleTest]]: [PHP 5.5 MySQL] 1,062 pass(es), 7 fail(s), and 0 exception(s).
Details

PHP 5.5 MySQL

  1. Setup environment
  2. Detect an invalid patch URL
  3. Detect invalid repository information
  4. Detect invalid patch format
  5. Detect a non-applicable patch
  6. Detect invalid PHP syntax
  7. Detect a Drupal installation failure
  8. Detect a test run failure
  9. Detect a failing test
    Review the test failures below then if necessary run them locally until the problem has been fixed.
  10. Complete test suite with all tests passing
1,062 pass(es), 7 fail(s), and 0 exception(s)

Non-pass

Test namePassFailException
ExpandDrupal\form_example\Tests\SimpleFormTest870
MessageGroupFilenameLineFunctionStatus
The Simple Form Example page is available.BrowserSimpleFormTest.php53Drupal\form_example\Tests\SimpleFormTest->testSimpleFormExample()
Failed to set field title to My Custom TitleOtherSimpleFormTest.php57Drupal\form_example\Tests\SimpleFormTest->testSimpleFormExample()
Found the Submit buttonOtherSimpleFormTest.php57Drupal\form_example\Tests\SimpleFormTest->testSimpleFormExample()
Found the requested form fields at /examples/form_example/simple_formOtherSimpleFormTest.php57Drupal\form_example\Tests\SimpleFormTest->testSimpleFormExample()
"You specified a title of My Custom Title." foundOtherSimpleFormTest.php58Drupal\form_example\Tests\SimpleFormTest->testSimpleFormExample()
[05-Sep-2015 21:09:33 UTC] Uncaught PHP Exception InvalidArgumentException: "Class "\Drupal\form_example\Controller\SimpleForm" does not exist." at /var/lib/drupaltestbot/sites/default/files/checkout/core/lib/Drupal/Core/DependencyInjection/ClassResolver.php line 29 Fatal errorUnknown0Unknown
[05-Sep-2015 21:09:34 UTC] Uncaught PHP Exception InvalidArgumentException: "Class "\Drupal\form_example\Controller\SimpleForm" does not exist." at /var/lib/drupaltestbot/sites/default/files/checkout/core/lib/Drupal/Core/DependencyInjection/ClassResolver.php line 29 Fatal errorUnknown0Unknown

All

Test namePassFailException
LeafDrupal\block_example\Tests\BlockExampleMenuTest800
LeafDrupal\block_example\Tests\BlockExampleTest2700
LeafDrupal\cache_example\Tests\CacheExampleTestCase5900
LeafDrupal\config_entity_example\Tests\ConfigEntityExampleTest7100
LeafDrupal\content_entity_example\Tests\ContentEntityExampleTest22500
LeafDrupal\cron_example\Tests\CronExampleTestCase3500
LeafDrupal\dbtng_example\Tests\DBTNGExampleTest5900
LeafDrupal\email_example\Tests\EmailExampleTest2100
LeafDrupal\examples\Tests\ExamplesTest2000
LeafDrupal\field_example\Tests\FieldExampleMenuTest800
ExpandDrupal\field_example\Tests\Text3WidgetTest11700
MessageGroupFilenameLineFunctionStatus
Saved settings for field <em class="placeholder">pxdoe2xryh</em> with widget <em class="placeholder">field_example_3text</em> and cardinality <em class="placeholder">1</em>DebugFieldExampleWebTestBase.php134Drupal\field_example\FieldExampleWebTestBase->createField()
Saved settings for field <em class="placeholder">u1hqrzjl6o</em> with widget <em class="placeholder">field_example_3text</em> and cardinality <em class="placeholder">-1</em>DebugFieldExampleWebTestBase.php134Drupal\field_example\FieldExampleWebTestBase->createField()
ExpandDrupal\field_example\Tests\TextWidgetTest11700
MessageGroupFilenameLineFunctionStatus
Saved settings for field <em class="placeholder">u7sbcb00ht</em> with widget <em class="placeholder">field_example_text</em> and cardinality <em class="placeholder">1</em>DebugFieldExampleWebTestBase.php134Drupal\field_example\FieldExampleWebTestBase->createField()
Saved settings for field <em class="placeholder">sajpeigorj</em> with widget <em class="placeholder">field_example_text</em> and cardinality <em class="placeholder">-1</em>DebugFieldExampleWebTestBase.php134Drupal\field_example\FieldExampleWebTestBase->createField()
ExpandDrupal\form_example\Tests\SimpleFormTest870
MessageGroupFilenameLineFunctionStatus
The Simple Form Example page is available.BrowserSimpleFormTest.php53Drupal\form_example\Tests\SimpleFormTest->testSimpleFormExample()
Failed to set field title to My Custom TitleOtherSimpleFormTest.php57Drupal\form_example\Tests\SimpleFormTest->testSimpleFormExample()
Found the Submit buttonOtherSimpleFormTest.php57Drupal\form_example\Tests\SimpleFormTest->testSimpleFormExample()
Found the requested form fields at /examples/form_example/simple_formOtherSimpleFormTest.php57Drupal\form_example\Tests\SimpleFormTest->testSimpleFormExample()
"You specified a title of My Custom Title." foundOtherSimpleFormTest.php58Drupal\form_example\Tests\SimpleFormTest->testSimpleFormExample()
[05-Sep-2015 21:09:33 UTC] Uncaught PHP Exception InvalidArgumentException: "Class "\Drupal\form_example\Controller\SimpleForm" does not exist." at /var/lib/drupaltestbot/sites/default/files/checkout/core/lib/Drupal/Core/DependencyInjection/ClassResolver.php line 29 Fatal errorUnknown0Unknown
[05-Sep-2015 21:09:34 UTC] Uncaught PHP Exception InvalidArgumentException: "Class "\Drupal\form_example\Controller\SimpleForm" does not exist." at /var/lib/drupaltestbot/sites/default/files/checkout/core/lib/Drupal/Core/DependencyInjection/ClassResolver.php line 29 Fatal errorUnknown0Unknown
LeafDrupal\js_example\Tests\JsExampleTest1000
LeafDrupal\node_type_example\Tests\NodeTypeExampleTest4300
LeafDrupal\page_example\Tests\PageExampleTest9000
LeafDrupal\phpunit_example\Tests\PHPUnitExampleMenuTest800
LeafDrupal\simpletest_example\Tests\SimpleTestExampleMockModuleTest1200
LeafDrupal\simpletest_example\Tests\SimpleTestExampleTest3500
LeafDrupal\tablesort_example\Tests\TableSortExampleTest2700
LeafDrupal\Tests\phpunit_example\Unit\AddClassTest2700
LeafDrupal\Tests\phpunit_example\Unit\DisplayManagerTest100
LeafDrupal\Tests\phpunit_example\Unit\ProtectedPrivatesTest400
LeafDrupal\tour_example\Tests\TourExampleTest3000