SafeMarkup_set_remove-2563017-5.patch

Test status
StatusResult
Last receivedMon, 09/07/2015 - 07:20:59
Last requestedMon, 09/07/2015 - 07:21:02
Last testedMon, 09/07/2015 - 07:21:27
Test count2
Environment status
PHP 5.5 MySQLfail
File information
FileSafeMarkup_set_remove-2563017-5.patch
BranchDiff - 8.x-1.x
LinkIssue Link
SummaryFAILED: [[SimpleTest]]: [PHP 5.5 MySQL] 0 pass(es), 1 fail(s), and 1 exception(s).
Details

PHP 5.5 MySQL

  1. Setup environment
  2. Detect an invalid patch URL
  3. Detect invalid repository information
  4. Detect invalid patch format
  5. Detect a non-applicable patch
  6. Detect invalid PHP syntax
  7. Detect a Drupal installation failure
  8. Detect a test run failure
  9. Detect a failing test
    Review the test failures below then if necessary run them locally until the problem has been fixed.
  10. Complete test suite with all tests passing
0 pass(es), 1 fail(s), and 1 exception(s)

Non-pass

Test namePassFailException
ExpandDrupal\diff\Tests\DiffRevisionTest011
MessageGroupFilenameLineFunctionStatus
The test did not complete due to a fatal error.Completion checkDiffRevisionTest.php33Drupal\diff\Tests\DiffRevisionTest->testRevisionDiffOverview()
Drupal\Core\Config\Schema\SchemaIncompleteException: Schema errors for diff.plugins with the following errors: diff.plugins:langcode variable type is string but applied schema class is Drupal\Core\Config\Schema\Mapping in Drupal\Core\Config\Testing\ConfigSchemaChecker->onConfigSave() (line 98 of /var/lib/drupaltestbot/sites/default/files/checkout/core/lib/Drupal/Core/Config/Testing/ConfigSchemaChecker.php). Drupal\Core\Config\Testing\ConfigSchemaChecker->onConfigSave(Object, 'config.save', Object) Drupal\Component\EventDispatcher\ContainerAwareEventDispatcher->dispatch('config.save', Object) Drupal\Core\Config\Config->save(1) Drupal\Core\Config\ConfigInstaller->createConfiguration('', Array) Drupal\Core\Config\ConfigInstaller->installDefaultConfig('module', 'diff') Drupal\Core\ProxyClass\Config\ConfigInstaller->installDefaultConfig('module', 'diff') Drupal\Core\Extension\ModuleInstaller->install(Array, 1) Drupal\Core\ProxyClass\Extension\ModuleInstaller->install(Array, 1) Drupal\simpletest\WebTestBase->installModulesFromClassProperty(Object) Drupal\simpletest\WebTestBase->setUp() Drupal\simpletest\TestBase->run(Array) simpletest_script_run_one_test('1', 'Drupal\diff\Tests\DiffRevisionTest') Uncaught exceptionConfigSchemaChecker.php98Drupal\Core\Config\Testing\ConfigSchemaChecker->onConfigSave()

All

Test namePassFailException
ExpandDrupal\diff\Tests\DiffRevisionTest011
MessageGroupFilenameLineFunctionStatus
The test did not complete due to a fatal error.Completion checkDiffRevisionTest.php33Drupal\diff\Tests\DiffRevisionTest->testRevisionDiffOverview()
Drupal\Core\Config\Schema\SchemaIncompleteException: Schema errors for diff.plugins with the following errors: diff.plugins:langcode variable type is string but applied schema class is Drupal\Core\Config\Schema\Mapping in Drupal\Core\Config\Testing\ConfigSchemaChecker->onConfigSave() (line 98 of /var/lib/drupaltestbot/sites/default/files/checkout/core/lib/Drupal/Core/Config/Testing/ConfigSchemaChecker.php). Drupal\Core\Config\Testing\ConfigSchemaChecker->onConfigSave(Object, 'config.save', Object) Drupal\Component\EventDispatcher\ContainerAwareEventDispatcher->dispatch('config.save', Object) Drupal\Core\Config\Config->save(1) Drupal\Core\Config\ConfigInstaller->createConfiguration('', Array) Drupal\Core\Config\ConfigInstaller->installDefaultConfig('module', 'diff') Drupal\Core\ProxyClass\Config\ConfigInstaller->installDefaultConfig('module', 'diff') Drupal\Core\Extension\ModuleInstaller->install(Array, 1) Drupal\Core\ProxyClass\Extension\ModuleInstaller->install(Array, 1) Drupal\simpletest\WebTestBase->installModulesFromClassProperty(Object) Drupal\simpletest\WebTestBase->setUp() Drupal\simpletest\TestBase->run(Array) simpletest_script_run_one_test('1', 'Drupal\diff\Tests\DiffRevisionTest') Uncaught exceptionConfigSchemaChecker.php98Drupal\Core\Config\Testing\ConfigSchemaChecker->onConfigSave()