2511860-1--filter_on_multiple_short_words--tests_only_0.patch

Test status
StatusResult
Last receivedFri, 09/04/2015 - 11:07:59
Last requestedFri, 09/04/2015 - 11:08:01
Last testedFri, 09/04/2015 - 11:08:58
Test count1
Environment status
MySQLfail
File information
File2511860-1--filter_on_multiple_short_words--tests_only_0.patch
BranchSearch API Database Search - 7.x-1.x
LinkIssue Link
SummaryFAILED: [[SimpleTest]]: [MySQL] 131 pass(es), 0 fail(s), and 1 exception(s).
Details

MySQL

  1. Setup environment
  2. Detect an invalid patch URL
  3. Detect invalid repository information
  4. Detect invalid patch format
  5. Detect a non-applicable patch
  6. Detect invalid PHP syntax
  7. Detect a Drupal installation failure
  8. Detect a test run failure
  9. Detect a failing test
    Review the test failures below then if necessary run them locally until the problem has been fixed.
  10. Complete test suite with all tests passing
131 pass(es), 0 fail(s), and 1 exception(s)

Non-pass

Test namePassFailException
ExpandTest "Database search" module (SearchApiDbTest) [Search API Database Search]13101
MessageGroupFilenameLineFunctionStatus
PDOException: SQLSTATE[42S02]: Base table or view not found: 1146 Table 'drupaltestbotmysql.simpletest70888' doesn't exist: SELECT COUNT(*) AS expression FROM (SELECT DISTINCT t.item_id AS item_id, :score AS score, 1 AS expression FROM {search_api_db_test_index} t WHERE ( (t.item_id IN (SELECT t.item_id AS item_id FROM {} t)) )) subquery; Array ( [:score] => 1000 ) in SearchApiDbService->search() (line 1176 of /var/lib/drupaltestbot/sites/default/files/checkout/sites/default/modules/search_api_db/service.inc).Uncaught exceptiondatabase.inc2171PDOStatement->execute()

All

Test namePassFailException
ExpandTest "Database search" module (SearchApiDbTest) [Search API Database Search]13101
MessageGroupFilenameLineFunctionStatus
PDOException: SQLSTATE[42S02]: Base table or view not found: 1146 Table 'drupaltestbotmysql.simpletest70888' doesn't exist: SELECT COUNT(*) AS expression FROM (SELECT DISTINCT t.item_id AS item_id, :score AS score, 1 AS expression FROM {search_api_db_test_index} t WHERE ( (t.item_id IN (SELECT t.item_id AS item_id FROM {} t)) )) subquery; Array ( [:score] => 1000 ) in SearchApiDbService->search() (line 1176 of /var/lib/drupaltestbot/sites/default/files/checkout/sites/default/modules/search_api_db/service.inc).Uncaught exceptiondatabase.inc2171PDOStatement->execute()