remove_set-2563007-2.patch

Test status
StatusResult
Last receivedSat, 09/05/2015 - 17:54:24
Last requestedSat, 09/05/2015 - 17:59:06
Last testedSat, 09/05/2015 - 18:03:06
Test count1
Environment status
PHP 5.5 MySQLfail
File information
Fileremove_set-2563007-2.patch
BranchMonitoring - 8.x-1.x
LinkIssue Link
SummaryFAILED: [[SimpleTest]]: [PHP 5.5 MySQL] 1,961 pass(es), 6 fail(s), and 4 exception(s).
Details

PHP 5.5 MySQL

  1. Setup environment
  2. Detect an invalid patch URL
  3. Detect invalid repository information
  4. Detect invalid patch format
  5. Detect a non-applicable patch
  6. Detect invalid PHP syntax
  7. Detect a Drupal installation failure
  8. Detect a test run failure
  9. Detect a failing test
    Review the test failures below then if necessary run them locally until the problem has been fixed.
  10. Complete test suite with all tests passing
1,961 pass(es), 6 fail(s), and 4 exception(s)

Non-pass

Test namePassFailException
ExpandDrupal\monitoring\Tests\MonitoringCaptchaTest021
MessageGroupFilenameLineFunctionStatus
The test did not complete due to a fatal error.Completion checkMonitoringCaptchaTest.php31Drupal\monitoring\Tests\MonitoringCaptchaTest->testCaptchaSensor()
Unable to install modules captcha, block, monitoring, monitoring_test due to missing modules captcha.OtherMonitoringTestBase.php23Drupal\monitoring\Tests\MonitoringTestBase->setUp()
Drupal\Component\Plugin\Exception\PluginNotFoundException: The "block" entity type does not exist. in Drupal\Core\Entity\EntityManager->getDefinition() (line 276 of /var/lib/drupaltestbot/sites/default/files/checkout/core/lib/Drupal/Core/Entity/EntityManager.php). Drupal\Core\Entity\EntityManager->getDefinition('block') Drupal\Core\Entity\EntityManager->getHandler('block', 'storage') Drupal\Core\Entity\EntityManager->getStorage('block') entity_create('block', Array) Drupal\simpletest\WebTestBase->drupalPlaceBlock('local_tasks_block') Drupal\monitoring\Tests\MonitoringTestBase->setUp() Drupal\monitoring\Tests\MonitoringCaptchaTest->setUp() Drupal\simpletest\TestBase->run(Array) simpletest_script_run_one_test('11', 'Drupal\monitoring\Tests\MonitoringCaptchaTest') Uncaught exceptionEntityManager.php276Drupal\Core\Entity\EntityManager->getDefinition()
ExpandDrupal\monitoring\Tests\MonitoringPastTest011
MessageGroupFilenameLineFunctionStatus
The test did not complete due to a fatal error.Completion checkMonitoringPastTest.php36Drupal\monitoring\Tests\MonitoringPastTest->testPastSensors()
Undefined index: pastDrupal\simpletest\KernelTestBase->enableModules(Array) Drupal\simpletest\KernelTestBase->setUp() Drupal\monitoring\Tests\MonitoringUnitTestBase->setUp() Drupal\monitoring\Tests\MonitoringPastTest->setUp() Drupal\simpletest\TestBase->run(Array) simpletest_script_run_one_test('8', 'Drupal\monitoring\Tests\MonitoringPastTest') NoticeKernelTestBase.php497Drupal\simpletest\KernelTestBase->enableModules()
ExpandDrupal\monitoring\Tests\MonitoringSearchAPITest011
MessageGroupFilenameLineFunctionStatus
The test did not complete due to a fatal error.Completion checkMonitoringSearchAPITest.php59Drupal\monitoring\Tests\MonitoringSearchAPITest->testSensors()
Undefined index: search_apiDrupal\simpletest\KernelTestBase->enableModules(Array) Drupal\simpletest\KernelTestBase->setUp() Drupal\monitoring\Tests\MonitoringUnitTestBase->setUp() Drupal\monitoring\Tests\MonitoringSearchAPITest->setUp() Drupal\simpletest\TestBase->run(Array) simpletest_script_run_one_test('7', 'Drupal\monitoring\Tests\MonitoringSearchAPITest') NoticeKernelTestBase.php497Drupal\simpletest\KernelTestBase->enableModules()
ExpandDrupal\monitoring_demo\Tests\MonitoringDemoTest021
MessageGroupFilenameLineFunctionStatus
The test did not complete due to a fatal error.Completion checkMonitoringDemoTest.php35Drupal\monitoring_demo\Tests\MonitoringDemoTest->testInstalled()
Unable to install modules: module 'monitoring_demo' is missing its dependency module search_api.OtherMonitoringTestBase.php23Drupal\monitoring\Tests\MonitoringTestBase->setUp()
Drupal\Component\Plugin\Exception\PluginNotFoundException: The "block" entity type does not exist. in Drupal\Core\Entity\EntityManager->getDefinition() (line 276 of /var/lib/drupaltestbot/sites/default/files/checkout/core/lib/Drupal/Core/Entity/EntityManager.php). Drupal\Core\Entity\EntityManager->getDefinition('block') Drupal\Core\Entity\EntityManager->getHandler('block', 'storage') Drupal\Core\Entity\EntityManager->getStorage('block') entity_create('block', Array) Drupal\simpletest\WebTestBase->drupalPlaceBlock('local_tasks_block') Drupal\monitoring\Tests\MonitoringTestBase->setUp() Drupal\monitoring_demo\Tests\MonitoringDemoTest->setUp() Drupal\simpletest\TestBase->run(Array) simpletest_script_run_one_test('1', 'Drupal\monitoring_demo\Tests\MonitoringDemoTest') Uncaught exceptionEntityManager.php276Drupal\Core\Entity\EntityManager->getDefinition()

All

Test namePassFailException
LeafDrupal\monitoring\Tests\MonitoringApiTest8100
ExpandDrupal\monitoring\Tests\MonitoringCaptchaTest021
MessageGroupFilenameLineFunctionStatus
The test did not complete due to a fatal error.Completion checkMonitoringCaptchaTest.php31Drupal\monitoring\Tests\MonitoringCaptchaTest->testCaptchaSensor()
Unable to install modules captcha, block, monitoring, monitoring_test due to missing modules captcha.OtherMonitoringTestBase.php23Drupal\monitoring\Tests\MonitoringTestBase->setUp()
Drupal\Component\Plugin\Exception\PluginNotFoundException: The "block" entity type does not exist. in Drupal\Core\Entity\EntityManager->getDefinition() (line 276 of /var/lib/drupaltestbot/sites/default/files/checkout/core/lib/Drupal/Core/Entity/EntityManager.php). Drupal\Core\Entity\EntityManager->getDefinition('block') Drupal\Core\Entity\EntityManager->getHandler('block', 'storage') Drupal\Core\Entity\EntityManager->getStorage('block') entity_create('block', Array) Drupal\simpletest\WebTestBase->drupalPlaceBlock('local_tasks_block') Drupal\monitoring\Tests\MonitoringTestBase->setUp() Drupal\monitoring\Tests\MonitoringCaptchaTest->setUp() Drupal\simpletest\TestBase->run(Array) simpletest_script_run_one_test('11', 'Drupal\monitoring\Tests\MonitoringCaptchaTest') Uncaught exceptionEntityManager.php276Drupal\Core\Entity\EntityManager->getDefinition()
LeafDrupal\monitoring\Tests\MonitoringCoreKernelTest16100
LeafDrupal\monitoring\Tests\MonitoringCoreWebTest18500
ExpandDrupal\monitoring\Tests\MonitoringPastTest011
MessageGroupFilenameLineFunctionStatus
The test did not complete due to a fatal error.Completion checkMonitoringPastTest.php36Drupal\monitoring\Tests\MonitoringPastTest->testPastSensors()
Undefined index: pastDrupal\simpletest\KernelTestBase->enableModules(Array) Drupal\simpletest\KernelTestBase->setUp() Drupal\monitoring\Tests\MonitoringUnitTestBase->setUp() Drupal\monitoring\Tests\MonitoringPastTest->setUp() Drupal\simpletest\TestBase->run(Array) simpletest_script_run_one_test('8', 'Drupal\monitoring\Tests\MonitoringPastTest') NoticeKernelTestBase.php497Drupal\simpletest\KernelTestBase->enableModules()
ExpandDrupal\monitoring\Tests\MonitoringSearchAPITest011
MessageGroupFilenameLineFunctionStatus
The test did not complete due to a fatal error.Completion checkMonitoringSearchAPITest.php59Drupal\monitoring\Tests\MonitoringSearchAPITest->testSensors()
Undefined index: search_apiDrupal\simpletest\KernelTestBase->enableModules(Array) Drupal\simpletest\KernelTestBase->setUp() Drupal\monitoring\Tests\MonitoringUnitTestBase->setUp() Drupal\monitoring\Tests\MonitoringSearchAPITest->setUp() Drupal\simpletest\TestBase->run(Array) simpletest_script_run_one_test('7', 'Drupal\monitoring\Tests\MonitoringSearchAPITest') NoticeKernelTestBase.php497Drupal\simpletest\KernelTestBase->enableModules()
LeafDrupal\monitoring\Tests\MonitoringServicesTest58500
LeafDrupal\monitoring\Tests\MonitoringUITest83000
LeafDrupal\monitoring\Tests\MonitoringViewDisplayTest2900
ExpandDrupal\monitoring_demo\Tests\MonitoringDemoTest021
MessageGroupFilenameLineFunctionStatus
The test did not complete due to a fatal error.Completion checkMonitoringDemoTest.php35Drupal\monitoring_demo\Tests\MonitoringDemoTest->testInstalled()
Unable to install modules: module 'monitoring_demo' is missing its dependency module search_api.OtherMonitoringTestBase.php23Drupal\monitoring\Tests\MonitoringTestBase->setUp()
Drupal\Component\Plugin\Exception\PluginNotFoundException: The "block" entity type does not exist. in Drupal\Core\Entity\EntityManager->getDefinition() (line 276 of /var/lib/drupaltestbot/sites/default/files/checkout/core/lib/Drupal/Core/Entity/EntityManager.php). Drupal\Core\Entity\EntityManager->getDefinition('block') Drupal\Core\Entity\EntityManager->getHandler('block', 'storage') Drupal\Core\Entity\EntityManager->getStorage('block') entity_create('block', Array) Drupal\simpletest\WebTestBase->drupalPlaceBlock('local_tasks_block') Drupal\monitoring\Tests\MonitoringTestBase->setUp() Drupal\monitoring_demo\Tests\MonitoringDemoTest->setUp() Drupal\simpletest\TestBase->run(Array) simpletest_script_run_one_test('1', 'Drupal\monitoring_demo\Tests\MonitoringDemoTest') Uncaught exceptionEntityManager.php276Drupal\Core\Entity\EntityManager->getDefinition()
LeafDrupal\monitoring_multigraph\Tests\MultigraphServicesTest2600
LeafDrupal\monitoring_multigraph\Tests\MultigraphWebTest6400