search-api-remove-safe-markup-check-plain-2562689-3.patch

Test status
StatusResult
Last receivedFri, 09/04/2015 - 06:37:00
Last requestedFri, 09/04/2015 - 06:37:02
Last testedFri, 09/04/2015 - 06:37:53
Test count1
Environment status
PHP 5.5 MySQLfail
File information
Filesearch-api-remove-safe-markup-check-plain-2562689-3.patch
BranchSearch API - 8.x-1.x
LinkIssue Link
SummaryFAILED: [[SimpleTest]]: [PHP 5.5 MySQL] 844 pass(es), 23 fail(s), and 7 exception(s).
Details

PHP 5.5 MySQL

  1. Setup environment
  2. Detect an invalid patch URL
  3. Detect invalid repository information
  4. Detect invalid patch format
  5. Detect a non-applicable patch
  6. Detect invalid PHP syntax
  7. Detect a Drupal installation failure
  8. Detect a test run failure
  9. Detect a failing test
    Review the test failures below then if necessary run them locally until the problem has been fixed.
  10. Complete test suite with all tests passing
844 pass(es), 23 fail(s), and 7 exception(s)

Non-pass

Test namePassFailException
ExpandDrupal\search_api\Tests\IntegrationTest53126
MessageGroupFilenameLineFunctionStatus
Server add page existsBrowserIntegrationTest.php83Drupal\search_api\Tests\IntegrationTest->createServer()
simplexml_import_dom(): Invalid Nodetype to importsimplexml_import_dom(Object) Drupal\simpletest\WebTestBase->parse() Drupal\simpletest\WebTestBase->drupalPostForm('http://ec2-54-191-149-30.us-west-2.compute.amazonaws.com/checkout/admin/config/search/search-api/add-server', Array, 'Save') Drupal\search_api\Tests\IntegrationTest->createServer() Drupal\search_api\Tests\IntegrationTest->testFramework() Drupal\simpletest\TestBase->run(Array) simpletest_script_run_one_test('12', 'Drupal\search_api\Tests\IntegrationTest') WarningAssertContentTrait.php138Drupal\simpletest\WebTestBase->parse()
"Server name field is required." foundOtherIntegrationTest.php93Drupal\search_api\Tests\IntegrationTest->createServer()
simplexml_import_dom(): Invalid Nodetype to importsimplexml_import_dom(Object) Drupal\simpletest\WebTestBase->parse() Drupal\simpletest\WebTestBase->drupalPostForm('http://ec2-54-191-149-30.us-west-2.compute.amazonaws.com/checkout/admin/config/search/search-api/add-server', Array, 'Save') Drupal\search_api\Tests\IntegrationTest->createServer() Drupal\search_api\Tests\IntegrationTest->testFramework() Drupal\simpletest\TestBase->run(Array) simpletest_script_run_one_test('12', 'Drupal\search_api\Tests\IntegrationTest') WarningAssertContentTrait.php138Drupal\simpletest\WebTestBase->parse()
"Machine-readable name field is required." foundOtherIntegrationTest.php102Drupal\search_api\Tests\IntegrationTest->createServer()
simplexml_import_dom(): Invalid Nodetype to importsimplexml_import_dom(Object) Drupal\simpletest\WebTestBase->parse() Drupal\simpletest\WebTestBase->drupalPostForm(NULL, Array, 'Save') Drupal\search_api\Tests\IntegrationTest->createServer() Drupal\search_api\Tests\IntegrationTest->testFramework() Drupal\simpletest\TestBase->run(Array) simpletest_script_run_one_test('12', 'Drupal\search_api\Tests\IntegrationTest') WarningAssertContentTrait.php138Drupal\simpletest\WebTestBase->parse()
"The server was successfully saved." foundOtherIntegrationTest.php114Drupal\search_api\Tests\IntegrationTest->createServer()
Correct redirect to server page.OtherIntegrationTest.php115Drupal\search_api\Tests\IntegrationTest->createServer()
HTTP response expected 200, actual 500BrowserIntegrationTest.php125Drupal\search_api\Tests\IntegrationTest->createIndex()
simplexml_import_dom(): Invalid Nodetype to importsimplexml_import_dom(Object) Drupal\simpletest\WebTestBase->parse() Drupal\simpletest\WebTestBase->drupalPostForm(NULL, Array, 'Save') Drupal\search_api\Tests\IntegrationTest->createIndex() Drupal\search_api\Tests\IntegrationTest->testFramework() Drupal\simpletest\TestBase->run(Array) simpletest_script_run_one_test('12', 'Drupal\search_api\Tests\IntegrationTest') WarningAssertContentTrait.php138Drupal\simpletest\WebTestBase->parse()
"Index name field is required." foundOtherIntegrationTest.php132Drupal\search_api\Tests\IntegrationTest->createIndex()
"Machine-readable name field is required." foundOtherIntegrationTest.php133Drupal\search_api\Tests\IntegrationTest->createIndex()
"Data sources field is required." foundOtherIntegrationTest.php134Drupal\search_api\Tests\IntegrationTest->createIndex()
simplexml_import_dom(): Invalid Nodetype to importsimplexml_import_dom(Object) Drupal\simpletest\WebTestBase->parse() Drupal\simpletest\WebTestBase->drupalPostForm(NULL, Array, 'Save') Drupal\search_api\Tests\IntegrationTest->createIndex() Drupal\search_api\Tests\IntegrationTest->testFramework() Drupal\simpletest\TestBase->run(Array) simpletest_script_run_one_test('12', 'Drupal\search_api\Tests\IntegrationTest') WarningAssertContentTrait.php138Drupal\simpletest\WebTestBase->parse()
"The index was successfully saved." foundOtherIntegrationTest.php149Drupal\search_api\Tests\IntegrationTest->createIndex()
Correct redirect to index page.OtherIntegrationTest.php150Drupal\search_api\Tests\IntegrationTest->createIndex()
Index was correctly created.OtherIntegrationTest.php155Drupal\search_api\Tests\IntegrationTest->createIndex()
Drupal\search_api\SearchApiException: in Drupal\search_api\Tests\IntegrationTest->createIndex() (line 165 of /var/lib/drupaltestbot/sites/default/files/checkout/sites/default/modules/search_api/src/Tests/IntegrationTest.php). Drupal\search_api\Tests\IntegrationTest->createIndex() Drupal\search_api\Tests\IntegrationTest->testFramework() Drupal\simpletest\TestBase->run(Array) simpletest_script_run_one_test('12', 'Drupal\search_api\Tests\IntegrationTest') Uncaught exceptionIntegrationTest.php165Drupal\search_api\Tests\IntegrationTest->createIndex()
ExpandDrupal\search_api\Tests\OverviewPageTest11371
MessageGroupFilenameLineFunctionStatus
simplexml_import_dom(): Invalid Nodetype to importsimplexml_import_dom(Object) Drupal\simpletest\WebTestBase->parse() Drupal\simpletest\WebTestBase->drupalPostForm('admin/config/search/search-api/add-index', Array, 'Save') Drupal\search_api\Tests\OverviewPageTest->testServerAndIndexCreation() Drupal\simpletest\TestBase->run(Array) simpletest_script_run_one_test('9', 'Drupal\search_api\Tests\OverviewPageTest') WarningAssertContentTrait.php138Drupal\simpletest\WebTestBase->parse()
"The index was successfully saved." foundOtherOverviewPageTest.php69Drupal\search_api\Tests\OverviewPageTest->testServerAndIndexCreation()
"jYANkOMz" foundOtherOverviewPageTest.php70Drupal\search_api\Tests\OverviewPageTest->testServerAndIndexCreation()
Class 'Drupal\search_api\Tracker\Html' not foundPHP Fatal errorTrackerPluginManager.php53Unknown
Class 'Html' not foundPHP Fatal errorsearch_api.theme.inc91Unknown
Class 'Html' not foundPHP Fatal errorsearch_api.theme.inc208Unknown
Class 'Html' not foundPHP Fatal errorsearch_api.theme.inc208Unknown
Class 'Html' not foundPHP Fatal errorsearch_api.theme.inc208Unknown
ExpandDrupal\search_api_db_defaults\Tests\IntegrationTest1440
MessageGroupFilenameLineFunctionStatus
Anonymous user can access the search page.BrowserIntegrationTest.php184Drupal\search_api_db_defaults\Tests\IntegrationTest->testDefaultSetupWorking()
Authenticated user can access the search page.BrowserIntegrationTest.php187Drupal\search_api_db_defaults\Tests\IntegrationTest->testDefaultSetupWorking()
Class 'Drupal\search_api\Plugin\views\query\Html' not foundPHP Fatal errorSearchApiQuery.php315Unknown
Class 'Drupal\search_api\Plugin\views\query\Html' not foundPHP Fatal errorSearchApiQuery.php315Unknown

All

Test namePassFailException
LeafDrupal\search_api\Tests\CustomDataTypesUnitTest1800
LeafDrupal\search_api\Tests\IndexStorageUnitTest500
ExpandDrupal\search_api\Tests\IntegrationTest53126
MessageGroupFilenameLineFunctionStatus
Server add page existsBrowserIntegrationTest.php83Drupal\search_api\Tests\IntegrationTest->createServer()
simplexml_import_dom(): Invalid Nodetype to importsimplexml_import_dom(Object) Drupal\simpletest\WebTestBase->parse() Drupal\simpletest\WebTestBase->drupalPostForm('http://ec2-54-191-149-30.us-west-2.compute.amazonaws.com/checkout/admin/config/search/search-api/add-server', Array, 'Save') Drupal\search_api\Tests\IntegrationTest->createServer() Drupal\search_api\Tests\IntegrationTest->testFramework() Drupal\simpletest\TestBase->run(Array) simpletest_script_run_one_test('12', 'Drupal\search_api\Tests\IntegrationTest') WarningAssertContentTrait.php138Drupal\simpletest\WebTestBase->parse()
"Server name field is required." foundOtherIntegrationTest.php93Drupal\search_api\Tests\IntegrationTest->createServer()
simplexml_import_dom(): Invalid Nodetype to importsimplexml_import_dom(Object) Drupal\simpletest\WebTestBase->parse() Drupal\simpletest\WebTestBase->drupalPostForm('http://ec2-54-191-149-30.us-west-2.compute.amazonaws.com/checkout/admin/config/search/search-api/add-server', Array, 'Save') Drupal\search_api\Tests\IntegrationTest->createServer() Drupal\search_api\Tests\IntegrationTest->testFramework() Drupal\simpletest\TestBase->run(Array) simpletest_script_run_one_test('12', 'Drupal\search_api\Tests\IntegrationTest') WarningAssertContentTrait.php138Drupal\simpletest\WebTestBase->parse()
"Machine-readable name field is required." foundOtherIntegrationTest.php102Drupal\search_api\Tests\IntegrationTest->createServer()
simplexml_import_dom(): Invalid Nodetype to importsimplexml_import_dom(Object) Drupal\simpletest\WebTestBase->parse() Drupal\simpletest\WebTestBase->drupalPostForm(NULL, Array, 'Save') Drupal\search_api\Tests\IntegrationTest->createServer() Drupal\search_api\Tests\IntegrationTest->testFramework() Drupal\simpletest\TestBase->run(Array) simpletest_script_run_one_test('12', 'Drupal\search_api\Tests\IntegrationTest') WarningAssertContentTrait.php138Drupal\simpletest\WebTestBase->parse()
"The server was successfully saved." foundOtherIntegrationTest.php114Drupal\search_api\Tests\IntegrationTest->createServer()
Correct redirect to server page.OtherIntegrationTest.php115Drupal\search_api\Tests\IntegrationTest->createServer()
HTTP response expected 200, actual 500BrowserIntegrationTest.php125Drupal\search_api\Tests\IntegrationTest->createIndex()
simplexml_import_dom(): Invalid Nodetype to importsimplexml_import_dom(Object) Drupal\simpletest\WebTestBase->parse() Drupal\simpletest\WebTestBase->drupalPostForm(NULL, Array, 'Save') Drupal\search_api\Tests\IntegrationTest->createIndex() Drupal\search_api\Tests\IntegrationTest->testFramework() Drupal\simpletest\TestBase->run(Array) simpletest_script_run_one_test('12', 'Drupal\search_api\Tests\IntegrationTest') WarningAssertContentTrait.php138Drupal\simpletest\WebTestBase->parse()
"Index name field is required." foundOtherIntegrationTest.php132Drupal\search_api\Tests\IntegrationTest->createIndex()
"Machine-readable name field is required." foundOtherIntegrationTest.php133Drupal\search_api\Tests\IntegrationTest->createIndex()
"Data sources field is required." foundOtherIntegrationTest.php134Drupal\search_api\Tests\IntegrationTest->createIndex()
simplexml_import_dom(): Invalid Nodetype to importsimplexml_import_dom(Object) Drupal\simpletest\WebTestBase->parse() Drupal\simpletest\WebTestBase->drupalPostForm(NULL, Array, 'Save') Drupal\search_api\Tests\IntegrationTest->createIndex() Drupal\search_api\Tests\IntegrationTest->testFramework() Drupal\simpletest\TestBase->run(Array) simpletest_script_run_one_test('12', 'Drupal\search_api\Tests\IntegrationTest') WarningAssertContentTrait.php138Drupal\simpletest\WebTestBase->parse()
"The index was successfully saved." foundOtherIntegrationTest.php149Drupal\search_api\Tests\IntegrationTest->createIndex()
Correct redirect to index page.OtherIntegrationTest.php150Drupal\search_api\Tests\IntegrationTest->createIndex()
Index was correctly created.OtherIntegrationTest.php155Drupal\search_api\Tests\IntegrationTest->createIndex()
Drupal\search_api\SearchApiException: in Drupal\search_api\Tests\IntegrationTest->createIndex() (line 165 of /var/lib/drupaltestbot/sites/default/files/checkout/sites/default/modules/search_api/src/Tests/IntegrationTest.php). Drupal\search_api\Tests\IntegrationTest->createIndex() Drupal\search_api\Tests\IntegrationTest->testFramework() Drupal\simpletest\TestBase->run(Array) simpletest_script_run_one_test('12', 'Drupal\search_api\Tests\IntegrationTest') Uncaught exceptionIntegrationTest.php165Drupal\search_api\Tests\IntegrationTest->createIndex()
LeafDrupal\search_api\Tests\LanguageIntegrationUnitTest3500
LeafDrupal\search_api\Tests\LocalActionsWebTest1500
ExpandDrupal\search_api\Tests\OverviewPageTest11371
MessageGroupFilenameLineFunctionStatus
simplexml_import_dom(): Invalid Nodetype to importsimplexml_import_dom(Object) Drupal\simpletest\WebTestBase->parse() Drupal\simpletest\WebTestBase->drupalPostForm('admin/config/search/search-api/add-index', Array, 'Save') Drupal\search_api\Tests\OverviewPageTest->testServerAndIndexCreation() Drupal\simpletest\TestBase->run(Array) simpletest_script_run_one_test('9', 'Drupal\search_api\Tests\OverviewPageTest') WarningAssertContentTrait.php138Drupal\simpletest\WebTestBase->parse()
"The index was successfully saved." foundOtherOverviewPageTest.php69Drupal\search_api\Tests\OverviewPageTest->testServerAndIndexCreation()
"jYANkOMz" foundOtherOverviewPageTest.php70Drupal\search_api\Tests\OverviewPageTest->testServerAndIndexCreation()
Class 'Drupal\search_api\Tracker\Html' not foundPHP Fatal errorTrackerPluginManager.php53Unknown
Class 'Html' not foundPHP Fatal errorsearch_api.theme.inc91Unknown
Class 'Html' not foundPHP Fatal errorsearch_api.theme.inc208Unknown
Class 'Html' not foundPHP Fatal errorsearch_api.theme.inc208Unknown
Class 'Html' not foundPHP Fatal errorsearch_api.theme.inc208Unknown
LeafDrupal\search_api\Tests\Processor\ContentAccessTest7200
LeafDrupal\search_api\Tests\Processor\ProcessorIntegrationTest7300
LeafDrupal\search_api\Tests\Processor\RenderedItemTest4200
LeafDrupal\search_api\Tests\ServerStorageUnitTest600
LeafDrupal\search_api\Tests\ServerTaskUnitTest5900
LeafDrupal\search_api\Tests\ViewsTest2800
LeafDrupal\search_api_db\Tests\BackendTest16600
ExpandDrupal\search_api_db_defaults\Tests\IntegrationTest1440
MessageGroupFilenameLineFunctionStatus
Anonymous user can access the search page.BrowserIntegrationTest.php184Drupal\search_api_db_defaults\Tests\IntegrationTest->testDefaultSetupWorking()
Authenticated user can access the search page.BrowserIntegrationTest.php187Drupal\search_api_db_defaults\Tests\IntegrationTest->testDefaultSetupWorking()
Class 'Drupal\search_api\Plugin\views\query\Html' not foundPHP Fatal errorSearchApiQuery.php315Unknown
Class 'Drupal\search_api\Plugin\views\query\Html' not foundPHP Fatal errorSearchApiQuery.php315Unknown
LeafDrupal\Tests\search_api\Unit\Plugin\Processor\AddURLTest200
LeafDrupal\Tests\search_api\Unit\Plugin\Processor\AggregatedFieldTest900
LeafDrupal\Tests\search_api\Unit\Plugin\Processor\FieldsProcessorPluginBaseTest1300
LeafDrupal\Tests\search_api\Unit\Plugin\Processor\HighlightTest1300
LeafDrupal\Tests\search_api\Unit\Plugin\Processor\HtmlFilterTest2500
LeafDrupal\Tests\search_api\Unit\Plugin\Processor\IgnoreCaseTest400
LeafDrupal\Tests\search_api\Unit\Plugin\Processor\IgnoreCharacterTest3900
LeafDrupal\Tests\search_api\Unit\Plugin\Processor\LanguageTest200
LeafDrupal\Tests\search_api\Unit\Plugin\Processor\NodeStatusTest300
LeafDrupal\Tests\search_api\Unit\Plugin\Processor\RoleFilterTest200
LeafDrupal\Tests\search_api\Unit\Plugin\Processor\StopwordsTest800
LeafDrupal\Tests\search_api\Unit\Plugin\Processor\TokenizerTest2200
LeafDrupal\Tests\search_api\Unit\Plugin\Processor\TransliterationTest300