provide_views-2548395-30.patch

Test status
StatusResult
Last receivedThu, 09/03/2015 - 21:38:00
Last requestedThu, 09/03/2015 - 21:45:25
Last testedThu, 09/03/2015 - 21:46:25
Test count1
Environment status
PHP 5.5 MySQLfail
File information
Fileprovide_views-2548395-30.patch
BranchDynamic Entity Reference - 8.x-1.x
LinkIssue Link
SummaryFAILED: [[SimpleTest]]: [PHP 5.5 MySQL] 600 pass(es), 2 fail(s), and 1 exception(s).
Details

PHP 5.5 MySQL

  1. Setup environment
  2. Detect an invalid patch URL
  3. Detect invalid repository information
  4. Detect invalid patch format
  5. Detect a non-applicable patch
  6. Detect invalid PHP syntax
  7. Detect a Drupal installation failure
  8. Detect a test run failure
  9. Detect a failing test
    Review the test failures below then if necessary run them locally until the problem has been fixed.
  10. Complete test suite with all tests passing
600 pass(es), 2 fail(s), and 1 exception(s)

Non-pass

Test namePassFailException
ExpandDrupal\dynamic_entity_reference\Tests\Views\DynamicEntityReferenceBaseFieldRelationshipTest7821
MessageGroupFilenameLineFunctionStatus
Value 1 is equal to value -1.OtherDynamicEntityReferenceBaseFieldRelationshipTest.php218Drupal\dynamic_entity_reference\Tests\Views\DynamicEntityReferenceBaseFieldRelationshipTest->testMultiBaseFieldRelationship()
Value 1 is equal to value -1.OtherDynamicEntityReferenceBaseFieldRelationshipTest.php219Drupal\dynamic_entity_reference\Tests\Views\DynamicEntityReferenceBaseFieldRelationshipTest->testMultiBaseFieldRelationship()
Drupal\Core\Entity\EntityStorageException: SQLSTATE[42S22]: Column not found: 1054 Unknown column 'dynamic_references__target_id' in 'field list': INSERT INTO {entity_test} (type, uuid, langcode, name, created, user_id, dynamic_references__target_id, dynamic_references__target_type) VALUES (:db_insert_placeholder_0, :db_insert_placeholder_1, :db_insert_placeholder_2, :db_insert_placeholder_3, :db_insert_placeholder_4, :db_insert_placeholder_5, :db_insert_placeholder_6, :db_insert_placeholder_7); Array ( [:db_insert_placeholder_0] => entity_test [:db_insert_placeholder_1] => ad48a370-262e-4586-a500-0b8e094a1908 [:db_insert_placeholder_2] => en [:db_insert_placeholder_3] => [:db_insert_placeholder_4] => 1441316742 [:db_insert_placeholder_5] => 1 [:db_insert_placeholder_6] => [:db_insert_placeholder_7] => ) in Drupal\Core\Entity\Sql\SqlContentEntityStorage->save() (line 757 of /var/lib/drupaltestbot/sites/default/files/checkout/core/lib/Drupal/Core/Entity/Sql/SqlContentEntityStorage.php). Drupal\Core\Entity\Sql\SqlContentEntityStorage->save(Object) Drupal\Core\Entity\Entity->save() Drupal\dynamic_entity_reference\Tests\Views\DynamicEntityReferenceBaseFieldRelationshipTest->testMultiBaseFieldRelationship() Drupal\simpletest\TestBase->run(Array) simpletest_script_run_one_test('2', 'Drupal\dynamic_entity_reference\Tests\Views\DynamicEntityReferenceBaseFieldRelationshipTest') Uncaught exceptionSqlContentEntityStorage.php757Drupal\Core\Entity\Sql\SqlContentEntityStorage->save()

All

Test namePassFailException
LeafDrupal\dynamic_entity_reference\Tests\DynamicEntityReferenceFieldDefaultValueTest2600
LeafDrupal\dynamic_entity_reference\Tests\DynamicEntityReferenceFieldTest2900
LeafDrupal\dynamic_entity_reference\Tests\DynamicEntityReferenceFormatterTest4500
LeafDrupal\dynamic_entity_reference\Tests\DynamicEntityReferenceItemTest6100
LeafDrupal\dynamic_entity_reference\Tests\DynamicEntityReferenceSchemaTest1100
LeafDrupal\dynamic_entity_reference\Tests\DynamicEntityReferenceTest15600
LeafDrupal\dynamic_entity_reference\Tests\DynamicEntityReferenceWidgetTest5400
ExpandDrupal\dynamic_entity_reference\Tests\Views\DynamicEntityReferenceBaseFieldRelationshipTest7821
MessageGroupFilenameLineFunctionStatus
Value 1 is equal to value -1.OtherDynamicEntityReferenceBaseFieldRelationshipTest.php218Drupal\dynamic_entity_reference\Tests\Views\DynamicEntityReferenceBaseFieldRelationshipTest->testMultiBaseFieldRelationship()
Value 1 is equal to value -1.OtherDynamicEntityReferenceBaseFieldRelationshipTest.php219Drupal\dynamic_entity_reference\Tests\Views\DynamicEntityReferenceBaseFieldRelationshipTest->testMultiBaseFieldRelationship()
Drupal\Core\Entity\EntityStorageException: SQLSTATE[42S22]: Column not found: 1054 Unknown column 'dynamic_references__target_id' in 'field list': INSERT INTO {entity_test} (type, uuid, langcode, name, created, user_id, dynamic_references__target_id, dynamic_references__target_type) VALUES (:db_insert_placeholder_0, :db_insert_placeholder_1, :db_insert_placeholder_2, :db_insert_placeholder_3, :db_insert_placeholder_4, :db_insert_placeholder_5, :db_insert_placeholder_6, :db_insert_placeholder_7); Array ( [:db_insert_placeholder_0] => entity_test [:db_insert_placeholder_1] => ad48a370-262e-4586-a500-0b8e094a1908 [:db_insert_placeholder_2] => en [:db_insert_placeholder_3] => [:db_insert_placeholder_4] => 1441316742 [:db_insert_placeholder_5] => 1 [:db_insert_placeholder_6] => [:db_insert_placeholder_7] => ) in Drupal\Core\Entity\Sql\SqlContentEntityStorage->save() (line 757 of /var/lib/drupaltestbot/sites/default/files/checkout/core/lib/Drupal/Core/Entity/Sql/SqlContentEntityStorage.php). Drupal\Core\Entity\Sql\SqlContentEntityStorage->save(Object) Drupal\Core\Entity\Entity->save() Drupal\dynamic_entity_reference\Tests\Views\DynamicEntityReferenceBaseFieldRelationshipTest->testMultiBaseFieldRelationship() Drupal\simpletest\TestBase->run(Array) simpletest_script_run_one_test('2', 'Drupal\dynamic_entity_reference\Tests\Views\DynamicEntityReferenceBaseFieldRelationshipTest') Uncaught exceptionSqlContentEntityStorage.php757Drupal\Core\Entity\Sql\SqlContentEntityStorage->save()
LeafDrupal\dynamic_entity_reference\Tests\Views\DynamicEntityReferenceRelationshipTest14000