Redirect_tmgmt_fix-2557263-13.patch

Test status
StatusResult
Last receivedWed, 09/02/2015 - 11:58:00
Last requestedWed, 09/02/2015 - 12:27:25
Last testedWed, 09/02/2015 - 12:31:04
Test count1
Environment status
PHP 5.5 MySQLfail
File information
FileRedirect_tmgmt_fix-2557263-13.patch
BranchTranslation Management Tool - 8.x-1.x
LinkIssue Link
SummaryFAILED: [[SimpleTest]]: [PHP 5.5 MySQL] 2,495 pass(es), 93 fail(s), and 3 exception(s).
Details

PHP 5.5 MySQL

  1. Setup environment
  2. Detect an invalid patch URL
  3. Detect invalid repository information
  4. Detect invalid patch format
  5. Detect a non-applicable patch
  6. Detect invalid PHP syntax
  7. Detect a Drupal installation failure
  8. Detect a test run failure
  9. Detect a failing test
    Review the test failures below then if necessary run them locally until the problem has been fixed.
  10. Complete test suite with all tests passing
2,495 pass(es), 93 fail(s), and 3 exception(s)

Non-pass

Test namePassFailException
ExpandDrupal\tmgmt\Tests\LocalTasksTests15100
MessageGroupFilenameLineFunctionStatus
Link Cart does not exist on http://ec2-54-191-110-230.us-west-2.compute.amazonaws.com/checkout/admin/tmgmt/jobsBrowserLocalTasksTests.php59Drupal\tmgmt\Tests\LocalTasksTests->testTranslatorLocalTaks()
Link Jobs does not exist on http://ec2-54-191-110-230.us-west-2.compute.amazonaws.com/checkout/admin/tmgmt/jobsBrowserLocalTasksTests.php60Drupal\tmgmt\Tests\LocalTasksTests->testTranslatorLocalTaks()
Link Sources does not exist on http://ec2-54-191-110-230.us-west-2.compute.amazonaws.com/checkout/admin/tmgmt/jobsBrowserLocalTasksTests.php61Drupal\tmgmt\Tests\LocalTasksTests->testTranslatorLocalTaks()
Option content:node for field edit-source is selected.BrowserLocalTasksTests.php64Drupal\tmgmt\Tests\LocalTasksTests->testTranslatorLocalTaks()
Option content:node for field edit-source exists.BrowserLocalTasksTests.php65Drupal\tmgmt\Tests\LocalTasksTests->testTranslatorLocalTaks()
Option content:user for field edit-source exists.BrowserLocalTasksTests.php66Drupal\tmgmt\Tests\LocalTasksTests->testTranslatorLocalTaks()
Option config:block for field edit-source exists.BrowserLocalTasksTests.php67Drupal\tmgmt\Tests\LocalTasksTests->testTranslatorLocalTaks()
Option config:node_type for field edit-source exists.BrowserLocalTasksTests.php68Drupal\tmgmt\Tests\LocalTasksTests->testTranslatorLocalTaks()
Option config:tmgmt_translator for field edit-source exists.BrowserLocalTasksTests.php69Drupal\tmgmt\Tests\LocalTasksTests->testTranslatorLocalTaks()
Option config:base_field_override for field edit-source does not exist.BrowserLocalTasksTests.php70Drupal\tmgmt\Tests\LocalTasksTests->testTranslatorLocalTaks()
ExpandDrupal\tmgmt\Tests\TMGMTUiTest66940
MessageGroupFilenameLineFunctionStatus
Link Cart does not exist on http://ec2-54-191-110-230.us-west-2.compute.amazonaws.com/checkout/admin/tmgmt/jobsBrowserTMGMTUiTest.php859Drupal\tmgmt\Tests\TMGMTUiTest->testPageTitles()
Link Jobs does not exist on http://ec2-54-191-110-230.us-west-2.compute.amazonaws.com/checkout/admin/tmgmt/jobsBrowserTMGMTUiTest.php860Drupal\tmgmt\Tests\TMGMTUiTest->testPageTitles()
Link Sources does not exist on http://ec2-54-191-110-230.us-west-2.compute.amazonaws.com/checkout/admin/tmgmt/jobsBrowserTMGMTUiTest.php861Drupal\tmgmt\Tests\TMGMTUiTest->testPageTitles()
Page title 'Job overview | Drupal' is equal to 'Translation Sources | Drupal'.OtherTMGMTUiTest.php862Drupal\tmgmt\Tests\TMGMTUiTest->testPageTitles()
ExpandDrupal\tmgmt\Tests\TranslatorTest8410
MessageGroupFilenameLineFunctionStatus
"Add translator" foundOtherTranslatorTest.php67Drupal\tmgmt\Tests\TranslatorTest->testTranslatorHandling()
ExpandDrupal\tmgmt_config\Tests\ConfigSourceListTest24312
MessageGroupFilenameLineFunctionStatus
Undefined offset: 0Drupal\tmgmt_config\Tests\ConfigSourceListTest->testViewTranslation() Drupal\simpletest\TestBase->run(Array) simpletest_script_run_one_test('10', 'Drupal\tmgmt_config\Tests\ConfigSourceListTest') NoticeConfigSourceListTest.php160Drupal\tmgmt_config\Tests\ConfigSourceListTest->testViewTranslation()
Trying to get property of non-objectDrupal\tmgmt_config\Tests\ConfigSourceListTest->testViewTranslation() Drupal\simpletest\TestBase->run(Array) simpletest_script_run_one_test('10', 'Drupal\tmgmt_config\Tests\ConfigSourceListTest') NoticeConfigSourceListTest.php160Drupal\tmgmt_config\Tests\ConfigSourceListTest->testViewTranslation()
Value '' is equal to value 'Cart'.OtherConfigSourceListTest.php161Drupal\tmgmt_config\Tests\ConfigSourceListTest->testViewTranslation()
ExpandDrupal\tmgmt_content\Tests\ContentEntitySourceUiTest184651
MessageGroupFilenameLineFunctionStatus
Link Translate does not exist on http://ec2-54-191-110-230.us-west-2.compute.amazonaws.com/checkout/node/1BrowserContentEntitySourceUiTest.php70Drupal\tmgmt_content\Tests\ContentEntitySourceUiTest->testNodeTranslateTabSingleCheckout()
"Translations of qjqHtvaI" foundOtherContentEntitySourceUiTest.php73Drupal\tmgmt_content\Tests\ContentEntitySourceUiTest->testNodeTranslateTabSingleCheckout()
"Pending Translations" foundOtherContentEntitySourceUiTest.php74Drupal\tmgmt_content\Tests\ContentEntitySourceUiTest->testNodeTranslateTabSingleCheckout()
Failed to set field languages[de] to 1OtherContentEntitySourceUiTest.php80Drupal\tmgmt_content\Tests\ContentEntitySourceUiTest->testNodeTranslateTabSingleCheckout()
Found the Request translation buttonOtherContentEntitySourceUiTest.php80Drupal\tmgmt_content\Tests\ContentEntitySourceUiTest->testNodeTranslateTabSingleCheckout()
Found the requested form fields at OtherContentEntitySourceUiTest.php80Drupal\tmgmt_content\Tests\ContentEntitySourceUiTest->testNodeTranslateTabSingleCheckout()
"One job needs to be checked out." foundOtherContentEntitySourceUiTest.php83Drupal\tmgmt_content\Tests\ContentEntitySourceUiTest->testNodeTranslateTabSingleCheckout()
Found the Submit to translator buttonOtherContentEntitySourceUiTest.php87Drupal\tmgmt_content\Tests\ContentEntitySourceUiTest->testNodeTranslateTabSingleCheckout()
Found the requested form fields at OtherContentEntitySourceUiTest.php87Drupal\tmgmt_content\Tests\ContentEntitySourceUiTest->testNodeTranslateTabSingleCheckout()
Value 'http://ec2-54-191-110-230.us-west-2.compute.amazonaws.com/checkout/node/1/translations' is equal to value 'http://ec2-54-191-110-230.us-west-2.compute.amazonaws.com/checkout/node/1'.OtherContentEntitySourceUiTest.php90Drupal\tmgmt_content\Tests\ContentEntitySourceUiTest->testNodeTranslateTabSingleCheckout()
"Test translation created." foundOtherContentEntitySourceUiTest.php91Drupal\tmgmt_content\Tests\ContentEntitySourceUiTest->testNodeTranslateTabSingleCheckout()
"The translation of qjqHtvaI to German is finished and can now be reviewed." foundOtherContentEntitySourceUiTest.php95Drupal\tmgmt_content\Tests\ContentEntitySourceUiTest->testNodeTranslateTabSingleCheckout()
Link Needs review does not exist on http://ec2-54-191-110-230.us-west-2.compute.amazonaws.com/checkout/node/1BrowserContentEntitySourceUiTest.php98Drupal\tmgmt_content\Tests\ContentEntitySourceUiTest->testNodeTranslateTabSingleCheckout()
Found the Save as completed buttonOtherContentEntitySourceUiTest.php99Drupal\tmgmt_content\Tests\ContentEntitySourceUiTest->testNodeTranslateTabSingleCheckout()
Found the requested form fields at OtherContentEntitySourceUiTest.php99Drupal\tmgmt_content\Tests\ContentEntitySourceUiTest->testNodeTranslateTabSingleCheckout()
"The translation for qjqHtvaI has been accepted." foundOtherContentEntitySourceUiTest.php101Drupal\tmgmt_content\Tests\ContentEntitySourceUiTest->testNodeTranslateTabSingleCheckout()
Link de_qjqHtvaI does not exist on http://ec2-54-191-110-230.us-west-2.compute.amazonaws.com/checkout/node/1BrowserContentEntitySourceUiTest.php104Drupal\tmgmt_content\Tests\ContentEntitySourceUiTest->testNodeTranslateTabSingleCheckout()
"de_qjqHtvaI" foundOtherContentEntitySourceUiTest.php105Drupal\tmgmt_content\Tests\ContentEntitySourceUiTest->testNodeTranslateTabSingleCheckout()
"de_ymvRL5UpGQ7CZ52u1oQ4" foundOtherContentEntitySourceUiTest.php106Drupal\tmgmt_content\Tests\ContentEntitySourceUiTest->testNodeTranslateTabSingleCheckout()
Link Translate does not exist on http://ec2-54-191-110-230.us-west-2.compute.amazonaws.com/checkout/node/1BrowserContentEntitySourceUiTest.php113Drupal\tmgmt_content\Tests\ContentEntitySourceUiTest->testNodeTranslateTabSingleCheckout()
Failed to set field languages[fr] to 1OtherContentEntitySourceUiTest.php118Drupal\tmgmt_content\Tests\ContentEntitySourceUiTest->testNodeTranslateTabSingleCheckout()
Found the Request translation buttonOtherContentEntitySourceUiTest.php118Drupal\tmgmt_content\Tests\ContentEntitySourceUiTest->testNodeTranslateTabSingleCheckout()
Found the requested form fields at OtherContentEntitySourceUiTest.php118Drupal\tmgmt_content\Tests\ContentEntitySourceUiTest->testNodeTranslateTabSingleCheckout()
Link In progress does not exist on http://ec2-54-191-110-230.us-west-2.compute.amazonaws.com/checkout/node/1/translations?destination=node/1BrowserContentEntitySourceUiTest.php121Drupal\tmgmt_content\Tests\ContentEntitySourceUiTest->testNodeTranslateTabSingleCheckout()
"qjqHtvaI" not foundOtherContentEntitySourceUiTest.php148Drupal\tmgmt_content\Tests\ContentEntitySourceUiTest->testNodeTranslateTabSingleCheckout()
Drupal\Core\Entity\EntityStorageException: SQLSTATE[23000]: Integrity constraint violation: 1048 Column 'title' cannot be null: INSERT INTO {node_field_data} (nid, vid, type, langcode, title, uid, status, created, changed, promote, sticky, revision_translation_affected, default_langcode, content_translation_source, content_translation_outdated) VALUES (:db_insert_placeholder_0, :db_insert_placeholder_1, :db_insert_placeholder_2, :db_insert_placeholder_3, :db_insert_placeholder_4, :db_insert_placeholder_5, :db_insert_placeholder_6, :db_insert_placeholder_7, :db_insert_placeholder_8, :db_insert_placeholder_9, :db_insert_placeholder_10, :db_insert_placeholder_11, :db_insert_placeholder_12, :db_insert_placeholder_13, :db_insert_placeholder_14), (:db_insert_placeholder_15, :db_insert_placeholder_16, :db_insert_placeholder_17, :db_insert_placeholder_18, :db_insert_placeholder_19, :db_insert_placeholder_20, :db_insert_placeholder_21, :db_insert_placeholder_22, :db_insert_placeholder_23, :db_insert_placeholder_24, :db_insert_placeholder_25, :db_insert_placeholder_26, :db_insert_placeholder_27, :db_insert_placeholder_28, :db_insert_placeholder_29); Array ( [:db_insert_placeholder_0] => 1 [:db_insert_placeholder_1] => 1 [:db_insert_placeholder_2] => page [:db_insert_placeholder_3] => en [:db_insert_placeholder_4] => qjqHtvaI [:db_insert_placeholder_5] => 3 [:db_insert_placeholder_6] => 1 [:db_insert_placeholder_7] => 1441196864 [:db_insert_placeholder_8] => 1441196864 [:db_insert_placeholder_9] => 1 [:db_insert_placeholder_10] => 0 [:db_insert_placeholder_11] => 1 [:db_insert_placeholder_12] => 1 [:db_insert_placeholder_13] => und [:db_insert_placeholder_14] => 0 [:db_insert_placeholder_15] => 1 [:db_insert_placeholder_16] => 1 [:db_insert_placeholder_17] => page [:db_insert_placeholder_18] => de [:db_insert_placeholder_19] => [:db_insert_placeholder_20] => 3 [:db_insert_placeholder_21] => 1 [:db_insert_placeholder_22] => 1441196864 [:db_insert_placeholder_23] => 1441196864 [:db_insert_placeholder_24] => 1 [:db_insert_placeholder_25] => 0 [:db_insert_placeholder_26] => 1 [:db_insert_placeholder_27] => 0 [:db_insert_placeholder_28] => und [:db_insert_placeholder_29] => 1 ) in Drupal\Core\Entity\Sql\SqlContentEntityStorage->save() (line 757 of /var/lib/drupaltestbot/sites/default/files/checkout/core/lib/Drupal/Core/Entity/Sql/SqlContentEntityStorage.php). Drupal\Core\Entity\Sql\SqlContentEntityStorage->save(Object) Drupal\Core\Entity\Entity->save() Drupal\tmgmt_content\Tests\ContentEntitySourceUiTest->testNodeTranslateTabSingleCheckout() Drupal\simpletest\TestBase->run(Array) simpletest_script_run_one_test('4', 'Drupal\tmgmt_content\Tests\ContentEntitySourceUiTest') Uncaught exceptionSqlContentEntityStorage.php757Drupal\Core\Entity\Sql\SqlContentEntityStorage->save()
Link Translate does not exist on http://ec2-54-191-110-230.us-west-2.compute.amazonaws.com/checkout/node/1BrowserContentEntitySourceUiTest.php206Drupal\tmgmt_content\Tests\ContentEntitySourceUiTest->testNodeTranslateTabMultipeCheckout()
"Translations of vhuEYhG7" foundOtherContentEntitySourceUiTest.php209Drupal\tmgmt_content\Tests\ContentEntitySourceUiTest->testNodeTranslateTabMultipeCheckout()
"Pending Translations" foundOtherContentEntitySourceUiTest.php210Drupal\tmgmt_content\Tests\ContentEntitySourceUiTest->testNodeTranslateTabMultipeCheckout()
Failed to set field languages[de] to 1OtherContentEntitySourceUiTest.php217Drupal\tmgmt_content\Tests\ContentEntitySourceUiTest->testNodeTranslateTabMultipeCheckout()
Failed to set field languages[es] to 1OtherContentEntitySourceUiTest.php217Drupal\tmgmt_content\Tests\ContentEntitySourceUiTest->testNodeTranslateTabMultipeCheckout()
Found the Request translation buttonOtherContentEntitySourceUiTest.php217Drupal\tmgmt_content\Tests\ContentEntitySourceUiTest->testNodeTranslateTabMultipeCheckout()
Found the requested form fields at OtherContentEntitySourceUiTest.php217Drupal\tmgmt_content\Tests\ContentEntitySourceUiTest->testNodeTranslateTabMultipeCheckout()
"2 jobs need to be checked out." foundOtherContentEntitySourceUiTest.php220Drupal\tmgmt_content\Tests\ContentEntitySourceUiTest->testNodeTranslateTabMultipeCheckout()
Found the Submit to translator and continue buttonOtherContentEntitySourceUiTest.php224Drupal\tmgmt_content\Tests\ContentEntitySourceUiTest->testNodeTranslateTabMultipeCheckout()
Found the requested form fields at OtherContentEntitySourceUiTest.php224Drupal\tmgmt_content\Tests\ContentEntitySourceUiTest->testNodeTranslateTabMultipeCheckout()
Found the Submit to translator buttonOtherContentEntitySourceUiTest.php226Drupal\tmgmt_content\Tests\ContentEntitySourceUiTest->testNodeTranslateTabMultipeCheckout()
Found the requested form fields at OtherContentEntitySourceUiTest.php226Drupal\tmgmt_content\Tests\ContentEntitySourceUiTest->testNodeTranslateTabMultipeCheckout()
Value 'http://ec2-54-191-110-230.us-west-2.compute.amazonaws.com/checkout/node/1/translations' is equal to value 'http://ec2-54-191-110-230.us-west-2.compute.amazonaws.com/checkout/node/1'.OtherContentEntitySourceUiTest.php229Drupal\tmgmt_content\Tests\ContentEntitySourceUiTest->testNodeTranslateTabMultipeCheckout()
"Test translation created." foundOtherContentEntitySourceUiTest.php230Drupal\tmgmt_content\Tests\ContentEntitySourceUiTest->testNodeTranslateTabMultipeCheckout()
"The translation for vhuEYhG7 has been accepted." foundOtherContentEntitySourceUiTest.php235Drupal\tmgmt_content\Tests\ContentEntitySourceUiTest->testNodeTranslateTabMultipeCheckout()
"de_vhuEYhG7" foundOtherContentEntitySourceUiTest.php240Drupal\tmgmt_content\Tests\ContentEntitySourceUiTest->testNodeTranslateTabMultipeCheckout()
"de_zgTSt9NjNnOLgvL0kXEq" foundOtherContentEntitySourceUiTest.php241Drupal\tmgmt_content\Tests\ContentEntitySourceUiTest->testNodeTranslateTabMultipeCheckout()
"es_vhuEYhG7" foundOtherContentEntitySourceUiTest.php244Drupal\tmgmt_content\Tests\ContentEntitySourceUiTest->testNodeTranslateTabMultipeCheckout()
"es_zgTSt9NjNnOLgvL0kXEq" foundOtherContentEntitySourceUiTest.php245Drupal\tmgmt_content\Tests\ContentEntitySourceUiTest->testNodeTranslateTabMultipeCheckout()
Link Translate does not exist on http://ec2-54-191-110-230.us-west-2.compute.amazonaws.com/checkout/comment/1/editBrowserContentEntitySourceUiTest.php301Drupal\tmgmt_content\Tests\ContentEntitySourceUiTest->testCommentTranslateTab()
"Translations of zy4K9HYL" foundOtherContentEntitySourceUiTest.php304Drupal\tmgmt_content\Tests\ContentEntitySourceUiTest->testCommentTranslateTab()
"Pending Translations" foundOtherContentEntitySourceUiTest.php305Drupal\tmgmt_content\Tests\ContentEntitySourceUiTest->testCommentTranslateTab()
Failed to set field languages[de] to 1OtherContentEntitySourceUiTest.php312Drupal\tmgmt_content\Tests\ContentEntitySourceUiTest->testCommentTranslateTab()
Failed to set field languages[es] to 1OtherContentEntitySourceUiTest.php312Drupal\tmgmt_content\Tests\ContentEntitySourceUiTest->testCommentTranslateTab()
Found the Request translation buttonOtherContentEntitySourceUiTest.php312Drupal\tmgmt_content\Tests\ContentEntitySourceUiTest->testCommentTranslateTab()
Found the requested form fields at OtherContentEntitySourceUiTest.php312Drupal\tmgmt_content\Tests\ContentEntitySourceUiTest->testCommentTranslateTab()
"2 jobs need to be checked out." foundOtherContentEntitySourceUiTest.php315Drupal\tmgmt_content\Tests\ContentEntitySourceUiTest->testCommentTranslateTab()
"zy4K9HYL" foundOtherContentEntitySourceUiTest.php318Drupal\tmgmt_content\Tests\ContentEntitySourceUiTest->testCommentTranslateTab()
Found the Submit to translator and continue buttonOtherContentEntitySourceUiTest.php319Drupal\tmgmt_content\Tests\ContentEntitySourceUiTest->testCommentTranslateTab()
Found the requested form fields at OtherContentEntitySourceUiTest.php319Drupal\tmgmt_content\Tests\ContentEntitySourceUiTest->testCommentTranslateTab()
"zy4K9HYL" foundOtherContentEntitySourceUiTest.php320Drupal\tmgmt_content\Tests\ContentEntitySourceUiTest->testCommentTranslateTab()
Found the Submit to translator buttonOtherContentEntitySourceUiTest.php321Drupal\tmgmt_content\Tests\ContentEntitySourceUiTest->testCommentTranslateTab()
Found the requested form fields at OtherContentEntitySourceUiTest.php321Drupal\tmgmt_content\Tests\ContentEntitySourceUiTest->testCommentTranslateTab()
Expected 'http://ec2-54-191-110-230.us-west-2.compute.amazonaws.com/checkout/comment/1/translations' matches current URL (http://ec2-54-191-110-230.us-west-2.compute.amazonaws.com/checkout/comment/1/edit).OtherContentEntitySourceUiTest.php324Drupal\tmgmt_content\Tests\ContentEntitySourceUiTest->testCommentTranslateTab()
"Test translation created." foundOtherContentEntitySourceUiTest.php325Drupal\tmgmt_content\Tests\ContentEntitySourceUiTest->testCommentTranslateTab()
"The translation for zy4K9HYL has been accepted." foundOtherContentEntitySourceUiTest.php330Drupal\tmgmt_content\Tests\ContentEntitySourceUiTest->testCommentTranslateTab()
Link de_zy4K9HYL does not exist on http://ec2-54-191-110-230.us-west-2.compute.amazonaws.com/checkout/comment/1/editBrowserContentEntitySourceUiTest.php333Drupal\tmgmt_content\Tests\ContentEntitySourceUiTest->testCommentTranslateTab()
"de_v90FlgMy" foundOtherContentEntitySourceUiTest.php334Drupal\tmgmt_content\Tests\ContentEntitySourceUiTest->testCommentTranslateTab()
Link es_zy4K9HYL does not exist on http://ec2-54-191-110-230.us-west-2.compute.amazonaws.com/checkout/comment/1/translationsBrowserContentEntitySourceUiTest.php338Drupal\tmgmt_content\Tests\ContentEntitySourceUiTest->testCommentTranslateTab()
"es_v90FlgMy" foundOtherContentEntitySourceUiTest.php340Drupal\tmgmt_content\Tests\ContentEntitySourceUiTest->testCommentTranslateTab()
ExpandDrupal\tmgmt_demo\Tests\TMGMTDemoTest36120
MessageGroupFilenameLineFunctionStatus
Link Translate does not exist on http://ec2-54-191-110-230.us-west-2.compute.amazonaws.com/checkout/node/3BrowserTMGMTDemoTest.php47Drupal\tmgmt_demo\Tests\TMGMTDemoTest->testInstalled()
Failed to set field languages[de] to 1OtherTMGMTDemoTest.php52Drupal\tmgmt_demo\Tests\TMGMTDemoTest->testInstalled()
Failed to set field languages[fr] to 1OtherTMGMTDemoTest.php52Drupal\tmgmt_demo\Tests\TMGMTDemoTest->testInstalled()
Found the Request translation buttonOtherTMGMTDemoTest.php52Drupal\tmgmt_demo\Tests\TMGMTDemoTest->testInstalled()
Found the requested form fields at OtherTMGMTDemoTest.php52Drupal\tmgmt_demo\Tests\TMGMTDemoTest->testInstalled()
"2 jobs need to be checked out." foundOtherTMGMTDemoTest.php53Drupal\tmgmt_demo\Tests\TMGMTDemoTest->testInstalled()
Link Translate does not exist on http://ec2-54-191-110-230.us-west-2.compute.amazonaws.com/checkout/node/2BrowserTMGMTDemoTest.php57Drupal\tmgmt_demo\Tests\TMGMTDemoTest->testInstalled()
Failed to set field languages[de] to 1OtherTMGMTDemoTest.php58Drupal\tmgmt_demo\Tests\TMGMTDemoTest->testInstalled()
Failed to set field languages[fr] to 1OtherTMGMTDemoTest.php58Drupal\tmgmt_demo\Tests\TMGMTDemoTest->testInstalled()
Found the Request translation buttonOtherTMGMTDemoTest.php58Drupal\tmgmt_demo\Tests\TMGMTDemoTest->testInstalled()
Found the requested form fields at OtherTMGMTDemoTest.php58Drupal\tmgmt_demo\Tests\TMGMTDemoTest->testInstalled()
"2 jobs need to be checked out." foundOtherTMGMTDemoTest.php59Drupal\tmgmt_demo\Tests\TMGMTDemoTest->testInstalled()

All

Test namePassFailException
LeafDrupal\tmgmt\Tests\CrudTest19900
LeafDrupal\tmgmt\Tests\HelperTest4300
ExpandDrupal\tmgmt\Tests\LocalTasksTests15100
MessageGroupFilenameLineFunctionStatus
Link Cart does not exist on http://ec2-54-191-110-230.us-west-2.compute.amazonaws.com/checkout/admin/tmgmt/jobsBrowserLocalTasksTests.php59Drupal\tmgmt\Tests\LocalTasksTests->testTranslatorLocalTaks()
Link Jobs does not exist on http://ec2-54-191-110-230.us-west-2.compute.amazonaws.com/checkout/admin/tmgmt/jobsBrowserLocalTasksTests.php60Drupal\tmgmt\Tests\LocalTasksTests->testTranslatorLocalTaks()
Link Sources does not exist on http://ec2-54-191-110-230.us-west-2.compute.amazonaws.com/checkout/admin/tmgmt/jobsBrowserLocalTasksTests.php61Drupal\tmgmt\Tests\LocalTasksTests->testTranslatorLocalTaks()
Option content:node for field edit-source is selected.BrowserLocalTasksTests.php64Drupal\tmgmt\Tests\LocalTasksTests->testTranslatorLocalTaks()
Option content:node for field edit-source exists.BrowserLocalTasksTests.php65Drupal\tmgmt\Tests\LocalTasksTests->testTranslatorLocalTaks()
Option content:user for field edit-source exists.BrowserLocalTasksTests.php66Drupal\tmgmt\Tests\LocalTasksTests->testTranslatorLocalTaks()
Option config:block for field edit-source exists.BrowserLocalTasksTests.php67Drupal\tmgmt\Tests\LocalTasksTests->testTranslatorLocalTaks()
Option config:node_type for field edit-source exists.BrowserLocalTasksTests.php68Drupal\tmgmt\Tests\LocalTasksTests->testTranslatorLocalTaks()
Option config:tmgmt_translator for field edit-source exists.BrowserLocalTasksTests.php69Drupal\tmgmt\Tests\LocalTasksTests->testTranslatorLocalTaks()
Option config:base_field_override for field edit-source does not exist.BrowserLocalTasksTests.php70Drupal\tmgmt\Tests\LocalTasksTests->testTranslatorLocalTaks()
LeafDrupal\tmgmt\Tests\PluginsTest5000
LeafDrupal\tmgmt\Tests\TMGMTCartTest5200
ExpandDrupal\tmgmt\Tests\TMGMTUiTest66940
MessageGroupFilenameLineFunctionStatus
Link Cart does not exist on http://ec2-54-191-110-230.us-west-2.compute.amazonaws.com/checkout/admin/tmgmt/jobsBrowserTMGMTUiTest.php859Drupal\tmgmt\Tests\TMGMTUiTest->testPageTitles()
Link Jobs does not exist on http://ec2-54-191-110-230.us-west-2.compute.amazonaws.com/checkout/admin/tmgmt/jobsBrowserTMGMTUiTest.php860Drupal\tmgmt\Tests\TMGMTUiTest->testPageTitles()
Link Sources does not exist on http://ec2-54-191-110-230.us-west-2.compute.amazonaws.com/checkout/admin/tmgmt/jobsBrowserTMGMTUiTest.php861Drupal\tmgmt\Tests\TMGMTUiTest->testPageTitles()
Page title 'Job overview | Drupal' is equal to 'Translation Sources | Drupal'.OtherTMGMTUiTest.php862Drupal\tmgmt\Tests\TMGMTUiTest->testPageTitles()
ExpandDrupal\tmgmt\Tests\TranslatorTest8410
MessageGroupFilenameLineFunctionStatus
"Add translator" foundOtherTranslatorTest.php67Drupal\tmgmt\Tests\TranslatorTest->testTranslatorHandling()
LeafDrupal\tmgmt\Tests\TranslatorUITest3000
ExpandDrupal\tmgmt_config\Tests\ConfigSourceListTest24312
MessageGroupFilenameLineFunctionStatus
Undefined offset: 0Drupal\tmgmt_config\Tests\ConfigSourceListTest->testViewTranslation() Drupal\simpletest\TestBase->run(Array) simpletest_script_run_one_test('10', 'Drupal\tmgmt_config\Tests\ConfigSourceListTest') NoticeConfigSourceListTest.php160Drupal\tmgmt_config\Tests\ConfigSourceListTest->testViewTranslation()
Trying to get property of non-objectDrupal\tmgmt_config\Tests\ConfigSourceListTest->testViewTranslation() Drupal\simpletest\TestBase->run(Array) simpletest_script_run_one_test('10', 'Drupal\tmgmt_config\Tests\ConfigSourceListTest') NoticeConfigSourceListTest.php160Drupal\tmgmt_config\Tests\ConfigSourceListTest->testViewTranslation()
Value '' is equal to value 'Cart'.OtherConfigSourceListTest.php161Drupal\tmgmt_config\Tests\ConfigSourceListTest->testViewTranslation()
LeafDrupal\tmgmt_config\Tests\ConfigSourceUiTest24100
LeafDrupal\tmgmt_config\Tests\ConfigSourceUnitTest3900
LeafDrupal\tmgmt_content\Tests\ContentEntitySourceListTest16100
ExpandDrupal\tmgmt_content\Tests\ContentEntitySourceUiTest184651
MessageGroupFilenameLineFunctionStatus
Link Translate does not exist on http://ec2-54-191-110-230.us-west-2.compute.amazonaws.com/checkout/node/1BrowserContentEntitySourceUiTest.php70Drupal\tmgmt_content\Tests\ContentEntitySourceUiTest->testNodeTranslateTabSingleCheckout()
"Translations of qjqHtvaI" foundOtherContentEntitySourceUiTest.php73Drupal\tmgmt_content\Tests\ContentEntitySourceUiTest->testNodeTranslateTabSingleCheckout()
"Pending Translations" foundOtherContentEntitySourceUiTest.php74Drupal\tmgmt_content\Tests\ContentEntitySourceUiTest->testNodeTranslateTabSingleCheckout()
Failed to set field languages[de] to 1OtherContentEntitySourceUiTest.php80Drupal\tmgmt_content\Tests\ContentEntitySourceUiTest->testNodeTranslateTabSingleCheckout()
Found the Request translation buttonOtherContentEntitySourceUiTest.php80Drupal\tmgmt_content\Tests\ContentEntitySourceUiTest->testNodeTranslateTabSingleCheckout()
Found the requested form fields at OtherContentEntitySourceUiTest.php80Drupal\tmgmt_content\Tests\ContentEntitySourceUiTest->testNodeTranslateTabSingleCheckout()
"One job needs to be checked out." foundOtherContentEntitySourceUiTest.php83Drupal\tmgmt_content\Tests\ContentEntitySourceUiTest->testNodeTranslateTabSingleCheckout()
Found the Submit to translator buttonOtherContentEntitySourceUiTest.php87Drupal\tmgmt_content\Tests\ContentEntitySourceUiTest->testNodeTranslateTabSingleCheckout()
Found the requested form fields at OtherContentEntitySourceUiTest.php87Drupal\tmgmt_content\Tests\ContentEntitySourceUiTest->testNodeTranslateTabSingleCheckout()
Value 'http://ec2-54-191-110-230.us-west-2.compute.amazonaws.com/checkout/node/1/translations' is equal to value 'http://ec2-54-191-110-230.us-west-2.compute.amazonaws.com/checkout/node/1'.OtherContentEntitySourceUiTest.php90Drupal\tmgmt_content\Tests\ContentEntitySourceUiTest->testNodeTranslateTabSingleCheckout()
"Test translation created." foundOtherContentEntitySourceUiTest.php91Drupal\tmgmt_content\Tests\ContentEntitySourceUiTest->testNodeTranslateTabSingleCheckout()
"The translation of qjqHtvaI to German is finished and can now be reviewed." foundOtherContentEntitySourceUiTest.php95Drupal\tmgmt_content\Tests\ContentEntitySourceUiTest->testNodeTranslateTabSingleCheckout()
Link Needs review does not exist on http://ec2-54-191-110-230.us-west-2.compute.amazonaws.com/checkout/node/1BrowserContentEntitySourceUiTest.php98Drupal\tmgmt_content\Tests\ContentEntitySourceUiTest->testNodeTranslateTabSingleCheckout()
Found the Save as completed buttonOtherContentEntitySourceUiTest.php99Drupal\tmgmt_content\Tests\ContentEntitySourceUiTest->testNodeTranslateTabSingleCheckout()
Found the requested form fields at OtherContentEntitySourceUiTest.php99Drupal\tmgmt_content\Tests\ContentEntitySourceUiTest->testNodeTranslateTabSingleCheckout()
"The translation for qjqHtvaI has been accepted." foundOtherContentEntitySourceUiTest.php101Drupal\tmgmt_content\Tests\ContentEntitySourceUiTest->testNodeTranslateTabSingleCheckout()
Link de_qjqHtvaI does not exist on http://ec2-54-191-110-230.us-west-2.compute.amazonaws.com/checkout/node/1BrowserContentEntitySourceUiTest.php104Drupal\tmgmt_content\Tests\ContentEntitySourceUiTest->testNodeTranslateTabSingleCheckout()
"de_qjqHtvaI" foundOtherContentEntitySourceUiTest.php105Drupal\tmgmt_content\Tests\ContentEntitySourceUiTest->testNodeTranslateTabSingleCheckout()
"de_ymvRL5UpGQ7CZ52u1oQ4" foundOtherContentEntitySourceUiTest.php106Drupal\tmgmt_content\Tests\ContentEntitySourceUiTest->testNodeTranslateTabSingleCheckout()
Link Translate does not exist on http://ec2-54-191-110-230.us-west-2.compute.amazonaws.com/checkout/node/1BrowserContentEntitySourceUiTest.php113Drupal\tmgmt_content\Tests\ContentEntitySourceUiTest->testNodeTranslateTabSingleCheckout()
Failed to set field languages[fr] to 1OtherContentEntitySourceUiTest.php118Drupal\tmgmt_content\Tests\ContentEntitySourceUiTest->testNodeTranslateTabSingleCheckout()
Found the Request translation buttonOtherContentEntitySourceUiTest.php118Drupal\tmgmt_content\Tests\ContentEntitySourceUiTest->testNodeTranslateTabSingleCheckout()
Found the requested form fields at OtherContentEntitySourceUiTest.php118Drupal\tmgmt_content\Tests\ContentEntitySourceUiTest->testNodeTranslateTabSingleCheckout()
Link In progress does not exist on http://ec2-54-191-110-230.us-west-2.compute.amazonaws.com/checkout/node/1/translations?destination=node/1BrowserContentEntitySourceUiTest.php121Drupal\tmgmt_content\Tests\ContentEntitySourceUiTest->testNodeTranslateTabSingleCheckout()
"qjqHtvaI" not foundOtherContentEntitySourceUiTest.php148Drupal\tmgmt_content\Tests\ContentEntitySourceUiTest->testNodeTranslateTabSingleCheckout()
Drupal\Core\Entity\EntityStorageException: SQLSTATE[23000]: Integrity constraint violation: 1048 Column 'title' cannot be null: INSERT INTO {node_field_data} (nid, vid, type, langcode, title, uid, status, created, changed, promote, sticky, revision_translation_affected, default_langcode, content_translation_source, content_translation_outdated) VALUES (:db_insert_placeholder_0, :db_insert_placeholder_1, :db_insert_placeholder_2, :db_insert_placeholder_3, :db_insert_placeholder_4, :db_insert_placeholder_5, :db_insert_placeholder_6, :db_insert_placeholder_7, :db_insert_placeholder_8, :db_insert_placeholder_9, :db_insert_placeholder_10, :db_insert_placeholder_11, :db_insert_placeholder_12, :db_insert_placeholder_13, :db_insert_placeholder_14), (:db_insert_placeholder_15, :db_insert_placeholder_16, :db_insert_placeholder_17, :db_insert_placeholder_18, :db_insert_placeholder_19, :db_insert_placeholder_20, :db_insert_placeholder_21, :db_insert_placeholder_22, :db_insert_placeholder_23, :db_insert_placeholder_24, :db_insert_placeholder_25, :db_insert_placeholder_26, :db_insert_placeholder_27, :db_insert_placeholder_28, :db_insert_placeholder_29); Array ( [:db_insert_placeholder_0] => 1 [:db_insert_placeholder_1] => 1 [:db_insert_placeholder_2] => page [:db_insert_placeholder_3] => en [:db_insert_placeholder_4] => qjqHtvaI [:db_insert_placeholder_5] => 3 [:db_insert_placeholder_6] => 1 [:db_insert_placeholder_7] => 1441196864 [:db_insert_placeholder_8] => 1441196864 [:db_insert_placeholder_9] => 1 [:db_insert_placeholder_10] => 0 [:db_insert_placeholder_11] => 1 [:db_insert_placeholder_12] => 1 [:db_insert_placeholder_13] => und [:db_insert_placeholder_14] => 0 [:db_insert_placeholder_15] => 1 [:db_insert_placeholder_16] => 1 [:db_insert_placeholder_17] => page [:db_insert_placeholder_18] => de [:db_insert_placeholder_19] => [:db_insert_placeholder_20] => 3 [:db_insert_placeholder_21] => 1 [:db_insert_placeholder_22] => 1441196864 [:db_insert_placeholder_23] => 1441196864 [:db_insert_placeholder_24] => 1 [:db_insert_placeholder_25] => 0 [:db_insert_placeholder_26] => 1 [:db_insert_placeholder_27] => 0 [:db_insert_placeholder_28] => und [:db_insert_placeholder_29] => 1 ) in Drupal\Core\Entity\Sql\SqlContentEntityStorage->save() (line 757 of /var/lib/drupaltestbot/sites/default/files/checkout/core/lib/Drupal/Core/Entity/Sql/SqlContentEntityStorage.php). Drupal\Core\Entity\Sql\SqlContentEntityStorage->save(Object) Drupal\Core\Entity\Entity->save() Drupal\tmgmt_content\Tests\ContentEntitySourceUiTest->testNodeTranslateTabSingleCheckout() Drupal\simpletest\TestBase->run(Array) simpletest_script_run_one_test('4', 'Drupal\tmgmt_content\Tests\ContentEntitySourceUiTest') Uncaught exceptionSqlContentEntityStorage.php757Drupal\Core\Entity\Sql\SqlContentEntityStorage->save()
Link Translate does not exist on http://ec2-54-191-110-230.us-west-2.compute.amazonaws.com/checkout/node/1BrowserContentEntitySourceUiTest.php206Drupal\tmgmt_content\Tests\ContentEntitySourceUiTest->testNodeTranslateTabMultipeCheckout()
"Translations of vhuEYhG7" foundOtherContentEntitySourceUiTest.php209Drupal\tmgmt_content\Tests\ContentEntitySourceUiTest->testNodeTranslateTabMultipeCheckout()
"Pending Translations" foundOtherContentEntitySourceUiTest.php210Drupal\tmgmt_content\Tests\ContentEntitySourceUiTest->testNodeTranslateTabMultipeCheckout()
Failed to set field languages[de] to 1OtherContentEntitySourceUiTest.php217Drupal\tmgmt_content\Tests\ContentEntitySourceUiTest->testNodeTranslateTabMultipeCheckout()
Failed to set field languages[es] to 1OtherContentEntitySourceUiTest.php217Drupal\tmgmt_content\Tests\ContentEntitySourceUiTest->testNodeTranslateTabMultipeCheckout()
Found the Request translation buttonOtherContentEntitySourceUiTest.php217Drupal\tmgmt_content\Tests\ContentEntitySourceUiTest->testNodeTranslateTabMultipeCheckout()
Found the requested form fields at OtherContentEntitySourceUiTest.php217Drupal\tmgmt_content\Tests\ContentEntitySourceUiTest->testNodeTranslateTabMultipeCheckout()
"2 jobs need to be checked out." foundOtherContentEntitySourceUiTest.php220Drupal\tmgmt_content\Tests\ContentEntitySourceUiTest->testNodeTranslateTabMultipeCheckout()
Found the Submit to translator and continue buttonOtherContentEntitySourceUiTest.php224Drupal\tmgmt_content\Tests\ContentEntitySourceUiTest->testNodeTranslateTabMultipeCheckout()
Found the requested form fields at OtherContentEntitySourceUiTest.php224Drupal\tmgmt_content\Tests\ContentEntitySourceUiTest->testNodeTranslateTabMultipeCheckout()
Found the Submit to translator buttonOtherContentEntitySourceUiTest.php226Drupal\tmgmt_content\Tests\ContentEntitySourceUiTest->testNodeTranslateTabMultipeCheckout()
Found the requested form fields at OtherContentEntitySourceUiTest.php226Drupal\tmgmt_content\Tests\ContentEntitySourceUiTest->testNodeTranslateTabMultipeCheckout()
Value 'http://ec2-54-191-110-230.us-west-2.compute.amazonaws.com/checkout/node/1/translations' is equal to value 'http://ec2-54-191-110-230.us-west-2.compute.amazonaws.com/checkout/node/1'.OtherContentEntitySourceUiTest.php229Drupal\tmgmt_content\Tests\ContentEntitySourceUiTest->testNodeTranslateTabMultipeCheckout()
"Test translation created." foundOtherContentEntitySourceUiTest.php230Drupal\tmgmt_content\Tests\ContentEntitySourceUiTest->testNodeTranslateTabMultipeCheckout()
"The translation for vhuEYhG7 has been accepted." foundOtherContentEntitySourceUiTest.php235Drupal\tmgmt_content\Tests\ContentEntitySourceUiTest->testNodeTranslateTabMultipeCheckout()
"de_vhuEYhG7" foundOtherContentEntitySourceUiTest.php240Drupal\tmgmt_content\Tests\ContentEntitySourceUiTest->testNodeTranslateTabMultipeCheckout()
"de_zgTSt9NjNnOLgvL0kXEq" foundOtherContentEntitySourceUiTest.php241Drupal\tmgmt_content\Tests\ContentEntitySourceUiTest->testNodeTranslateTabMultipeCheckout()
"es_vhuEYhG7" foundOtherContentEntitySourceUiTest.php244Drupal\tmgmt_content\Tests\ContentEntitySourceUiTest->testNodeTranslateTabMultipeCheckout()
"es_zgTSt9NjNnOLgvL0kXEq" foundOtherContentEntitySourceUiTest.php245Drupal\tmgmt_content\Tests\ContentEntitySourceUiTest->testNodeTranslateTabMultipeCheckout()
Link Translate does not exist on http://ec2-54-191-110-230.us-west-2.compute.amazonaws.com/checkout/comment/1/editBrowserContentEntitySourceUiTest.php301Drupal\tmgmt_content\Tests\ContentEntitySourceUiTest->testCommentTranslateTab()
"Translations of zy4K9HYL" foundOtherContentEntitySourceUiTest.php304Drupal\tmgmt_content\Tests\ContentEntitySourceUiTest->testCommentTranslateTab()
"Pending Translations" foundOtherContentEntitySourceUiTest.php305Drupal\tmgmt_content\Tests\ContentEntitySourceUiTest->testCommentTranslateTab()
Failed to set field languages[de] to 1OtherContentEntitySourceUiTest.php312Drupal\tmgmt_content\Tests\ContentEntitySourceUiTest->testCommentTranslateTab()
Failed to set field languages[es] to 1OtherContentEntitySourceUiTest.php312Drupal\tmgmt_content\Tests\ContentEntitySourceUiTest->testCommentTranslateTab()
Found the Request translation buttonOtherContentEntitySourceUiTest.php312Drupal\tmgmt_content\Tests\ContentEntitySourceUiTest->testCommentTranslateTab()
Found the requested form fields at OtherContentEntitySourceUiTest.php312Drupal\tmgmt_content\Tests\ContentEntitySourceUiTest->testCommentTranslateTab()
"2 jobs need to be checked out." foundOtherContentEntitySourceUiTest.php315Drupal\tmgmt_content\Tests\ContentEntitySourceUiTest->testCommentTranslateTab()
"zy4K9HYL" foundOtherContentEntitySourceUiTest.php318Drupal\tmgmt_content\Tests\ContentEntitySourceUiTest->testCommentTranslateTab()
Found the Submit to translator and continue buttonOtherContentEntitySourceUiTest.php319Drupal\tmgmt_content\Tests\ContentEntitySourceUiTest->testCommentTranslateTab()
Found the requested form fields at OtherContentEntitySourceUiTest.php319Drupal\tmgmt_content\Tests\ContentEntitySourceUiTest->testCommentTranslateTab()
"zy4K9HYL" foundOtherContentEntitySourceUiTest.php320Drupal\tmgmt_content\Tests\ContentEntitySourceUiTest->testCommentTranslateTab()
Found the Submit to translator buttonOtherContentEntitySourceUiTest.php321Drupal\tmgmt_content\Tests\ContentEntitySourceUiTest->testCommentTranslateTab()
Found the requested form fields at OtherContentEntitySourceUiTest.php321Drupal\tmgmt_content\Tests\ContentEntitySourceUiTest->testCommentTranslateTab()
Expected 'http://ec2-54-191-110-230.us-west-2.compute.amazonaws.com/checkout/comment/1/translations' matches current URL (http://ec2-54-191-110-230.us-west-2.compute.amazonaws.com/checkout/comment/1/edit).OtherContentEntitySourceUiTest.php324Drupal\tmgmt_content\Tests\ContentEntitySourceUiTest->testCommentTranslateTab()
"Test translation created." foundOtherContentEntitySourceUiTest.php325Drupal\tmgmt_content\Tests\ContentEntitySourceUiTest->testCommentTranslateTab()
"The translation for zy4K9HYL has been accepted." foundOtherContentEntitySourceUiTest.php330Drupal\tmgmt_content\Tests\ContentEntitySourceUiTest->testCommentTranslateTab()
Link de_zy4K9HYL does not exist on http://ec2-54-191-110-230.us-west-2.compute.amazonaws.com/checkout/comment/1/editBrowserContentEntitySourceUiTest.php333Drupal\tmgmt_content\Tests\ContentEntitySourceUiTest->testCommentTranslateTab()
"de_v90FlgMy" foundOtherContentEntitySourceUiTest.php334Drupal\tmgmt_content\Tests\ContentEntitySourceUiTest->testCommentTranslateTab()
Link es_zy4K9HYL does not exist on http://ec2-54-191-110-230.us-west-2.compute.amazonaws.com/checkout/comment/1/translationsBrowserContentEntitySourceUiTest.php338Drupal\tmgmt_content\Tests\ContentEntitySourceUiTest->testCommentTranslateTab()
"es_v90FlgMy" foundOtherContentEntitySourceUiTest.php340Drupal\tmgmt_content\Tests\ContentEntitySourceUiTest->testCommentTranslateTab()
LeafDrupal\tmgmt_content\Tests\ContentEntitySourceUnitTest14600
LeafDrupal\tmgmt_content\Tests\ContentEntitySuggestionsTest2400
ExpandDrupal\tmgmt_demo\Tests\TMGMTDemoTest36120
MessageGroupFilenameLineFunctionStatus
Link Translate does not exist on http://ec2-54-191-110-230.us-west-2.compute.amazonaws.com/checkout/node/3BrowserTMGMTDemoTest.php47Drupal\tmgmt_demo\Tests\TMGMTDemoTest->testInstalled()
Failed to set field languages[de] to 1OtherTMGMTDemoTest.php52Drupal\tmgmt_demo\Tests\TMGMTDemoTest->testInstalled()
Failed to set field languages[fr] to 1OtherTMGMTDemoTest.php52Drupal\tmgmt_demo\Tests\TMGMTDemoTest->testInstalled()
Found the Request translation buttonOtherTMGMTDemoTest.php52Drupal\tmgmt_demo\Tests\TMGMTDemoTest->testInstalled()
Found the requested form fields at OtherTMGMTDemoTest.php52Drupal\tmgmt_demo\Tests\TMGMTDemoTest->testInstalled()
"2 jobs need to be checked out." foundOtherTMGMTDemoTest.php53Drupal\tmgmt_demo\Tests\TMGMTDemoTest->testInstalled()
Link Translate does not exist on http://ec2-54-191-110-230.us-west-2.compute.amazonaws.com/checkout/node/2BrowserTMGMTDemoTest.php57Drupal\tmgmt_demo\Tests\TMGMTDemoTest->testInstalled()
Failed to set field languages[de] to 1OtherTMGMTDemoTest.php58Drupal\tmgmt_demo\Tests\TMGMTDemoTest->testInstalled()
Failed to set field languages[fr] to 1OtherTMGMTDemoTest.php58Drupal\tmgmt_demo\Tests\TMGMTDemoTest->testInstalled()
Found the Request translation buttonOtherTMGMTDemoTest.php58Drupal\tmgmt_demo\Tests\TMGMTDemoTest->testInstalled()
Found the requested form fields at OtherTMGMTDemoTest.php58Drupal\tmgmt_demo\Tests\TMGMTDemoTest->testInstalled()
"2 jobs need to be checked out." foundOtherTMGMTDemoTest.php59Drupal\tmgmt_demo\Tests\TMGMTDemoTest->testInstalled()
LeafDrupal\tmgmt_file\Tests\FileTranslatorTest16600
LeafDrupal\tmgmt_locale\Tests\LocaleSourceTest6300
LeafDrupal\tmgmt_locale\Tests\LocaleSourceUiTest5000