Hmtl_tags-2560951-2.patch

Test status
StatusResult
Last receivedThu, 09/03/2015 - 10:46:00
Last requestedThu, 09/03/2015 - 10:48:56
Last testedThu, 09/03/2015 - 10:51:56
Test count2
Environment status
PHP 5.5 MySQLfail
File information
FileHmtl_tags-2560951-2.patch
BranchTranslation Management Tool - 8.x-1.x
LinkIssue Link
SummaryFAILED: [[SimpleTest]]: [PHP 5.5 MySQL] 2,580 pass(es), 1 fail(s), and 1 exception(s).
Details

PHP 5.5 MySQL

  1. Setup environment
  2. Detect an invalid patch URL
  3. Detect invalid repository information
  4. Detect invalid patch format
  5. Detect a non-applicable patch
  6. Detect invalid PHP syntax
  7. Detect a Drupal installation failure
  8. Detect a test run failure
  9. Detect a failing test
    Review the test failures below then if necessary run them locally until the problem has been fixed.
  10. Complete test suite with all tests passing
2,580 pass(es), 1 fail(s), and 1 exception(s)

Non-pass

Test namePassFailException
ExpandDrupal\tmgmt\Tests\CrudTest16001
MessageGroupFilenameLineFunctionStatus
Drupal\Core\Entity\EntityStorageException: SQLSTATE[22001]: String data, right truncated: 1406 Data too long for column 'message' at row 1: INSERT INTO {tmgmt_message} (uuid, tjid, tjiid, type, uid, message, variables, created) VALUES (:db_insert_placeholder_0, :db_insert_placeholder_1, :db_insert_placeholder_2, :db_insert_placeholder_3, :db_insert_placeholder_4, :db_insert_placeholder_5, :db_insert_placeholder_6, :db_insert_placeholder_7); Array ( [:db_insert_placeholder_0] => e3442046-dc1a-4bb8-a824-36d00864f994 [:db_insert_placeholder_1] => 1 [:db_insert_placeholder_2] => 1 [:db_insert_placeholder_3] => status [:db_insert_placeholder_4] => 0 [:db_insert_placeholder_5] => The translation of <a href="/admin/tmgmt/items/1" hreflang="und">test_source:test_with_long_label:5Some very long and boring label that definitely exceeds hundred and twenty eight characters which is the maximum character count for the job item label.</a> to German is finished and can now be <a href="/admin/tmgmt/items/1?destination=/admin/tmgmt/jobs/1">reviewed</a>. [:db_insert_placeholder_6] => a:0:{} [:db_insert_placeholder_7] => 1441277353 ) in Drupal\Core\Entity\Sql\SqlContentEntityStorage->save() (line 757 of /var/lib/drupaltestbot/sites/default/files/checkout/core/lib/Drupal/Core/Entity/Sql/SqlContentEntityStorage.php). Drupal\Core\Entity\Sql\SqlContentEntityStorage->save(Object) Drupal\Core\Entity\Entity->save() Drupal\tmgmt\Entity\JobItem->addMessage('The translation of <a href="/admin/tmgmt/items/1" hreflang="und">test_source:test_with_long_label:5Some very long and boring label that definitely exceeds hundred and twenty eight characters which is the maximum character count for the job item label.</a> to German is finished and can now be <a href="/admin/tmgmt/items/1?destination=/admin/tmgmt/jobs/1">reviewed</a>.', Array, 'status') Drupal\tmgmt\Entity\JobItem->setState(2, 'The translation of <a href="/admin/tmgmt/items/1" hreflang="und">test_source:test_with_long_label:5Some very long and boring label that definitely exceeds hundred and twenty eight characters which is the maximum character count for the job item label.</a> to German is finished and can now be <a href="/admin/tmgmt/items/1?destination=/admin/tmgmt/jobs/1">reviewed</a>.', Array, 'status') Drupal\tmgmt\Entity\JobItem->needsReview('The translation of <a href="/admin/tmgmt/items/1" hreflang="und">test_source:test_with_long_label:5Some very long and boring label that definitely exceeds hundred and twenty eight characters which is the maximum character count for the job item label.</a> to German is finished and can now be <a href="/admin/tmgmt/items/1?destination=/admin/tmgmt/jobs/1">reviewed</a>.') Drupal\tmgmt\Entity\JobItem->addTranslatedData(Array) Drupal\tmgmt\Tests\CrudTest->testAddingTranslatedData() Drupal\simpletest\TestBase->run(Array) simpletest_script_run_one_test('18', 'Drupal\tmgmt\Tests\CrudTest') Uncaught exceptionSqlContentEntityStorage.php757Drupal\Core\Entity\Sql\SqlContentEntityStorage->save()
ExpandDrupal\tmgmt\Tests\PluginsTest4910
MessageGroupFilenameLineFunctionStatus
Value 'The translation of @source to @language is finished and can now be <a href="@review_url">reviewed</a>.' is equal to value 'The translation of <a href="/admin/tmgmt/items/3" hreflang="und">test_source:test:1</a> to German is finished and can now be <a href="/admin/tmgmt/items/3?destination=/admin/tmgmt/jobs/2">reviewed</a>.'.OtherPluginsTest.php81Drupal\tmgmt\Tests\PluginsTest->testBasicWorkflow()

All

Test namePassFailException
ExpandDrupal\tmgmt\Tests\CrudTest16001
MessageGroupFilenameLineFunctionStatus
Drupal\Core\Entity\EntityStorageException: SQLSTATE[22001]: String data, right truncated: 1406 Data too long for column 'message' at row 1: INSERT INTO {tmgmt_message} (uuid, tjid, tjiid, type, uid, message, variables, created) VALUES (:db_insert_placeholder_0, :db_insert_placeholder_1, :db_insert_placeholder_2, :db_insert_placeholder_3, :db_insert_placeholder_4, :db_insert_placeholder_5, :db_insert_placeholder_6, :db_insert_placeholder_7); Array ( [:db_insert_placeholder_0] => e3442046-dc1a-4bb8-a824-36d00864f994 [:db_insert_placeholder_1] => 1 [:db_insert_placeholder_2] => 1 [:db_insert_placeholder_3] => status [:db_insert_placeholder_4] => 0 [:db_insert_placeholder_5] => The translation of <a href="/admin/tmgmt/items/1" hreflang="und">test_source:test_with_long_label:5Some very long and boring label that definitely exceeds hundred and twenty eight characters which is the maximum character count for the job item label.</a> to German is finished and can now be <a href="/admin/tmgmt/items/1?destination=/admin/tmgmt/jobs/1">reviewed</a>. [:db_insert_placeholder_6] => a:0:{} [:db_insert_placeholder_7] => 1441277353 ) in Drupal\Core\Entity\Sql\SqlContentEntityStorage->save() (line 757 of /var/lib/drupaltestbot/sites/default/files/checkout/core/lib/Drupal/Core/Entity/Sql/SqlContentEntityStorage.php). Drupal\Core\Entity\Sql\SqlContentEntityStorage->save(Object) Drupal\Core\Entity\Entity->save() Drupal\tmgmt\Entity\JobItem->addMessage('The translation of <a href="/admin/tmgmt/items/1" hreflang="und">test_source:test_with_long_label:5Some very long and boring label that definitely exceeds hundred and twenty eight characters which is the maximum character count for the job item label.</a> to German is finished and can now be <a href="/admin/tmgmt/items/1?destination=/admin/tmgmt/jobs/1">reviewed</a>.', Array, 'status') Drupal\tmgmt\Entity\JobItem->setState(2, 'The translation of <a href="/admin/tmgmt/items/1" hreflang="und">test_source:test_with_long_label:5Some very long and boring label that definitely exceeds hundred and twenty eight characters which is the maximum character count for the job item label.</a> to German is finished and can now be <a href="/admin/tmgmt/items/1?destination=/admin/tmgmt/jobs/1">reviewed</a>.', Array, 'status') Drupal\tmgmt\Entity\JobItem->needsReview('The translation of <a href="/admin/tmgmt/items/1" hreflang="und">test_source:test_with_long_label:5Some very long and boring label that definitely exceeds hundred and twenty eight characters which is the maximum character count for the job item label.</a> to German is finished and can now be <a href="/admin/tmgmt/items/1?destination=/admin/tmgmt/jobs/1">reviewed</a>.') Drupal\tmgmt\Entity\JobItem->addTranslatedData(Array) Drupal\tmgmt\Tests\CrudTest->testAddingTranslatedData() Drupal\simpletest\TestBase->run(Array) simpletest_script_run_one_test('18', 'Drupal\tmgmt\Tests\CrudTest') Uncaught exceptionSqlContentEntityStorage.php757Drupal\Core\Entity\Sql\SqlContentEntityStorage->save()
LeafDrupal\tmgmt\Tests\HelperTest4300
LeafDrupal\tmgmt\Tests\LocalTasksTests3100
ExpandDrupal\tmgmt\Tests\PluginsTest4910
MessageGroupFilenameLineFunctionStatus
Value 'The translation of @source to @language is finished and can now be <a href="@review_url">reviewed</a>.' is equal to value 'The translation of <a href="/admin/tmgmt/items/3" hreflang="und">test_source:test:1</a> to German is finished and can now be <a href="/admin/tmgmt/items/3?destination=/admin/tmgmt/jobs/2">reviewed</a>.'.OtherPluginsTest.php81Drupal\tmgmt\Tests\PluginsTest->testBasicWorkflow()
LeafDrupal\tmgmt\Tests\TMGMTCartTest5200
LeafDrupal\tmgmt\Tests\TMGMTUiTest66500
LeafDrupal\tmgmt\Tests\TranslatorTest8500
LeafDrupal\tmgmt\Tests\TranslatorUITest3000
LeafDrupal\tmgmt_config\Tests\ConfigSourceListTest24400
LeafDrupal\tmgmt_config\Tests\ConfigSourceUiTest24100
LeafDrupal\tmgmt_config\Tests\ConfigSourceUnitTest3900
LeafDrupal\tmgmt_content\Tests\ContentEntitySourceListTest16100
LeafDrupal\tmgmt_content\Tests\ContentEntitySourceUiTest28300
LeafDrupal\tmgmt_content\Tests\ContentEntitySourceUnitTest14600
LeafDrupal\tmgmt_content\Tests\ContentEntitySuggestionsTest2400
LeafDrupal\tmgmt_demo\Tests\TMGMTDemoTest4800
LeafDrupal\tmgmt_file\Tests\FileTranslatorTest16600
LeafDrupal\tmgmt_locale\Tests\LocaleSourceTest6300
LeafDrupal\tmgmt_locale\Tests\LocaleSourceUiTest5000