submit_poll_forms-2557013-8-test_only.patch

Test status
StatusResult
Last receivedFri, 08/28/2015 - 14:58:00
Last requestedFri, 08/28/2015 - 15:20:27
Last testedFri, 08/28/2015 - 15:21:18
Test count1
Environment status
PHP 5.5 MySQLfail
File information
Filesubmit_poll_forms-2557013-8-test_only.patch
BranchPoll (from core) - 8.x-1.x
LinkIssue Link
SummaryFAILED: [[SimpleTest]]: [PHP 5.5 MySQL] 822 pass(es), 0 fail(s), and 2 exception(s).
Details

PHP 5.5 MySQL

  1. Setup environment
  2. Detect an invalid patch URL
  3. Detect invalid repository information
  4. Detect invalid patch format
  5. Detect a non-applicable patch
  6. Detect invalid PHP syntax
  7. Detect a Drupal installation failure
  8. Detect a test run failure
  9. Detect a failing test
    Review the test failures below then if necessary run them locally until the problem has been fixed.
  10. Complete test suite with all tests passing
822 pass(es), 0 fail(s), and 2 exception(s)

Non-pass

Test namePassFailException
ExpandDrupal\poll\Tests\PollVoteTest14002
MessageGroupFilenameLineFunctionStatus
Undefined index: ajaxDrupal\simpletest\WebTestBase->drupalPostAjaxForm('poll/1', Array, Array, NULL, Array, Array, 'poll-view-form-1') Drupal\poll\Tests\PollVoteTest->testAjaxPollVote() Drupal\simpletest\TestBase->run(Array) simpletest_script_run_one_test('1', 'Drupal\poll\Tests\PollVoteTest') NoticeWebTestBase.php1863Drupal\simpletest\WebTestBase->drupalPostAjaxForm()
Exception: No #ajax path specified. in Drupal\simpletest\WebTestBase->drupalPostAjaxForm() (line 1899 of /var/lib/drupaltestbot/sites/default/files/checkout/core/modules/simpletest/src/WebTestBase.php). Drupal\simpletest\WebTestBase->drupalPostAjaxForm('poll/1', Array, Array, NULL, Array, Array, 'poll-view-form-1') Drupal\poll\Tests\PollVoteTest->testAjaxPollVote() Drupal\simpletest\TestBase->run(Array) simpletest_script_run_one_test('1', 'Drupal\poll\Tests\PollVoteTest') Uncaught exceptionWebTestBase.php1899Drupal\simpletest\WebTestBase->drupalPostAjaxForm()

All

Test namePassFailException
LeafDrupal\poll\Tests\PollBlockTest6300
LeafDrupal\poll\Tests\PollCreateTest11900
LeafDrupal\poll\Tests\PollDeleteChoiceTest4700
LeafDrupal\poll\Tests\PollExpirationTest5600
LeafDrupal\poll\Tests\PollListTest8300
LeafDrupal\poll\Tests\PollTokenReplaceTest14200
LeafDrupal\poll\Tests\PollViewTest5300
LeafDrupal\poll\Tests\PollVoteCheckHostnameTest11900
ExpandDrupal\poll\Tests\PollVoteTest14002
MessageGroupFilenameLineFunctionStatus
Undefined index: ajaxDrupal\simpletest\WebTestBase->drupalPostAjaxForm('poll/1', Array, Array, NULL, Array, Array, 'poll-view-form-1') Drupal\poll\Tests\PollVoteTest->testAjaxPollVote() Drupal\simpletest\TestBase->run(Array) simpletest_script_run_one_test('1', 'Drupal\poll\Tests\PollVoteTest') NoticeWebTestBase.php1863Drupal\simpletest\WebTestBase->drupalPostAjaxForm()
Exception: No #ajax path specified. in Drupal\simpletest\WebTestBase->drupalPostAjaxForm() (line 1899 of /var/lib/drupaltestbot/sites/default/files/checkout/core/modules/simpletest/src/WebTestBase.php). Drupal\simpletest\WebTestBase->drupalPostAjaxForm('poll/1', Array, Array, NULL, Array, Array, 'poll-view-form-1') Drupal\poll\Tests\PollVoteTest->testAjaxPollVote() Drupal\simpletest\TestBase->run(Array) simpletest_script_run_one_test('1', 'Drupal\poll\Tests\PollVoteTest') Uncaught exceptionWebTestBase.php1899Drupal\simpletest\WebTestBase->drupalPostAjaxForm()