default_config_added-2556621-22.patch

Test status
StatusResult
Last receivedThu, 08/27/2015 - 22:03:22
Last requestedThu, 08/27/2015 - 22:16:53
Last testedThu, 08/27/2015 - 22:22:24
Test count1
Environment status
PHP 5.5 MySQLfail
File information
Filedefault_config_added-2556621-22.patch
BranchMonitoring - 8.x-1.x
LinkIssue Link
SummaryFAILED: [[SimpleTest]]: [PHP 5.5 MySQL] 1,829 pass(es), 10 fail(s), and 6 exception(s).
Details

PHP 5.5 MySQL

  1. Setup environment
  2. Detect an invalid patch URL
  3. Detect invalid repository information
  4. Detect invalid patch format
  5. Detect a non-applicable patch
  6. Detect invalid PHP syntax
  7. Detect a Drupal installation failure
  8. Detect a test run failure
  9. Detect a failing test
    Review the test failures below then if necessary run them locally until the problem has been fixed.
  10. Complete test suite with all tests passing
1,829 pass(es), 10 fail(s), and 6 exception(s)

Non-pass

Test namePassFailException
ExpandDrupal\monitoring\Tests\MonitoringCaptchaTest011
MessageGroupFilenameLineFunctionStatus
The test did not complete due to a fatal error.Completion checkMonitoringCaptchaTest.php31Drupal\monitoring\Tests\MonitoringCaptchaTest->testCaptchaSensor()
Drupal\Core\Config\Schema\SchemaIncompleteException: Schema errors for captcha.settings with the following errors: captcha.settings:langcode missing schema in Drupal\Core\Config\Testing\ConfigSchemaChecker->onConfigSave() (line 98 of /var/lib/drupaltestbot/sites/default/files/checkout/core/lib/Drupal/Core/Config/Testing/ConfigSchemaChecker.php). Drupal\Core\Config\Testing\ConfigSchemaChecker->onConfigSave(Object, 'config.save', Object) Drupal\Component\EventDispatcher\ContainerAwareEventDispatcher->dispatch('config.save', Object) Drupal\Core\Config\Config->save(1) Drupal\Core\Config\ConfigInstaller->createConfiguration('', Array) Drupal\Core\Config\ConfigInstaller->installDefaultConfig('module', 'captcha') Drupal\Core\ProxyClass\Config\ConfigInstaller->installDefaultConfig('module', 'captcha') Drupal\Core\Extension\ModuleInstaller->install(Array, 1) Drupal\Core\ProxyClass\Extension\ModuleInstaller->install(Array, 1) Drupal\simpletest\WebTestBase->installModulesFromClassProperty(Object) Drupal\simpletest\WebTestBase->setUp() Drupal\monitoring\Tests\MonitoringTestBase->setUp() Drupal\monitoring\Tests\MonitoringCaptchaTest->setUp() Drupal\simpletest\TestBase->run(Array) simpletest_script_run_one_test('12', 'Drupal\monitoring\Tests\MonitoringCaptchaTest') Uncaught exceptionConfigSchemaChecker.php98Drupal\Core\Config\Testing\ConfigSchemaChecker->onConfigSave()
ExpandDrupal\monitoring\Tests\MonitoringPaymentTest110
MessageGroupFilenameLineFunctionStatus
The test did not complete due to a fatal error.Completion checkMonitoringPaymentTest.php37Drupal\monitoring\Tests\MonitoringPaymentTest->testPaymentSensors()
ExpandDrupal\monitoring\Tests\MonitoringSearchAPITest923
MessageGroupFilenameLineFunctionStatus
Argument 4 passed to Drupal\Core\Database\Driver\mysql\Schema::addIndex() must be of the type array, none given, called in /var/lib/drupaltestbot/sites/default/files/checkout/sites/default/modules/search_api/search_api_db/src/Plugin/search_api/backend/Database.php on line 583 and definedDrupal\Core\Database\Driver\mysql\Schema->addIndex('search_api_db_database_search_index_search_api', 'value', Array) Drupal\search_api_db\Plugin\search_api\backend\Database->createFieldTable(Object, Array) Drupal\search_api_db\Plugin\search_api\backend\Database->fieldsUpdated(Object) Drupal\search_api_db\Plugin\search_api\backend\Database->addIndex(Object) Drupal\search_api\Entity\Server->addIndex(Object) Drupal\search_api\Entity\Index->postSave(Object, ) Drupal\Core\Entity\EntityStorageBase->doPostSave(Object, ) Drupal\Core\Entity\EntityStorageBase->save(Object) Drupal\Core\Config\Entity\ConfigEntityStorage->save(Object) Drupal\Core\Entity\Entity->save() Drupal\Core\Config\Entity\ConfigEntityBase->save() Drupal\Core\Config\ConfigInstaller->createConfiguration('', Array) Drupal\Core\Config\ConfigInstaller->installDefaultConfig('module', 'search_api_test_db') Drupal\Core\ProxyClass\Config\ConfigInstaller->installDefaultConfig('module', 'search_api_test_db') Drupal\simpletest\KernelTestBase->installConfig(Array) Drupal\monitoring\Tests\MonitoringSearchAPITest->setUp() Drupal\simpletest\TestBase->run(Array) simpletest_script_run_one_test('7', 'Drupal\monitoring\Tests\MonitoringSearchAPITest') Recoverable errorSchema.php498Drupal\Core\Database\Driver\mysql\Schema->addIndex()
Argument 4 passed to Drupal\Core\Database\Driver\mysql\Schema::addIndex() must be of the type array, none given, called in /var/lib/drupaltestbot/sites/default/files/checkout/sites/default/modules/search_api/search_api_db/src/Plugin/search_api/backend/Database.php on line 583 and definedDrupal\Core\Database\Driver\mysql\Schema->addIndex('search_api_db_database_search_index_search_a_1', 'value', Array) Drupal\search_api_db\Plugin\search_api\backend\Database->createFieldTable(Object, Array) Drupal\search_api_db\Plugin\search_api\backend\Database->fieldsUpdated(Object) Drupal\search_api_db\Plugin\search_api\backend\Database->addIndex(Object) Drupal\search_api\Task\ServerTaskManager->execute(Object) Drupal\search_api\Entity\Server->indexItems(Object, Array) Drupal\search_api\Entity\Index->indexItems(Array) Drupal\search_api\Entity\Index->index() Drupal\monitoring\Tests\MonitoringSearchAPITest->testSensors() Drupal\simpletest\TestBase->run(Array) simpletest_script_run_one_test('7', 'Drupal\monitoring\Tests\MonitoringSearchAPITest') Recoverable errorSchema.php498Drupal\Core\Database\Driver\mysql\Schema->addIndex()
Value 5 is equal to value 3.OtherMonitoringSearchAPITest.php84Drupal\monitoring\Tests\MonitoringSearchAPITest->testSensors()
Argument 4 passed to Drupal\Core\Database\Driver\mysql\Schema::addIndex() must be of the type array, none given, called in /var/lib/drupaltestbot/sites/default/files/checkout/sites/default/modules/search_api/search_api_db/src/Plugin/search_api/backend/Database.php on line 583 and definedDrupal\Core\Database\Driver\mysql\Schema->addIndex('search_api_db_database_search_index_search_a_2', 'value', Array) Drupal\search_api_db\Plugin\search_api\backend\Database->createFieldTable(Object, Array) Drupal\search_api_db\Plugin\search_api\backend\Database->fieldsUpdated(Object) Drupal\search_api_db\Plugin\search_api\backend\Database->addIndex(Object) Drupal\search_api\Task\ServerTaskManager->execute(Object) Drupal\search_api\Entity\Server->indexItems(Object, Array) Drupal\search_api\Entity\Index->indexItems(Array) Drupal\search_api\Entity\Index->index() Drupal\monitoring\Tests\MonitoringSearchAPITest->testSensors() Drupal\simpletest\TestBase->run(Array) simpletest_script_run_one_test('7', 'Drupal\monitoring\Tests\MonitoringSearchAPITest') Recoverable errorSchema.php498Drupal\Core\Database\Driver\mysql\Schema->addIndex()
Value 5 is equal to value 0.OtherMonitoringSearchAPITest.php91Drupal\monitoring\Tests\MonitoringSearchAPITest->testSensors()
ExpandDrupal\monitoring\Tests\MonitoringViewDisplayTest1951
MessageGroupFilenameLineFunctionStatus
Failed to set field settings[display] to defaultOtherMonitoringViewDisplayTest.php46Drupal\monitoring\Tests\MonitoringViewDisplayTest->testViewDisplaySensor()
Found the requested form fields at OtherMonitoringViewDisplayTest.php46Drupal\monitoring\Tests\MonitoringViewDisplayTest->testViewDisplaySensor()
"Sensor All users saved." foundOtherMonitoringViewDisplayTest.php47Drupal\monitoring\Tests\MonitoringViewDisplayTest->testViewDisplaySensor()
Option user_admin_people for field edit-settings-view is selected.BrowserMonitoringViewDisplayTest.php51Drupal\monitoring\Tests\MonitoringViewDisplayTest->testViewDisplaySensor()
Option default for field edit-settings-display is selected.BrowserMonitoringViewDisplayTest.php52Drupal\monitoring\Tests\MonitoringViewDisplayTest->testViewDisplaySensor()
Drupal\monitoring\Sensor\NonExistingSensorException: Sensor view_user_count does not exist in Drupal\monitoring\Sensor\SensorManager->getSensorConfigByName() (line 127 of /var/lib/drupaltestbot/sites/default/files/checkout/sites/default/modules/monitoring/src/Sensor/SensorManager.php). Drupal\monitoring\Sensor\SensorManager->getSensorConfigByName('view_user_count') Drupal\monitoring\Sensor\SensorManager->enableSensor('view_user_count') Drupal\monitoring\Tests\MonitoringTestBase->runSensor('view_user_count') Drupal\monitoring\Tests\MonitoringViewDisplayTest->testViewDisplaySensor() Drupal\simpletest\TestBase->run(Array) simpletest_script_run_one_test('5', 'Drupal\monitoring\Tests\MonitoringViewDisplayTest') Uncaught exceptionSensorManager.php127Drupal\monitoring\Sensor\SensorManager->getSensorConfigByName()
ExpandDrupal\monitoring_demo\Tests\MonitoringDemoTest011
MessageGroupFilenameLineFunctionStatus
The test did not complete due to a fatal error.Completion checkMonitoringDemoTest.php35Drupal\monitoring_demo\Tests\MonitoringDemoTest->testInstalled()
Drupal\Core\Config\Schema\SchemaIncompleteException: Schema errors for search_api.settings with the following errors: search_api.settings:langcode missing schema in Drupal\Core\Config\Testing\ConfigSchemaChecker->onConfigSave() (line 98 of /var/lib/drupaltestbot/sites/default/files/checkout/core/lib/Drupal/Core/Config/Testing/ConfigSchemaChecker.php). Drupal\Core\Config\Testing\ConfigSchemaChecker->onConfigSave(Object, 'config.save', Object) Drupal\Component\EventDispatcher\ContainerAwareEventDispatcher->dispatch('config.save', Object) Drupal\Core\Config\Config->save(1) Drupal\Core\Config\ConfigInstaller->createConfiguration('', Array) Drupal\Core\Config\ConfigInstaller->installDefaultConfig('module', 'search_api') Drupal\Core\ProxyClass\Config\ConfigInstaller->installDefaultConfig('module', 'search_api') Drupal\Core\Extension\ModuleInstaller->install(Array, 1) Drupal\Core\ProxyClass\Extension\ModuleInstaller->install(Array, 1) Drupal\simpletest\WebTestBase->installModulesFromClassProperty(Object) Drupal\simpletest\WebTestBase->setUp() Drupal\monitoring\Tests\MonitoringTestBase->setUp() Drupal\monitoring_demo\Tests\MonitoringDemoTest->setUp() Drupal\simpletest\TestBase->run(Array) simpletest_script_run_one_test('1', 'Drupal\monitoring_demo\Tests\MonitoringDemoTest') Uncaught exceptionConfigSchemaChecker.php98Drupal\Core\Config\Testing\ConfigSchemaChecker->onConfigSave()

All

Test namePassFailException
LeafDrupal\monitoring\Tests\MonitoringApiTest8100
ExpandDrupal\monitoring\Tests\MonitoringCaptchaTest011
MessageGroupFilenameLineFunctionStatus
The test did not complete due to a fatal error.Completion checkMonitoringCaptchaTest.php31Drupal\monitoring\Tests\MonitoringCaptchaTest->testCaptchaSensor()
Drupal\Core\Config\Schema\SchemaIncompleteException: Schema errors for captcha.settings with the following errors: captcha.settings:langcode missing schema in Drupal\Core\Config\Testing\ConfigSchemaChecker->onConfigSave() (line 98 of /var/lib/drupaltestbot/sites/default/files/checkout/core/lib/Drupal/Core/Config/Testing/ConfigSchemaChecker.php). Drupal\Core\Config\Testing\ConfigSchemaChecker->onConfigSave(Object, 'config.save', Object) Drupal\Component\EventDispatcher\ContainerAwareEventDispatcher->dispatch('config.save', Object) Drupal\Core\Config\Config->save(1) Drupal\Core\Config\ConfigInstaller->createConfiguration('', Array) Drupal\Core\Config\ConfigInstaller->installDefaultConfig('module', 'captcha') Drupal\Core\ProxyClass\Config\ConfigInstaller->installDefaultConfig('module', 'captcha') Drupal\Core\Extension\ModuleInstaller->install(Array, 1) Drupal\Core\ProxyClass\Extension\ModuleInstaller->install(Array, 1) Drupal\simpletest\WebTestBase->installModulesFromClassProperty(Object) Drupal\simpletest\WebTestBase->setUp() Drupal\monitoring\Tests\MonitoringTestBase->setUp() Drupal\monitoring\Tests\MonitoringCaptchaTest->setUp() Drupal\simpletest\TestBase->run(Array) simpletest_script_run_one_test('12', 'Drupal\monitoring\Tests\MonitoringCaptchaTest') Uncaught exceptionConfigSchemaChecker.php98Drupal\Core\Config\Testing\ConfigSchemaChecker->onConfigSave()
LeafDrupal\monitoring\Tests\MonitoringCoreKernelTest16000
LeafDrupal\monitoring\Tests\MonitoringCoreWebTest18500
LeafDrupal\monitoring\Tests\MonitoringPastTest1300
ExpandDrupal\monitoring\Tests\MonitoringPaymentTest110
MessageGroupFilenameLineFunctionStatus
The test did not complete due to a fatal error.Completion checkMonitoringPaymentTest.php37Drupal\monitoring\Tests\MonitoringPaymentTest->testPaymentSensors()
ExpandDrupal\monitoring\Tests\MonitoringSearchAPITest923
MessageGroupFilenameLineFunctionStatus
Argument 4 passed to Drupal\Core\Database\Driver\mysql\Schema::addIndex() must be of the type array, none given, called in /var/lib/drupaltestbot/sites/default/files/checkout/sites/default/modules/search_api/search_api_db/src/Plugin/search_api/backend/Database.php on line 583 and definedDrupal\Core\Database\Driver\mysql\Schema->addIndex('search_api_db_database_search_index_search_api', 'value', Array) Drupal\search_api_db\Plugin\search_api\backend\Database->createFieldTable(Object, Array) Drupal\search_api_db\Plugin\search_api\backend\Database->fieldsUpdated(Object) Drupal\search_api_db\Plugin\search_api\backend\Database->addIndex(Object) Drupal\search_api\Entity\Server->addIndex(Object) Drupal\search_api\Entity\Index->postSave(Object, ) Drupal\Core\Entity\EntityStorageBase->doPostSave(Object, ) Drupal\Core\Entity\EntityStorageBase->save(Object) Drupal\Core\Config\Entity\ConfigEntityStorage->save(Object) Drupal\Core\Entity\Entity->save() Drupal\Core\Config\Entity\ConfigEntityBase->save() Drupal\Core\Config\ConfigInstaller->createConfiguration('', Array) Drupal\Core\Config\ConfigInstaller->installDefaultConfig('module', 'search_api_test_db') Drupal\Core\ProxyClass\Config\ConfigInstaller->installDefaultConfig('module', 'search_api_test_db') Drupal\simpletest\KernelTestBase->installConfig(Array) Drupal\monitoring\Tests\MonitoringSearchAPITest->setUp() Drupal\simpletest\TestBase->run(Array) simpletest_script_run_one_test('7', 'Drupal\monitoring\Tests\MonitoringSearchAPITest') Recoverable errorSchema.php498Drupal\Core\Database\Driver\mysql\Schema->addIndex()
Argument 4 passed to Drupal\Core\Database\Driver\mysql\Schema::addIndex() must be of the type array, none given, called in /var/lib/drupaltestbot/sites/default/files/checkout/sites/default/modules/search_api/search_api_db/src/Plugin/search_api/backend/Database.php on line 583 and definedDrupal\Core\Database\Driver\mysql\Schema->addIndex('search_api_db_database_search_index_search_a_1', 'value', Array) Drupal\search_api_db\Plugin\search_api\backend\Database->createFieldTable(Object, Array) Drupal\search_api_db\Plugin\search_api\backend\Database->fieldsUpdated(Object) Drupal\search_api_db\Plugin\search_api\backend\Database->addIndex(Object) Drupal\search_api\Task\ServerTaskManager->execute(Object) Drupal\search_api\Entity\Server->indexItems(Object, Array) Drupal\search_api\Entity\Index->indexItems(Array) Drupal\search_api\Entity\Index->index() Drupal\monitoring\Tests\MonitoringSearchAPITest->testSensors() Drupal\simpletest\TestBase->run(Array) simpletest_script_run_one_test('7', 'Drupal\monitoring\Tests\MonitoringSearchAPITest') Recoverable errorSchema.php498Drupal\Core\Database\Driver\mysql\Schema->addIndex()
Value 5 is equal to value 3.OtherMonitoringSearchAPITest.php84Drupal\monitoring\Tests\MonitoringSearchAPITest->testSensors()
Argument 4 passed to Drupal\Core\Database\Driver\mysql\Schema::addIndex() must be of the type array, none given, called in /var/lib/drupaltestbot/sites/default/files/checkout/sites/default/modules/search_api/search_api_db/src/Plugin/search_api/backend/Database.php on line 583 and definedDrupal\Core\Database\Driver\mysql\Schema->addIndex('search_api_db_database_search_index_search_a_2', 'value', Array) Drupal\search_api_db\Plugin\search_api\backend\Database->createFieldTable(Object, Array) Drupal\search_api_db\Plugin\search_api\backend\Database->fieldsUpdated(Object) Drupal\search_api_db\Plugin\search_api\backend\Database->addIndex(Object) Drupal\search_api\Task\ServerTaskManager->execute(Object) Drupal\search_api\Entity\Server->indexItems(Object, Array) Drupal\search_api\Entity\Index->indexItems(Array) Drupal\search_api\Entity\Index->index() Drupal\monitoring\Tests\MonitoringSearchAPITest->testSensors() Drupal\simpletest\TestBase->run(Array) simpletest_script_run_one_test('7', 'Drupal\monitoring\Tests\MonitoringSearchAPITest') Recoverable errorSchema.php498Drupal\Core\Database\Driver\mysql\Schema->addIndex()
Value 5 is equal to value 0.OtherMonitoringSearchAPITest.php91Drupal\monitoring\Tests\MonitoringSearchAPITest->testSensors()
LeafDrupal\monitoring\Tests\MonitoringServicesTest58500
LeafDrupal\monitoring\Tests\MonitoringUITest68600
ExpandDrupal\monitoring\Tests\MonitoringViewDisplayTest1951
MessageGroupFilenameLineFunctionStatus
Failed to set field settings[display] to defaultOtherMonitoringViewDisplayTest.php46Drupal\monitoring\Tests\MonitoringViewDisplayTest->testViewDisplaySensor()
Found the requested form fields at OtherMonitoringViewDisplayTest.php46Drupal\monitoring\Tests\MonitoringViewDisplayTest->testViewDisplaySensor()
"Sensor All users saved." foundOtherMonitoringViewDisplayTest.php47Drupal\monitoring\Tests\MonitoringViewDisplayTest->testViewDisplaySensor()
Option user_admin_people for field edit-settings-view is selected.BrowserMonitoringViewDisplayTest.php51Drupal\monitoring\Tests\MonitoringViewDisplayTest->testViewDisplaySensor()
Option default for field edit-settings-display is selected.BrowserMonitoringViewDisplayTest.php52Drupal\monitoring\Tests\MonitoringViewDisplayTest->testViewDisplaySensor()
Drupal\monitoring\Sensor\NonExistingSensorException: Sensor view_user_count does not exist in Drupal\monitoring\Sensor\SensorManager->getSensorConfigByName() (line 127 of /var/lib/drupaltestbot/sites/default/files/checkout/sites/default/modules/monitoring/src/Sensor/SensorManager.php). Drupal\monitoring\Sensor\SensorManager->getSensorConfigByName('view_user_count') Drupal\monitoring\Sensor\SensorManager->enableSensor('view_user_count') Drupal\monitoring\Tests\MonitoringTestBase->runSensor('view_user_count') Drupal\monitoring\Tests\MonitoringViewDisplayTest->testViewDisplaySensor() Drupal\simpletest\TestBase->run(Array) simpletest_script_run_one_test('5', 'Drupal\monitoring\Tests\MonitoringViewDisplayTest') Uncaught exceptionSensorManager.php127Drupal\monitoring\Sensor\SensorManager->getSensorConfigByName()
ExpandDrupal\monitoring_demo\Tests\MonitoringDemoTest011
MessageGroupFilenameLineFunctionStatus
The test did not complete due to a fatal error.Completion checkMonitoringDemoTest.php35Drupal\monitoring_demo\Tests\MonitoringDemoTest->testInstalled()
Drupal\Core\Config\Schema\SchemaIncompleteException: Schema errors for search_api.settings with the following errors: search_api.settings:langcode missing schema in Drupal\Core\Config\Testing\ConfigSchemaChecker->onConfigSave() (line 98 of /var/lib/drupaltestbot/sites/default/files/checkout/core/lib/Drupal/Core/Config/Testing/ConfigSchemaChecker.php). Drupal\Core\Config\Testing\ConfigSchemaChecker->onConfigSave(Object, 'config.save', Object) Drupal\Component\EventDispatcher\ContainerAwareEventDispatcher->dispatch('config.save', Object) Drupal\Core\Config\Config->save(1) Drupal\Core\Config\ConfigInstaller->createConfiguration('', Array) Drupal\Core\Config\ConfigInstaller->installDefaultConfig('module', 'search_api') Drupal\Core\ProxyClass\Config\ConfigInstaller->installDefaultConfig('module', 'search_api') Drupal\Core\Extension\ModuleInstaller->install(Array, 1) Drupal\Core\ProxyClass\Extension\ModuleInstaller->install(Array, 1) Drupal\simpletest\WebTestBase->installModulesFromClassProperty(Object) Drupal\simpletest\WebTestBase->setUp() Drupal\monitoring\Tests\MonitoringTestBase->setUp() Drupal\monitoring_demo\Tests\MonitoringDemoTest->setUp() Drupal\simpletest\TestBase->run(Array) simpletest_script_run_one_test('1', 'Drupal\monitoring_demo\Tests\MonitoringDemoTest') Uncaught exceptionConfigSchemaChecker.php98Drupal\Core\Config\Testing\ConfigSchemaChecker->onConfigSave()
LeafDrupal\monitoring_multigraph\Tests\MultigraphServicesTest2600
LeafDrupal\monitoring_multigraph\Tests\MultigraphWebTest6400