add_views_schema_for-2555365-6-test_only.patch

Test status
StatusResult
Last receivedThu, 08/27/2015 - 12:05:59
Last requestedThu, 08/27/2015 - 12:06:02
Last testedThu, 08/27/2015 - 12:06:52
Test count1
Environment status
PHP 5.5 MySQLfail
File information
Fileadd_views_schema_for-2555365-6-test_only.patch
BranchFlag - 8.x-4.x
LinkIssue Link
SummaryFAILED: [[SimpleTest]]: [PHP 5.5 MySQL] 435 pass(es), 1 fail(s), and 1 exception(s).
Details

PHP 5.5 MySQL

  1. Setup environment
  2. Detect an invalid patch URL
  3. Detect invalid repository information
  4. Detect invalid patch format
  5. Detect a non-applicable patch
  6. Detect invalid PHP syntax
  7. Detect a Drupal installation failure
  8. Detect a test run failure
  9. Detect a failing test
    Review the test failures below then if necessary run them locally until the problem has been fixed.
  10. Complete test suite with all tests passing
435 pass(es), 1 fail(s), and 1 exception(s)

Non-pass

Test namePassFailException
ExpandDrupal\flag_bookmark\Tests\FlagBookmarkUITest011
MessageGroupFilenameLineFunctionStatus
The test did not complete due to a fatal error.Completion checkFlagBookmarkUITest.php47Drupal\flag_bookmark\Tests\FlagBookmarkUITest->testUI()
Drupal\Core\Config\Schema\SchemaIncompleteException: Schema errors for flag.flag.bookmark with the following errors: flag.flag.bookmark:flagTypeConfig.show_in_links.rss variable type is integer but applied schema class is Drupal\Core\TypedData\Plugin\DataType\StringData, flag.flag.bookmark:flagTypeConfig.show_in_links.search_index variable type is integer but applied schema class is Drupal\Core\TypedData\Plugin\DataType\StringData, flag.flag.bookmark:flagTypeConfig.show_in_links.search_result variable type is integer but applied schema class is Drupal\Core\TypedData\Plugin\DataType\StringData in Drupal\Core\Config\Testing\ConfigSchemaChecker->onConfigSave() (line 98 of /var/lib/drupaltestbot/sites/default/files/checkout/core/lib/Drupal/Core/Config/Testing/ConfigSchemaChecker.php). Drupal\Core\Config\Testing\ConfigSchemaChecker->onConfigSave(Object, 'config.save', Object) Drupal\Component\EventDispatcher\ContainerAwareEventDispatcher->dispatch('config.save', Object) Drupal\Core\Config\Config->save(1) Drupal\Core\Config\Entity\ConfigEntityStorage->doSave('bookmark', Object) Drupal\Core\Entity\EntityStorageBase->save(Object) Drupal\Core\Config\Entity\ConfigEntityStorage->save(Object) Drupal\Core\Entity\Entity->save() Drupal\Core\Config\Entity\ConfigEntityBase->save() Drupal\Core\Config\ConfigInstaller->createConfiguration('', Array) Drupal\Core\Config\ConfigInstaller->installDefaultConfig('module', 'flag_bookmark') Drupal\Core\ProxyClass\Config\ConfigInstaller->installDefaultConfig('module', 'flag_bookmark') Drupal\Core\Extension\ModuleInstaller->install(Array, 1) Drupal\Core\ProxyClass\Extension\ModuleInstaller->install(Array, 1) Drupal\simpletest\WebTestBase->installModulesFromClassProperty(Object) Drupal\simpletest\WebTestBase->setUp() Drupal\flag_bookmark\Tests\FlagBookmarkUITest->setUp() Drupal\simpletest\TestBase->run(Array) simpletest_script_run_one_test('1', 'Drupal\flag_bookmark\Tests\FlagBookmarkUITest') Uncaught exceptionConfigSchemaChecker.php98Drupal\Core\Config\Testing\ConfigSchemaChecker->onConfigSave()

All

Test namePassFailException
LeafDrupal\flag\Tests\FlagConfirmFormTest5900
LeafDrupal\flag\Tests\FlagCountsTest1000
LeafDrupal\flag\Tests\FlagEnableDisableTest5100
LeafDrupal\flag\Tests\FlagFieldEntryTest7700
LeafDrupal\flag\Tests\FlagResetTest1700
LeafDrupal\flag\Tests\FlagServiceTest1100
LeafDrupal\flag\Tests\FlagSimpleTest21000
ExpandDrupal\flag_bookmark\Tests\FlagBookmarkUITest011
MessageGroupFilenameLineFunctionStatus
The test did not complete due to a fatal error.Completion checkFlagBookmarkUITest.php47Drupal\flag_bookmark\Tests\FlagBookmarkUITest->testUI()
Drupal\Core\Config\Schema\SchemaIncompleteException: Schema errors for flag.flag.bookmark with the following errors: flag.flag.bookmark:flagTypeConfig.show_in_links.rss variable type is integer but applied schema class is Drupal\Core\TypedData\Plugin\DataType\StringData, flag.flag.bookmark:flagTypeConfig.show_in_links.search_index variable type is integer but applied schema class is Drupal\Core\TypedData\Plugin\DataType\StringData, flag.flag.bookmark:flagTypeConfig.show_in_links.search_result variable type is integer but applied schema class is Drupal\Core\TypedData\Plugin\DataType\StringData in Drupal\Core\Config\Testing\ConfigSchemaChecker->onConfigSave() (line 98 of /var/lib/drupaltestbot/sites/default/files/checkout/core/lib/Drupal/Core/Config/Testing/ConfigSchemaChecker.php). Drupal\Core\Config\Testing\ConfigSchemaChecker->onConfigSave(Object, 'config.save', Object) Drupal\Component\EventDispatcher\ContainerAwareEventDispatcher->dispatch('config.save', Object) Drupal\Core\Config\Config->save(1) Drupal\Core\Config\Entity\ConfigEntityStorage->doSave('bookmark', Object) Drupal\Core\Entity\EntityStorageBase->save(Object) Drupal\Core\Config\Entity\ConfigEntityStorage->save(Object) Drupal\Core\Entity\Entity->save() Drupal\Core\Config\Entity\ConfigEntityBase->save() Drupal\Core\Config\ConfigInstaller->createConfiguration('', Array) Drupal\Core\Config\ConfigInstaller->installDefaultConfig('module', 'flag_bookmark') Drupal\Core\ProxyClass\Config\ConfigInstaller->installDefaultConfig('module', 'flag_bookmark') Drupal\Core\Extension\ModuleInstaller->install(Array, 1) Drupal\Core\ProxyClass\Extension\ModuleInstaller->install(Array, 1) Drupal\simpletest\WebTestBase->installModulesFromClassProperty(Object) Drupal\simpletest\WebTestBase->setUp() Drupal\flag_bookmark\Tests\FlagBookmarkUITest->setUp() Drupal\simpletest\TestBase->run(Array) simpletest_script_run_one_test('1', 'Drupal\flag_bookmark\Tests\FlagBookmarkUITest') Uncaught exceptionConfigSchemaChecker.php98Drupal\Core\Config\Testing\ConfigSchemaChecker->onConfigSave()