2556351-4.patch

Test status
StatusResult
Last receivedMon, 08/24/2015 - 21:25:34
Last requestedMon, 08/24/2015 - 21:26:01
Last testedMon, 08/24/2015 - 21:26:34
Test count1
Environment status
PHP 5.5 MySQLfail
File information
File2556351-4.patch
BranchToken - 8.x-1.x
LinkIssue Link
SummaryFAILED: [[SimpleTest]]: [PHP 5.5 MySQL] 332 pass(es), 0 fail(s), and 1 exception(s).
Details

PHP 5.5 MySQL

  1. Setup environment
  2. Detect an invalid patch URL
  3. Detect invalid repository information
  4. Detect invalid patch format
  5. Detect a non-applicable patch
  6. Detect invalid PHP syntax
  7. Detect a Drupal installation failure
  8. Detect a test run failure
  9. Detect a failing test
    Review the test failures below then if necessary run them locally until the problem has been fixed.
  10. Complete test suite with all tests passing
332 pass(es), 0 fail(s), and 1 exception(s)

Non-pass

Test namePassFailException
ExpandDrupal\token\Tests\TokenCommentTest701
MessageGroupFilenameLineFunctionStatus
Drupal\Core\Entity\EntityStorageException: SQLSTATE[42S02]: Base table or view not found: 1146 Table 'drupaltestbotmysql.simpletest195687comment_entity_statistics' doesn't exist: SELECT ces.* FROM {comment_entity_statistics} ces WHERE (ces.entity_id IN (:db_condition_placeholder_0)) AND (ces.entity_type = :db_condition_placeholder_1) ; Array ( [:db_condition_placeholder_0] => 1 [:db_condition_placeholder_1] => node ) in Drupal\Core\Entity\Sql\SqlContentEntityStorage->save() (line 755 of /var/lib/drupaltestbot/sites/default/files/checkout/core/lib/Drupal/Core/Entity/Sql/SqlContentEntityStorage.php). Drupal\Core\Entity\Sql\SqlContentEntityStorage->save(Object) Drupal\Core\Entity\Entity->save() Drupal\token\Tests\TokenCommentTest->testCommentTokens() Drupal\simpletest\TestBase->run(Array) simpletest_script_run_one_test('2', 'Drupal\token\Tests\TokenCommentTest') Uncaught exceptionSqlContentEntityStorage.php755Drupal\Core\Entity\Sql\SqlContentEntityStorage->save()

All

Test namePassFailException
LeafDrupal\token\Tests\TokenArrayTest3100
LeafDrupal\token\Tests\TokenBlockTest1800
ExpandDrupal\token\Tests\TokenCommentTest701
MessageGroupFilenameLineFunctionStatus
Drupal\Core\Entity\EntityStorageException: SQLSTATE[42S02]: Base table or view not found: 1146 Table 'drupaltestbotmysql.simpletest195687comment_entity_statistics' doesn't exist: SELECT ces.* FROM {comment_entity_statistics} ces WHERE (ces.entity_id IN (:db_condition_placeholder_0)) AND (ces.entity_type = :db_condition_placeholder_1) ; Array ( [:db_condition_placeholder_0] => 1 [:db_condition_placeholder_1] => node ) in Drupal\Core\Entity\Sql\SqlContentEntityStorage->save() (line 755 of /var/lib/drupaltestbot/sites/default/files/checkout/core/lib/Drupal/Core/Entity/Sql/SqlContentEntityStorage.php). Drupal\Core\Entity\Sql\SqlContentEntityStorage->save(Object) Drupal\Core\Entity\Entity->save() Drupal\token\Tests\TokenCommentTest->testCommentTokens() Drupal\simpletest\TestBase->run(Array) simpletest_script_run_one_test('2', 'Drupal\token\Tests\TokenCommentTest') Uncaught exceptionSqlContentEntityStorage.php755Drupal\Core\Entity\Sql\SqlContentEntityStorage->save()
LeafDrupal\token\Tests\TokenCurrentPageTest3800
LeafDrupal\token\Tests\TokenDateTest600
LeafDrupal\token\Tests\TokenEntityTest3200
LeafDrupal\token\Tests\TokenFileTest1000
LeafDrupal\token\Tests\TokenMenuTest5600
LeafDrupal\token\Tests\TokenNodeTest3300
LeafDrupal\token\Tests\TokenRandomTest1700
LeafDrupal\token\Tests\TokenTaxonomyTest3600
LeafDrupal\token\Tests\TokenUnitTest500
LeafDrupal\token\Tests\TokenURLTest1600
LeafDrupal\token\Tests\TokenUserTest2700