2556425-7.patch

Test status
StatusResult
Last receivedMon, 08/24/2015 - 13:24:59
Last requestedMon, 08/24/2015 - 13:25:01
Last testedMon, 08/24/2015 - 13:25:29
Test count1
Environment status
PHP 5.5 MySQLfail
File information
File2556425-7.patch
BranchToken Conditions - 8.x-1.x
LinkIssue Link
SummaryFAILED: [[SimpleTest]]: [PHP 5.5 MySQL] 19 pass(es), 4 fail(s), and 2 exception(s).
Details

PHP 5.5 MySQL

  1. Setup environment
  2. Detect an invalid patch URL
  3. Detect invalid repository information
  4. Detect invalid patch format
  5. Detect a non-applicable patch
  6. Detect invalid PHP syntax
  7. Detect a Drupal installation failure
  8. Detect a test run failure
  9. Detect a failing test
    Review the test failures below then if necessary run them locally until the problem has been fixed.
  10. Complete test suite with all tests passing
19 pass(es), 4 fail(s), and 2 exception(s)

Non-pass

Test namePassFailException
ExpandDrupal\token_conditions\Tests\TokenMatcherTest1942
MessageGroupFilenameLineFunctionStatus
simplexml_import_dom(): Invalid Nodetype to importsimplexml_import_dom(Object) Drupal\simpletest\WebTestBase->parse() Drupal\simpletest\WebTestBase->xpath('//div[@id = :id]', Array) Drupal\simpletest\WebTestBase->findBlockInstance(Object) Drupal\simpletest\WebTestBase->assertBlockAppears(Object) Drupal\token_conditions\Tests\TokenMatcherTest->testTokenMatcherNodeTitle() Drupal\simpletest\TestBase->run(Array) simpletest_script_run_one_test('1', 'Drupal\token_conditions\Tests\TokenMatcherTest') WarningAssertContentTrait.php138Drupal\simpletest\WebTestBase->parse()
Ensure the block z77pl9hl appears on the pageOtherTokenMatcherTest.php83Drupal\token_conditions\Tests\TokenMatcherTest->testTokenMatcherNodeTitle()
simplexml_import_dom(): Invalid Nodetype to importsimplexml_import_dom(Object) Drupal\simpletest\WebTestBase->parse() Drupal\simpletest\WebTestBase->xpath('//div[@id = :id]', Array) Drupal\simpletest\WebTestBase->findBlockInstance(Object) Drupal\simpletest\WebTestBase->assertNoBlockAppears(Object) Drupal\token_conditions\Tests\TokenMatcherTest->testTokenMatcherNodeTitle() Drupal\simpletest\TestBase->run(Array) simpletest_script_run_one_test('1', 'Drupal\token_conditions\Tests\TokenMatcherTest') WarningAssertContentTrait.php138Drupal\simpletest\WebTestBase->parse()
[24-Aug-2015 23:25:27 Australia/Sydney] Uncaught PHP Exception Drupal\Core\Config\Schema\SchemaIncompleteException: "Schema errors for block.block.z77pl9hl with the following errors: block.block.z77pl9hl:visibility.token_matcher missing schema" at /var/lib/drupaltestbot/sites/default/files/checkout/core/lib/Drupal/Core/Config/Testing/ConfigSchemaChecker.php line 98 Fatal errorUnknown0Unknown
Call to a member function displaySubmitted() on a non-objectPHP Fatal errornode.module606Unknown
Call to a member function displaySubmitted() on a non-objectPHP Fatal errornode.module606Unknown

All

Test namePassFailException
ExpandDrupal\token_conditions\Tests\TokenMatcherTest1942
MessageGroupFilenameLineFunctionStatus
simplexml_import_dom(): Invalid Nodetype to importsimplexml_import_dom(Object) Drupal\simpletest\WebTestBase->parse() Drupal\simpletest\WebTestBase->xpath('//div[@id = :id]', Array) Drupal\simpletest\WebTestBase->findBlockInstance(Object) Drupal\simpletest\WebTestBase->assertBlockAppears(Object) Drupal\token_conditions\Tests\TokenMatcherTest->testTokenMatcherNodeTitle() Drupal\simpletest\TestBase->run(Array) simpletest_script_run_one_test('1', 'Drupal\token_conditions\Tests\TokenMatcherTest') WarningAssertContentTrait.php138Drupal\simpletest\WebTestBase->parse()
Ensure the block z77pl9hl appears on the pageOtherTokenMatcherTest.php83Drupal\token_conditions\Tests\TokenMatcherTest->testTokenMatcherNodeTitle()
simplexml_import_dom(): Invalid Nodetype to importsimplexml_import_dom(Object) Drupal\simpletest\WebTestBase->parse() Drupal\simpletest\WebTestBase->xpath('//div[@id = :id]', Array) Drupal\simpletest\WebTestBase->findBlockInstance(Object) Drupal\simpletest\WebTestBase->assertNoBlockAppears(Object) Drupal\token_conditions\Tests\TokenMatcherTest->testTokenMatcherNodeTitle() Drupal\simpletest\TestBase->run(Array) simpletest_script_run_one_test('1', 'Drupal\token_conditions\Tests\TokenMatcherTest') WarningAssertContentTrait.php138Drupal\simpletest\WebTestBase->parse()
[24-Aug-2015 23:25:27 Australia/Sydney] Uncaught PHP Exception Drupal\Core\Config\Schema\SchemaIncompleteException: "Schema errors for block.block.z77pl9hl with the following errors: block.block.z77pl9hl:visibility.token_matcher missing schema" at /var/lib/drupaltestbot/sites/default/files/checkout/core/lib/Drupal/Core/Config/Testing/ConfigSchemaChecker.php line 98 Fatal errorUnknown0Unknown
Call to a member function displaySubmitted() on a non-objectPHP Fatal errornode.module606Unknown
Call to a member function displaySubmitted() on a non-objectPHP Fatal errornode.module606Unknown