2555155-2--query_serialization--tests-only.patch

Test status
StatusResult
Last receivedFri, 08/21/2015 - 06:58:00
Last requestedFri, 08/21/2015 - 06:58:01
Last testedFri, 08/21/2015 - 06:58:51
Test count1
Environment status
PHP 5.5 MySQLfail
File information
File2555155-2--query_serialization--tests-only.patch
BranchSearch API - 8.x-1.x
LinkIssue Link
SummaryFAILED: [[SimpleTest]]: [PHP 5.5 MySQL] 889 pass(es), 0 fail(s), and 1 exception(s).
Details

PHP 5.5 MySQL

  1. Setup environment
  2. Detect an invalid patch URL
  3. Detect invalid repository information
  4. Detect invalid patch format
  5. Detect a non-applicable patch
  6. Detect invalid PHP syntax
  7. Detect a Drupal installation failure
  8. Detect a test run failure
  9. Detect a failing test
    Review the test failures below then if necessary run them locally until the problem has been fixed.
  10. Complete test suite with all tests passing
889 pass(es), 0 fail(s), and 1 exception(s)

Non-pass

Test namePassFailException
ExpandDrupal\search_api\Tests\IntegrationTest8601
MessageGroupFilenameLineFunctionStatus
Drupal\search_api\SearchApiException: Cannot search on a disabled index. in Drupal\search_api\Entity\Index->query() (line 1182 of /var/lib/drupaltestbot/sites/default/files/checkout/sites/default/modules/search_api/src/Entity/Index.php). Drupal\search_api\Entity\Index->query() Drupal\search_api\Tests\IntegrationTest->createIndex() Drupal\search_api\Tests\IntegrationTest->testFramework() Drupal\simpletest\TestBase->run(Array) simpletest_script_run_one_test('6', 'Drupal\search_api\Tests\IntegrationTest') Uncaught exceptionIndex.php1182Drupal\search_api\Entity\Index->query()

All

Test namePassFailException
LeafDrupal\search_api\Tests\CustomDataTypesUnitTest1800
LeafDrupal\search_api\Tests\IndexStorageUnitTest500
ExpandDrupal\search_api\Tests\IntegrationTest8601
MessageGroupFilenameLineFunctionStatus
Drupal\search_api\SearchApiException: Cannot search on a disabled index. in Drupal\search_api\Entity\Index->query() (line 1182 of /var/lib/drupaltestbot/sites/default/files/checkout/sites/default/modules/search_api/src/Entity/Index.php). Drupal\search_api\Entity\Index->query() Drupal\search_api\Tests\IntegrationTest->createIndex() Drupal\search_api\Tests\IntegrationTest->testFramework() Drupal\simpletest\TestBase->run(Array) simpletest_script_run_one_test('6', 'Drupal\search_api\Tests\IntegrationTest') Uncaught exceptionIndex.php1182Drupal\search_api\Entity\Index->query()
LeafDrupal\search_api\Tests\LanguageIntegrationUnitTest3500
LeafDrupal\search_api\Tests\LocalActionsWebTest1500
LeafDrupal\search_api\Tests\OverviewPageTest12100
LeafDrupal\search_api\Tests\Processor\ContentAccessTest7200
LeafDrupal\search_api\Tests\Processor\ProcessorIntegrationTest7300
LeafDrupal\search_api\Tests\Processor\RenderedItemTest4200
LeafDrupal\search_api\Tests\ServerStorageUnitTest600
LeafDrupal\search_api\Tests\ServerTaskUnitTest5900
LeafDrupal\search_api\Tests\ViewsTest2800
LeafDrupal\search_api_db\Tests\BackendTest16600
LeafDrupal\search_api_db_defaults\Tests\IntegrationTest1800
LeafDrupal\Tests\search_api\Unit\Plugin\Processor\AddURLTest200
LeafDrupal\Tests\search_api\Unit\Plugin\Processor\AggregatedFieldTest900
LeafDrupal\Tests\search_api\Unit\Plugin\Processor\FieldsProcessorPluginBaseTest1300
LeafDrupal\Tests\search_api\Unit\Plugin\Processor\HighlightTest1300
LeafDrupal\Tests\search_api\Unit\Plugin\Processor\HtmlFilterTest2500
LeafDrupal\Tests\search_api\Unit\Plugin\Processor\IgnoreCaseTest400
LeafDrupal\Tests\search_api\Unit\Plugin\Processor\IgnoreCharacterTest3900
LeafDrupal\Tests\search_api\Unit\Plugin\Processor\LanguageTest200
LeafDrupal\Tests\search_api\Unit\Plugin\Processor\NodeStatusTest300
LeafDrupal\Tests\search_api\Unit\Plugin\Processor\RoleFilterTest200
LeafDrupal\Tests\search_api\Unit\Plugin\Processor\StopwordsTest800
LeafDrupal\Tests\search_api\Unit\Plugin\Processor\TokenizerTest2200
LeafDrupal\Tests\search_api\Unit\Plugin\Processor\TransliterationTest300