Safe_Markups_XSS_Filter-2553801-11.patch

Test status
StatusResult
Last receivedThu, 08/20/2015 - 21:56:54
Last requestedThu, 08/20/2015 - 21:57:02
Last testedThu, 08/20/2015 - 22:00:29
Test count1
Environment status
PHP 5.5 MySQLfail
File information
FileSafe_Markups_XSS_Filter-2553801-11.patch
BranchTranslation Management Tool - 8.x-1.x
LinkIssue Link
SummaryFAILED: [[SimpleTest]]: [PHP 5.5 MySQL] 2,545 pass(es), 0 fail(s), and 3 exception(s).
Details

PHP 5.5 MySQL

  1. Setup environment
  2. Detect an invalid patch URL
  3. Detect invalid repository information
  4. Detect invalid patch format
  5. Detect a non-applicable patch
  6. Detect invalid PHP syntax
  7. Detect a Drupal installation failure
  8. Detect a test run failure
  9. Detect a failing test
    Review the test failures below then if necessary run them locally until the problem has been fixed.
  10. Complete test suite with all tests passing
2,545 pass(es), 0 fail(s), and 3 exception(s)

Non-pass

Test namePassFailException
ExpandDrupal\tmgmt_content\Tests\ContentEntitySourceUnitTest14402
MessageGroupFilenameLineFunctionStatus
Drupal\Core\Entity\EntityStorageException: SQLSTATE[23000]: Integrity constraint violation: 1048 Column 'title' cannot be null: INSERT INTO {node_field_data} (nid, vid, type, langcode, title, uid, status, created, changed, promote, sticky, revision_translation_affected, default_langcode) VALUES (:db_insert_placeholder_0, :db_insert_placeholder_1, :db_insert_placeholder_2, :db_insert_placeholder_3, :db_insert_placeholder_4, :db_insert_placeholder_5, :db_insert_placeholder_6, :db_insert_placeholder_7, :db_insert_placeholder_8, :db_insert_placeholder_9, :db_insert_placeholder_10, :db_insert_placeholder_11, :db_insert_placeholder_12); Array ( [:db_insert_placeholder_0] => 2 [:db_insert_placeholder_1] => 2 [:db_insert_placeholder_2] => aejmuttz [:db_insert_placeholder_3] => und [:db_insert_placeholder_4] => [:db_insert_placeholder_5] => 1 [:db_insert_placeholder_6] => 1 [:db_insert_placeholder_7] => 1440107839 [:db_insert_placeholder_8] => 1440107839 [:db_insert_placeholder_9] => 1 [:db_insert_placeholder_10] => 0 [:db_insert_placeholder_11] => 1 [:db_insert_placeholder_12] => 1 ) in Drupal\Core\Entity\Sql\SqlContentEntityStorage->save() (line 755 of /var/lib/drupaltestbot/sites/default/files/checkout/core/lib/Drupal/Core/Entity/Sql/SqlContentEntityStorage.php). Drupal\Core\Entity\Sql\SqlContentEntityStorage->save(Object) Drupal\Core\Entity\Entity->save() Drupal\tmgmt_content\Tests\ContentEntitySourceUnitTest->testNode() Drupal\simpletest\TestBase->run(Array) simpletest_script_run_one_test('3', 'Drupal\tmgmt_content\Tests\ContentEntitySourceUnitTest') Uncaught exceptionSqlContentEntityStorage.php755Drupal\Core\Entity\Sql\SqlContentEntityStorage->save()
Drupal\Core\Entity\EntityStorageException: SQLSTATE[23000]: Integrity constraint violation: 1048 Column 'title' cannot be null: INSERT INTO {node_field_data} (nid, vid, type, langcode, title, uid, status, created, changed, promote, sticky, revision_translation_affected, default_langcode) VALUES (:db_insert_placeholder_0, :db_insert_placeholder_1, :db_insert_placeholder_2, :db_insert_placeholder_3, :db_insert_placeholder_4, :db_insert_placeholder_5, :db_insert_placeholder_6, :db_insert_placeholder_7, :db_insert_placeholder_8, :db_insert_placeholder_9, :db_insert_placeholder_10, :db_insert_placeholder_11, :db_insert_placeholder_12), (:db_insert_placeholder_13, :db_insert_placeholder_14, :db_insert_placeholder_15, :db_insert_placeholder_16, :db_insert_placeholder_17, :db_insert_placeholder_18, :db_insert_placeholder_19, :db_insert_placeholder_20, :db_insert_placeholder_21, :db_insert_placeholder_22, :db_insert_placeholder_23, :db_insert_placeholder_24, :db_insert_placeholder_25); Array ( [:db_insert_placeholder_0] => 1 [:db_insert_placeholder_1] => 1 [:db_insert_placeholder_2] => poh3fy4a [:db_insert_placeholder_3] => cs [:db_insert_placeholder_4] => [:db_insert_placeholder_5] => 1 [:db_insert_placeholder_6] => 1 [:db_insert_placeholder_7] => 1440107839 [:db_insert_placeholder_8] => 1440107839 [:db_insert_placeholder_9] => 1 [:db_insert_placeholder_10] => 0 [:db_insert_placeholder_11] => 1 [:db_insert_placeholder_12] => 1 [:db_insert_placeholder_13] => 1 [:db_insert_placeholder_14] => 1 [:db_insert_placeholder_15] => poh3fy4a [:db_insert_placeholder_16] => en [:db_insert_placeholder_17] => wMzkEoZX [:db_insert_placeholder_18] => 0 [:db_insert_placeholder_19] => 1 [:db_insert_placeholder_20] => 1440107839 [:db_insert_placeholder_21] => 1440107839 [:db_insert_placeholder_22] => 1 [:db_insert_placeholder_23] => 0 [:db_insert_placeholder_24] => 1 [:db_insert_placeholder_25] => 0 ) in Drupal\Core\Entity\Sql\SqlContentEntityStorage->save() (line 755 of /var/lib/drupaltestbot/sites/default/files/checkout/core/lib/Drupal/Core/Entity/Sql/SqlContentEntityStorage.php). Drupal\Core\Entity\Sql\SqlContentEntityStorage->save(Object) Drupal\Core\Entity\Entity->save() Drupal\tmgmt_content\Tests\ContentEntitySourceUnitTest->testRequestDataForSpecificLanguage() Drupal\simpletest\TestBase->run(Array) simpletest_script_run_one_test('3', 'Drupal\tmgmt_content\Tests\ContentEntitySourceUnitTest') Uncaught exceptionSqlContentEntityStorage.php755Drupal\Core\Entity\Sql\SqlContentEntityStorage->save()
ExpandDrupal\tmgmt_content\Tests\ContentEntitySuggestionsTest1001
MessageGroupFilenameLineFunctionStatus
Drupal\Core\Entity\EntityStorageException: SQLSTATE[23000]: Integrity constraint violation: 1048 Column 'title' cannot be null: INSERT INTO {node_field_data} (nid, vid, type, langcode, title, uid, status, created, changed, promote, sticky, revision_translation_affected, default_langcode, content_translation_source, content_translation_outdated) VALUES (:db_insert_placeholder_0, :db_insert_placeholder_1, :db_insert_placeholder_2, :db_insert_placeholder_3, :db_insert_placeholder_4, :db_insert_placeholder_5, :db_insert_placeholder_6, :db_insert_placeholder_7, :db_insert_placeholder_8, :db_insert_placeholder_9, :db_insert_placeholder_10, :db_insert_placeholder_11, :db_insert_placeholder_12, :db_insert_placeholder_13, :db_insert_placeholder_14); Array ( [:db_insert_placeholder_0] => 5 [:db_insert_placeholder_1] => 5 [:db_insert_placeholder_2] => edWvf48y [:db_insert_placeholder_3] => en [:db_insert_placeholder_4] => [:db_insert_placeholder_5] => 0 [:db_insert_placeholder_6] => 1 [:db_insert_placeholder_7] => 1440107839 [:db_insert_placeholder_8] => 1440107839 [:db_insert_placeholder_9] => 1 [:db_insert_placeholder_10] => 0 [:db_insert_placeholder_11] => 1 [:db_insert_placeholder_12] => 1 [:db_insert_placeholder_13] => und [:db_insert_placeholder_14] => 0 ) in Drupal\Core\Entity\Sql\SqlContentEntityStorage->save() (line 755 of /var/lib/drupaltestbot/sites/default/files/checkout/core/lib/Drupal/Core/Entity/Sql/SqlContentEntityStorage.php). Drupal\Core\Entity\Sql\SqlContentEntityStorage->save(Object) Drupal\Core\Entity\Entity->save() Drupal\tmgmt_content\Tests\ContentEntitySuggestionsTest->prepareTranslationSuggestions() Drupal\tmgmt_content\Tests\ContentEntitySuggestionsTest->testSuggestions() Drupal\simpletest\TestBase->run(Array) simpletest_script_run_one_test('2', 'Drupal\tmgmt_content\Tests\ContentEntitySuggestionsTest') Uncaught exceptionSqlContentEntityStorage.php755Drupal\Core\Entity\Sql\SqlContentEntityStorage->save()

All

Test namePassFailException
LeafDrupal\tmgmt\Tests\CrudTest19900
LeafDrupal\tmgmt\Tests\HelperTest4300
LeafDrupal\tmgmt\Tests\LocalTasksTests3100
LeafDrupal\tmgmt\Tests\PluginsTest5000
LeafDrupal\tmgmt\Tests\TMGMTCartTest5200
LeafDrupal\tmgmt\Tests\TMGMTUiTest63200
LeafDrupal\tmgmt\Tests\TranslatorTest8500
LeafDrupal\tmgmt\Tests\TranslatorUITest3000
LeafDrupal\tmgmt_config\Tests\ConfigSourceListTest24400
LeafDrupal\tmgmt_config\Tests\ConfigSourceUiTest23500
LeafDrupal\tmgmt_config\Tests\ConfigSourceUnitTest3900
LeafDrupal\tmgmt_content\Tests\ContentEntitySourceListTest15900
LeafDrupal\tmgmt_content\Tests\ContentEntitySourceUiTest27100
ExpandDrupal\tmgmt_content\Tests\ContentEntitySourceUnitTest14402
MessageGroupFilenameLineFunctionStatus
Drupal\Core\Entity\EntityStorageException: SQLSTATE[23000]: Integrity constraint violation: 1048 Column 'title' cannot be null: INSERT INTO {node_field_data} (nid, vid, type, langcode, title, uid, status, created, changed, promote, sticky, revision_translation_affected, default_langcode) VALUES (:db_insert_placeholder_0, :db_insert_placeholder_1, :db_insert_placeholder_2, :db_insert_placeholder_3, :db_insert_placeholder_4, :db_insert_placeholder_5, :db_insert_placeholder_6, :db_insert_placeholder_7, :db_insert_placeholder_8, :db_insert_placeholder_9, :db_insert_placeholder_10, :db_insert_placeholder_11, :db_insert_placeholder_12); Array ( [:db_insert_placeholder_0] => 2 [:db_insert_placeholder_1] => 2 [:db_insert_placeholder_2] => aejmuttz [:db_insert_placeholder_3] => und [:db_insert_placeholder_4] => [:db_insert_placeholder_5] => 1 [:db_insert_placeholder_6] => 1 [:db_insert_placeholder_7] => 1440107839 [:db_insert_placeholder_8] => 1440107839 [:db_insert_placeholder_9] => 1 [:db_insert_placeholder_10] => 0 [:db_insert_placeholder_11] => 1 [:db_insert_placeholder_12] => 1 ) in Drupal\Core\Entity\Sql\SqlContentEntityStorage->save() (line 755 of /var/lib/drupaltestbot/sites/default/files/checkout/core/lib/Drupal/Core/Entity/Sql/SqlContentEntityStorage.php). Drupal\Core\Entity\Sql\SqlContentEntityStorage->save(Object) Drupal\Core\Entity\Entity->save() Drupal\tmgmt_content\Tests\ContentEntitySourceUnitTest->testNode() Drupal\simpletest\TestBase->run(Array) simpletest_script_run_one_test('3', 'Drupal\tmgmt_content\Tests\ContentEntitySourceUnitTest') Uncaught exceptionSqlContentEntityStorage.php755Drupal\Core\Entity\Sql\SqlContentEntityStorage->save()
Drupal\Core\Entity\EntityStorageException: SQLSTATE[23000]: Integrity constraint violation: 1048 Column 'title' cannot be null: INSERT INTO {node_field_data} (nid, vid, type, langcode, title, uid, status, created, changed, promote, sticky, revision_translation_affected, default_langcode) VALUES (:db_insert_placeholder_0, :db_insert_placeholder_1, :db_insert_placeholder_2, :db_insert_placeholder_3, :db_insert_placeholder_4, :db_insert_placeholder_5, :db_insert_placeholder_6, :db_insert_placeholder_7, :db_insert_placeholder_8, :db_insert_placeholder_9, :db_insert_placeholder_10, :db_insert_placeholder_11, :db_insert_placeholder_12), (:db_insert_placeholder_13, :db_insert_placeholder_14, :db_insert_placeholder_15, :db_insert_placeholder_16, :db_insert_placeholder_17, :db_insert_placeholder_18, :db_insert_placeholder_19, :db_insert_placeholder_20, :db_insert_placeholder_21, :db_insert_placeholder_22, :db_insert_placeholder_23, :db_insert_placeholder_24, :db_insert_placeholder_25); Array ( [:db_insert_placeholder_0] => 1 [:db_insert_placeholder_1] => 1 [:db_insert_placeholder_2] => poh3fy4a [:db_insert_placeholder_3] => cs [:db_insert_placeholder_4] => [:db_insert_placeholder_5] => 1 [:db_insert_placeholder_6] => 1 [:db_insert_placeholder_7] => 1440107839 [:db_insert_placeholder_8] => 1440107839 [:db_insert_placeholder_9] => 1 [:db_insert_placeholder_10] => 0 [:db_insert_placeholder_11] => 1 [:db_insert_placeholder_12] => 1 [:db_insert_placeholder_13] => 1 [:db_insert_placeholder_14] => 1 [:db_insert_placeholder_15] => poh3fy4a [:db_insert_placeholder_16] => en [:db_insert_placeholder_17] => wMzkEoZX [:db_insert_placeholder_18] => 0 [:db_insert_placeholder_19] => 1 [:db_insert_placeholder_20] => 1440107839 [:db_insert_placeholder_21] => 1440107839 [:db_insert_placeholder_22] => 1 [:db_insert_placeholder_23] => 0 [:db_insert_placeholder_24] => 1 [:db_insert_placeholder_25] => 0 ) in Drupal\Core\Entity\Sql\SqlContentEntityStorage->save() (line 755 of /var/lib/drupaltestbot/sites/default/files/checkout/core/lib/Drupal/Core/Entity/Sql/SqlContentEntityStorage.php). Drupal\Core\Entity\Sql\SqlContentEntityStorage->save(Object) Drupal\Core\Entity\Entity->save() Drupal\tmgmt_content\Tests\ContentEntitySourceUnitTest->testRequestDataForSpecificLanguage() Drupal\simpletest\TestBase->run(Array) simpletest_script_run_one_test('3', 'Drupal\tmgmt_content\Tests\ContentEntitySourceUnitTest') Uncaught exceptionSqlContentEntityStorage.php755Drupal\Core\Entity\Sql\SqlContentEntityStorage->save()
ExpandDrupal\tmgmt_content\Tests\ContentEntitySuggestionsTest1001
MessageGroupFilenameLineFunctionStatus
Drupal\Core\Entity\EntityStorageException: SQLSTATE[23000]: Integrity constraint violation: 1048 Column 'title' cannot be null: INSERT INTO {node_field_data} (nid, vid, type, langcode, title, uid, status, created, changed, promote, sticky, revision_translation_affected, default_langcode, content_translation_source, content_translation_outdated) VALUES (:db_insert_placeholder_0, :db_insert_placeholder_1, :db_insert_placeholder_2, :db_insert_placeholder_3, :db_insert_placeholder_4, :db_insert_placeholder_5, :db_insert_placeholder_6, :db_insert_placeholder_7, :db_insert_placeholder_8, :db_insert_placeholder_9, :db_insert_placeholder_10, :db_insert_placeholder_11, :db_insert_placeholder_12, :db_insert_placeholder_13, :db_insert_placeholder_14); Array ( [:db_insert_placeholder_0] => 5 [:db_insert_placeholder_1] => 5 [:db_insert_placeholder_2] => edWvf48y [:db_insert_placeholder_3] => en [:db_insert_placeholder_4] => [:db_insert_placeholder_5] => 0 [:db_insert_placeholder_6] => 1 [:db_insert_placeholder_7] => 1440107839 [:db_insert_placeholder_8] => 1440107839 [:db_insert_placeholder_9] => 1 [:db_insert_placeholder_10] => 0 [:db_insert_placeholder_11] => 1 [:db_insert_placeholder_12] => 1 [:db_insert_placeholder_13] => und [:db_insert_placeholder_14] => 0 ) in Drupal\Core\Entity\Sql\SqlContentEntityStorage->save() (line 755 of /var/lib/drupaltestbot/sites/default/files/checkout/core/lib/Drupal/Core/Entity/Sql/SqlContentEntityStorage.php). Drupal\Core\Entity\Sql\SqlContentEntityStorage->save(Object) Drupal\Core\Entity\Entity->save() Drupal\tmgmt_content\Tests\ContentEntitySuggestionsTest->prepareTranslationSuggestions() Drupal\tmgmt_content\Tests\ContentEntitySuggestionsTest->testSuggestions() Drupal\simpletest\TestBase->run(Array) simpletest_script_run_one_test('2', 'Drupal\tmgmt_content\Tests\ContentEntitySuggestionsTest') Uncaught exceptionSqlContentEntityStorage.php755Drupal\Core\Entity\Sql\SqlContentEntityStorage->save()
LeafDrupal\tmgmt_demo\Tests\TMGMTDemoTest4800
LeafDrupal\tmgmt_file\Tests\FileTranslatorTest16000
LeafDrupal\tmgmt_locale\Tests\LocaleSourceTest6300
LeafDrupal\tmgmt_locale\Tests\LocaleSourceUiTest5000