981654-5.patch

Test status
StatusResult
Last receivedThu, 12/09/2010 - 14:20:45
Last requestedThu, 12/09/2010 - 14:21:01
Last testedThu, 12/09/2010 - 15:05:29
Test count1
Environment status
MySQLfail
File information
File981654-5.patch
BranchDrupal core - 7.x
LinkIssue Link
SummaryFAILED: [[SimpleTest]]: [MySQL] 28,333 pass(es), 1,314 fail(s), and 165 exception(s).
Details

MySQL

  1. Setup environment
  2. Detect an invalid patch URL
  3. Detect invalid repository information
  4. Detect invalid patch format
  5. Detect a non-applicable patch
  6. Detect invalid PHP syntax
  7. Detect a Drupal installation failure
  8. Detect a test run failure
  9. Detect a failing test
    Review the test failures below then if necessary run them locally until the problem has been fixed.
  10. Complete test suite with all tests passing
28,333 pass(es), 1,314 fail(s), and 165 exception(s)

Non-pass

Test namePassFailException
ExpandBlock functionality (BlockTestCase) [Block]31122
MessageGroupFilenameLineFunctionStatus
strpos(): Empty delimiterWarningdrupal_web_test_case.php2585DrupalWebTestCase->assertRaw()
Add block link is present on block overview page for default theme.Otherblock.test49BlockTestCase->testCustomBlock()
strpos(): Empty delimiterWarningdrupal_web_test_case.php2585DrupalWebTestCase->assertRaw()
Add block link is present on block overview page for non-default theme.Otherblock.test51BlockTestCase->testCustomBlock()
ExpandBlog functionality (BlogTestCase) [Blog]23744
MessageGroupFilenameLineFunctionStatus
strpos(): Empty delimiterWarningdrupal_web_test_case.php2585DrupalWebTestCase->assertRaw()
Breadcrumbs were displayedOtherblog.test149BlogTestCase->verifyBlogs()
strpos(): Empty delimiterWarningdrupal_web_test_case.php2585DrupalWebTestCase->assertRaw()
Breadcrumbs were displayedOtherblog.test149BlogTestCase->verifyBlogs()
strpos(): Empty delimiterWarningdrupal_web_test_case.php2585DrupalWebTestCase->assertRaw()
Breadcrumbs were displayedOtherblog.test149BlogTestCase->verifyBlogs()
strpos(): Empty delimiterWarningdrupal_web_test_case.php2585DrupalWebTestCase->assertRaw()
Breadcrumbs were displayedOtherblog.test149BlogTestCase->verifyBlogs()
ExpandBook functionality (BookTestCase) [Book]3281818
MessageGroupFilenameLineFunctionStatus
strpos(): Empty delimiterWarningdrupal_web_test_case.php2585DrupalWebTestCase->assertRaw()
Next page link found.Otherbook.test141BookTestCase->checkBookNode()
strpos(): Empty delimiterWarningdrupal_web_test_case.php2585DrupalWebTestCase->assertRaw()
Previous page link found.Otherbook.test133BookTestCase->checkBookNode()
strpos(): Empty delimiterWarningdrupal_web_test_case.php2585DrupalWebTestCase->assertRaw()
Up page link found.Otherbook.test137BookTestCase->checkBookNode()
strpos(): Empty delimiterWarningdrupal_web_test_case.php2585DrupalWebTestCase->assertRaw()
Next page link found.Otherbook.test141BookTestCase->checkBookNode()
strpos(): Empty delimiterWarningdrupal_web_test_case.php2585DrupalWebTestCase->assertRaw()
Previous page link found.Otherbook.test133BookTestCase->checkBookNode()
strpos(): Empty delimiterWarningdrupal_web_test_case.php2585DrupalWebTestCase->assertRaw()
Up page link found.Otherbook.test137BookTestCase->checkBookNode()
strpos(): Empty delimiterWarningdrupal_web_test_case.php2585DrupalWebTestCase->assertRaw()
Next page link found.Otherbook.test141BookTestCase->checkBookNode()
strpos(): Empty delimiterWarningdrupal_web_test_case.php2585DrupalWebTestCase->assertRaw()
Previous page link found.Otherbook.test133BookTestCase->checkBookNode()
strpos(): Empty delimiterWarningdrupal_web_test_case.php2585DrupalWebTestCase->assertRaw()
Up page link found.Otherbook.test137BookTestCase->checkBookNode()
strpos(): Empty delimiterWarningdrupal_web_test_case.php2585DrupalWebTestCase->assertRaw()
Next page link found.Otherbook.test141BookTestCase->checkBookNode()
strpos(): Empty delimiterWarningdrupal_web_test_case.php2585DrupalWebTestCase->assertRaw()
Previous page link found.Otherbook.test133BookTestCase->checkBookNode()
strpos(): Empty delimiterWarningdrupal_web_test_case.php2585DrupalWebTestCase->assertRaw()
Up page link found.Otherbook.test137BookTestCase->checkBookNode()
strpos(): Empty delimiterWarningdrupal_web_test_case.php2585DrupalWebTestCase->assertRaw()
Next page link found.Otherbook.test141BookTestCase->checkBookNode()
strpos(): Empty delimiterWarningdrupal_web_test_case.php2585DrupalWebTestCase->assertRaw()
Previous page link found.Otherbook.test133BookTestCase->checkBookNode()
strpos(): Empty delimiterWarningdrupal_web_test_case.php2585DrupalWebTestCase->assertRaw()
Up page link found.Otherbook.test137BookTestCase->checkBookNode()
strpos(): Empty delimiterWarningdrupal_web_test_case.php2585DrupalWebTestCase->assertRaw()
Next page link found.Otherbook.test141BookTestCase->checkBookNode()
strpos(): Empty delimiterWarningdrupal_web_test_case.php2585DrupalWebTestCase->assertRaw()
Previous page link found.Otherbook.test133BookTestCase->checkBookNode()
strpos(): Empty delimiterWarningdrupal_web_test_case.php2585DrupalWebTestCase->assertRaw()
Up page link found.Otherbook.test137BookTestCase->checkBookNode()
ExpandCascading stylesheets (CascadingStylesheetsTestCase) [System]1780
MessageGroupFilenameLineFunctionStatus
Rendered CSS includes the added stylesheet.Othercommon.test637CascadingStylesheetsTestCase->testRenderFile()
Rendering an external CSS file.Othercommon.test649CascadingStylesheetsTestCase->testRenderExternal()
Rendering preprocessed inline CSS adds it to the page.Othercommon.test660CascadingStylesheetsTestCase->testRenderInlinePreprocess()
Rendering non-preprocessed inline CSS adds it to the page.Othercommon.test670CascadingStylesheetsTestCase->testRenderInlineNoPreprocess()
The CSS files are in the expected order.Othercommon.test733CascadingStylesheetsTestCase->testRenderOrder()
The overriding CSS file is output.Othercommon.test748CascadingStylesheetsTestCase->testRenderOverride()
The overriding CSS file is output.Othercommon.test756CascadingStylesheetsTestCase->testRenderOverride()
CSS is alterable as right to left overrides are added.Othercommon.test772CascadingStylesheetsTestCase->testAlter()
Expanddrupal_add_feed() tests (DrupalAddFeedTestCase) [System]060
MessageGroupFilenameLineFunctionStatus
Found correct feed header for path without titleOthercommon.test2374DrupalAddFeedTestCase->testBasicFeedAddNoTitle()
Found correct feed header for external url without titleOthercommon.test2374DrupalAddFeedTestCase->testBasicFeedAddNoTitle()
Found correct feed header for local url without titleOthercommon.test2374DrupalAddFeedTestCase->testBasicFeedAddNoTitle()
Found correct feed header for path with titleOthercommon.test2374DrupalAddFeedTestCase->testBasicFeedAddNoTitle()
Found correct feed header for external url with titleOthercommon.test2374DrupalAddFeedTestCase->testBasicFeedAddNoTitle()
Found correct feed header for local url with titleOthercommon.test2374DrupalAddFeedTestCase->testBasicFeedAddNoTitle()
Expanddrupal_render() (DrupalRenderTestCase) [System]182813
MessageGroupFilenameLineFunctionStatus
Defaults workOthercommon.test1512DrupalRenderTestCase->testDrupalRenderThemeArguments()
Passing arguments to theme functions worksOthercommon.test1519DrupalRenderTestCase->testDrupalRenderThemeArguments()
simplexml_import_dom(): Invalid Nodetype to importWarningdrupal_web_test_case.php1607DrupalWebTestCase->parse()
Parsed page successfully.Browsercommon.test1531DrupalRenderTestCase->testDrupalRenderFormElements()
#type 'button' was properly rendered.Othercommon.test1531DrupalRenderTestCase->testDrupalRenderFormElements()
simplexml_import_dom(): Invalid Nodetype to importWarningdrupal_web_test_case.php1607DrupalWebTestCase->parse()
Parsed page successfully.Browsercommon.test1538DrupalRenderTestCase->testDrupalRenderFormElements()
#type 'textfield' was properly rendered.Othercommon.test1538DrupalRenderTestCase->testDrupalRenderFormElements()
simplexml_import_dom(): Invalid Nodetype to importWarningdrupal_web_test_case.php1607DrupalWebTestCase->parse()
Parsed page successfully.Browsercommon.test1544DrupalRenderTestCase->testDrupalRenderFormElements()
#type 'password' was properly rendered.Othercommon.test1544DrupalRenderTestCase->testDrupalRenderFormElements()
simplexml_import_dom(): Invalid Nodetype to importWarningdrupal_web_test_case.php1607DrupalWebTestCase->parse()
Parsed page successfully.Browsercommon.test1551DrupalRenderTestCase->testDrupalRenderFormElements()
#type 'textarea' was properly rendered.Othercommon.test1551DrupalRenderTestCase->testDrupalRenderFormElements()
simplexml_import_dom(): Invalid Nodetype to importWarningdrupal_web_test_case.php1607DrupalWebTestCase->parse()
Parsed page successfully.Browsercommon.test1558DrupalRenderTestCase->testDrupalRenderFormElements()
#type 'radio' was properly rendered.Othercommon.test1558DrupalRenderTestCase->testDrupalRenderFormElements()
simplexml_import_dom(): Invalid Nodetype to importWarningdrupal_web_test_case.php1607DrupalWebTestCase->parse()
Parsed page successfully.Browsercommon.test1564DrupalRenderTestCase->testDrupalRenderFormElements()
#type 'checkbox' was properly rendered.Othercommon.test1564DrupalRenderTestCase->testDrupalRenderFormElements()
simplexml_import_dom(): Invalid Nodetype to importWarningdrupal_web_test_case.php1607DrupalWebTestCase->parse()
Parsed page successfully.Browsercommon.test1574DrupalRenderTestCase->testDrupalRenderFormElements()
#type 'select' was properly rendered.Othercommon.test1574DrupalRenderTestCase->testDrupalRenderFormElements()
simplexml_import_dom(): Invalid Nodetype to importWarningdrupal_web_test_case.php1607DrupalWebTestCase->parse()
Parsed page successfully.Browsercommon.test1580DrupalRenderTestCase->testDrupalRenderFormElements()
#type 'file' was properly rendered.Othercommon.test1580DrupalRenderTestCase->testDrupalRenderFormElements()
simplexml_import_dom(): Invalid Nodetype to importWarningdrupal_web_test_case.php1607DrupalWebTestCase->parse()
Parsed page successfully.Browsercommon.test1591DrupalRenderTestCase->testDrupalRenderFormElements()
#type 'item' was properly rendered.Othercommon.test1591DrupalRenderTestCase->testDrupalRenderFormElements()
simplexml_import_dom(): Invalid Nodetype to importWarningdrupal_web_test_case.php1607DrupalWebTestCase->parse()
Parsed page successfully.Browsercommon.test1598DrupalRenderTestCase->testDrupalRenderFormElements()
#type 'hidden' was properly rendered.Othercommon.test1598DrupalRenderTestCase->testDrupalRenderFormElements()
simplexml_import_dom(): Invalid Nodetype to importWarningdrupal_web_test_case.php1607DrupalWebTestCase->parse()
Parsed page successfully.Browsercommon.test1611DrupalRenderTestCase->testDrupalRenderFormElements()
#type 'link' was properly rendered.Othercommon.test1611DrupalRenderTestCase->testDrupalRenderFormElements()
simplexml_import_dom(): Invalid Nodetype to importWarningdrupal_web_test_case.php1607DrupalWebTestCase->parse()
Parsed page successfully.Browsercommon.test1619DrupalRenderTestCase->testDrupalRenderFormElements()
#type 'fieldset' was properly rendered.Othercommon.test1619DrupalRenderTestCase->testDrupalRenderFormElements()
simplexml_import_dom(): Invalid Nodetype to importWarningdrupal_web_test_case.php1607DrupalWebTestCase->parse()
Parsed page successfully.Browsercommon.test1629DrupalRenderTestCase->testDrupalRenderFormElements()
#type 'fieldset' was properly rendered.Othercommon.test1629DrupalRenderTestCase->testDrupalRenderFormElements()
ExpandField attach tests (other) (FieldAttachOtherTestCase) [Field API]4310
MessageGroupFilenameLineFunctionStatus
Label is displayed.Otherfield.test669FieldAttachOtherTestCase->testFieldAttachView()
ExpandField Display API tests (FieldDisplayAPITestCase) [Field API]4130
MessageGroupFilenameLineFunctionStatus
Label was displayed.Otherfield.test1739FieldDisplayAPITestCase->testFieldViewField()
Label was displayed.Otherfield.test1787FieldDisplayAPITestCase->testFieldViewField()
Label was displayed.Otherfield.test1797FieldDisplayAPITestCase->testFieldViewField()
ExpandFile field display tests (FileFieldDisplayTestCase) [File]1912
MessageGroupFilenameLineFunctionStatus
strpos(): Empty delimiterWarningdrupal_web_test_case.php2585DrupalWebTestCase->assertRaw()
Default formatter displaying correctly on full node view.Otherfile.test719FileFieldDisplayTestCase->testNodeDisplay()
strpos(): Empty delimiterWarningdrupal_web_test_case.php2605DrupalWebTestCase->assertNoRaw()
ExpandForm API checkbox (FormCheckboxTestCase) [Form API]82140
MessageGroupFilenameLineFunctionStatus
#default_value is true #return_value is '0'.Otherform.test1480FormCheckboxTestCase->testFormCheckbox()
#default_value is true #return_value is ''.Otherform.test1480FormCheckboxTestCase->testFormCheckbox()
#default_value is true #return_value is 1.Otherform.test1480FormCheckboxTestCase->testFormCheckbox()
#default_value is true #return_value is '1'.Otherform.test1480FormCheckboxTestCase->testFormCheckbox()
#default_value is true #return_value is 'foobar'.Otherform.test1480FormCheckboxTestCase->testFormCheckbox()
#default_value is true #return_value is '1foobar'.Otherform.test1480FormCheckboxTestCase->testFormCheckbox()
#default_value is '0' #return_value is '0'.Otherform.test1480FormCheckboxTestCase->testFormCheckbox()
#default_value is '' #return_value is ''.Otherform.test1480FormCheckboxTestCase->testFormCheckbox()
#default_value is 1 #return_value is 1.Otherform.test1480FormCheckboxTestCase->testFormCheckbox()
#default_value is 1 #return_value is '1'.Otherform.test1480FormCheckboxTestCase->testFormCheckbox()
#default_value is '1' #return_value is 1.Otherform.test1480FormCheckboxTestCase->testFormCheckbox()
#default_value is '1' #return_value is '1'.Otherform.test1480FormCheckboxTestCase->testFormCheckbox()
#default_value is 'foobar' #return_value is 'foobar'.Otherform.test1480FormCheckboxTestCase->testFormCheckbox()
#default_value is '1foobar' #return_value is '1foobar'.Otherform.test1480FormCheckboxTestCase->testFormCheckbox()
ExpandForum functionality (ForumTestCase) [Forum]5921616
MessageGroupFilenameLineFunctionStatus
strpos(): Empty delimiterWarningdrupal_web_test_case.php2585DrupalWebTestCase->assertRaw()
Breadcrumbs were displayedOtherforum.test486ForumTestCase->verifyForumView()
strpos(): Empty delimiterWarningdrupal_web_test_case.php2585DrupalWebTestCase->assertRaw()
Breadcrumbs were displayedOtherforum.test486ForumTestCase->verifyForumView()
strpos(): Empty delimiterWarningdrupal_web_test_case.php2585DrupalWebTestCase->assertRaw()
Breadcrumbs were displayedOtherforum.test486ForumTestCase->verifyForumView()
strpos(): Empty delimiterWarningdrupal_web_test_case.php2585DrupalWebTestCase->assertRaw()
Breadcrumbs were displayedOtherforum.test431ForumTestCase->verifyForums()
strpos(): Empty delimiterWarningdrupal_web_test_case.php2585DrupalWebTestCase->assertRaw()
Breadcrumbs were displayedOtherforum.test486ForumTestCase->verifyForumView()
strpos(): Empty delimiterWarningdrupal_web_test_case.php2585DrupalWebTestCase->assertRaw()
Breadcrumbs were displayedOtherforum.test486ForumTestCase->verifyForumView()
strpos(): Empty delimiterWarningdrupal_web_test_case.php2585DrupalWebTestCase->assertRaw()
Breadcrumbs were displayedOtherforum.test486ForumTestCase->verifyForumView()
strpos(): Empty delimiterWarningdrupal_web_test_case.php2585DrupalWebTestCase->assertRaw()
Breadcrumbs were displayedOtherforum.test431ForumTestCase->verifyForums()
strpos(): Empty delimiterWarningdrupal_web_test_case.php2585DrupalWebTestCase->assertRaw()
Breadcrumbs were displayedOtherforum.test486ForumTestCase->verifyForumView()
strpos(): Empty delimiterWarningdrupal_web_test_case.php2585DrupalWebTestCase->assertRaw()
Breadcrumbs were displayedOtherforum.test486ForumTestCase->verifyForumView()
strpos(): Empty delimiterWarningdrupal_web_test_case.php2585DrupalWebTestCase->assertRaw()
Breadcrumbs were displayedOtherforum.test486ForumTestCase->verifyForumView()
strpos(): Empty delimiterWarningdrupal_web_test_case.php2585DrupalWebTestCase->assertRaw()
Breadcrumbs were displayedOtherforum.test431ForumTestCase->verifyForums()
strpos(): Empty delimiterWarningdrupal_web_test_case.php2585DrupalWebTestCase->assertRaw()
Breadcrumbs were displayedOtherforum.test486ForumTestCase->verifyForumView()
strpos(): Empty delimiterWarningdrupal_web_test_case.php2585DrupalWebTestCase->assertRaw()
Breadcrumbs were displayedOtherforum.test486ForumTestCase->verifyForumView()
strpos(): Empty delimiterWarningdrupal_web_test_case.php2585DrupalWebTestCase->assertRaw()
Breadcrumbs were displayedOtherforum.test486ForumTestCase->verifyForumView()
strpos(): Empty delimiterWarningdrupal_web_test_case.php2585DrupalWebTestCase->assertRaw()
Breadcrumbs were displayedOtherforum.test431ForumTestCase->verifyForums()
ExpandImage field display tests (ImageFieldDisplayTestCase) [Image]1221213
MessageGroupFilenameLineFunctionStatus
strpos(): Empty delimiterWarningdrupal_web_test_case.php2585DrupalWebTestCase->assertRaw()
Default formatter displaying correctly on full node view.Otherimage.test655ImageFieldDisplayTestCase->_testImageFieldFormatters()
strpos(): Empty delimiterWarningdrupal_web_test_case.php2585DrupalWebTestCase->assertRaw()
Image linked to file formatter displaying correctly on full node view.Otherimage.test664ImageFieldDisplayTestCase->_testImageFieldFormatters()
strpos(): Empty delimiterWarningdrupal_web_test_case.php2585DrupalWebTestCase->assertRaw()
Image linked to content formatter displaying correctly on full node view.Otherimage.test688ImageFieldDisplayTestCase->_testImageFieldFormatters()
strpos(): Empty delimiterWarningdrupal_web_test_case.php2585DrupalWebTestCase->assertRaw()
Image style thumbnail formatter displaying correctly on full node view.Otherimage.test701ImageFieldDisplayTestCase->_testImageFieldFormatters()
strpos(): Empty delimiterWarningdrupal_web_test_case.php2585DrupalWebTestCase->assertRaw()
Default formatter displaying correctly on full node view.Otherimage.test655ImageFieldDisplayTestCase->_testImageFieldFormatters()
strpos(): Empty delimiterWarningdrupal_web_test_case.php2585DrupalWebTestCase->assertRaw()
Image linked to file formatter displaying correctly on full node view.Otherimage.test664ImageFieldDisplayTestCase->_testImageFieldFormatters()
strpos(): Empty delimiterWarningdrupal_web_test_case.php2585DrupalWebTestCase->assertRaw()
Image linked to content formatter displaying correctly on full node view.Otherimage.test688ImageFieldDisplayTestCase->_testImageFieldFormatters()
strpos(): Empty delimiterWarningdrupal_web_test_case.php2585DrupalWebTestCase->assertRaw()
Image style thumbnail formatter displaying correctly on full node view.Otherimage.test701ImageFieldDisplayTestCase->_testImageFieldFormatters()
strpos(): Empty delimiterWarningdrupal_web_test_case.php2585DrupalWebTestCase->assertRaw()
Preview image is displayed using 'medium' style.Otherimage.test750ImageFieldDisplayTestCase->testImageFieldSettings()
strpos(): Empty delimiterWarningdrupal_web_test_case.php2585DrupalWebTestCase->assertRaw()
Image displayed using user supplied alt and title attributes.Otherimage.test764ImageFieldDisplayTestCase->testImageFieldSettings()
strpos(): Empty delimiterWarningdrupal_web_test_case.php2585DrupalWebTestCase->assertRaw()
Default image displayed when no user supplied image is present.Otherimage.test795ImageFieldDisplayTestCase->testImageFieldDefaultImage()
strpos(): Empty delimiterWarningdrupal_web_test_case.php2605DrupalWebTestCase->assertNoRaw()
strpos(): Empty delimiterWarningdrupal_web_test_case.php2585DrupalWebTestCase->assertRaw()
User supplied image is displayed.Otherimage.test807ImageFieldDisplayTestCase->testImageFieldDefaultImage()
ExpandJavaScript (JavaScriptTestCase) [System]24140
MessageGroupFilenameLineFunctionStatus
Rendered JavaScript header returns basePath setting.Othercommon.test1210JavaScriptTestCase->testHeaderSetting()
Rendered JavaScript header includes jQuery.Othercommon.test1211JavaScriptTestCase->testHeaderSetting()
Rendered JavaScript header returns custom setting.Othercommon.test1214JavaScriptTestCase->testHeaderSetting()
drupal_add_js() correctly adds settings to the end of an indexed array.Othercommon.test1220JavaScriptTestCase->testHeaderSetting()
drupal_add_js() correctly overrides settings within an associative array.Othercommon.test1225JavaScriptTestCase->testHeaderSetting()
Rendering an external JavaScript file.Othercommon.test1256JavaScriptTestCase->testRenderExternal()
Rendered JavaScript footer returns the inline code.Othercommon.test1266JavaScriptTestCase->testFooterHTML()
JavaScript is added in the expected weight order.Othercommon.test1332JavaScriptTestCase->testRenderOrder()
Rendering a JavaScript file above jQuery.Othercommon.test1344JavaScriptTestCase->testRenderDifferentWeight()
Altering JavaScript weight through the alter hook.Othercommon.test1361JavaScriptTestCase->testAlter()
JavaScript of library was added to the page.Othercommon.test1372JavaScriptTestCase->testLibraryRender()
Stylesheet of library was added to the page.Othercommon.test1373JavaScriptTestCase->testLibraryRender()
Altered library dependencies are added to the page.Othercommon.test1389JavaScriptTestCase->testLibraryAlter()
The attached_library property adds the additional libraries.Othercommon.test1423JavaScriptTestCase->testAttachedLibrary()
ExpandLinks (ThemeLinksUnitTest) [Theme]001
MessageGroupFilenameLineFunctionStatus
PDOException: SQLSTATE[42S02]: Base table or view not found: 1146 Table 'drupaltestbotmysql.simpletest894184watchdog' doesn't exist: INSERT INTO {watchdog} (uid, type, message, variables, severity, link, location, referer, hostname, timestamp) VALUES (:db_insert_placeholder_0, :db_insert_placeholder_1, :db_insert_placeholder_2, :db_insert_placeholder_3, :db_insert_placeholder_4, :db_insert_placeholder_5, :db_insert_placeholder_6, :db_insert_placeholder_7, :db_insert_placeholder_8, :db_insert_placeholder_9); Array ( [:db_insert_placeholder_0] => 0 [:db_insert_placeholder_1] => theme [:db_insert_placeholder_2] => Theme key "@key" not found. [:db_insert_placeholder_3] => a:1:{s:4:"@key";s:5:"links";} [:db_insert_placeholder_4] => 4 [:db_insert_placeholder_5] => [:db_insert_placeholder_6] => http://2010120716947-pifr-mysql/checkout/ [:db_insert_placeholder_7] => [:db_insert_placeholder_8] => 127.0.0.1 [:db_insert_placeholder_9] => 1291904482 ) in dblog_watchdog() (line 155 of /var/lib/drupaltestbot/sites/default/files/checkout/modules/dblog/dblog.module).Uncaught exceptiondatabase.inc2005PDOStatement->execute()
ExpandSearch engine ranking (SearchRankingTestCase) [Search]5642
MessageGroupFilenameLineFunctionStatus
Search tag ranking for "<a>" order.Othersearch.test495SearchRankingTestCase->testHTMLRankings()
Search tag ranking for "<h5>" order.Othersearch.test495SearchRankingTestCase->testHTMLRankings()
Search tag ranking for "<h6>" order.Othersearch.test495SearchRankingTestCase->testHTMLRankings()
Undefined offset: 7Noticesearch.test493SearchRankingTestCase->testHTMLRankings()
Trying to get property of non-objectNoticesearch.test493SearchRankingTestCase->testHTMLRankings()
Search tag ranking for plain text order.Othersearch.test493SearchRankingTestCase->testHTMLRankings()
ExpandSimpleTest functionality (SimpleTestFunctionalTest) [SimpleTest]892340
MessageGroupFilenameLineFunctionStatus
simplexml_import_dom(): Invalid Nodetype to importWarningdrupal_web_test_case.php1607DrupalWebTestCase->parse()
Parsed page successfully.Browsersimpletest.test257SimpleTestFunctionalTest->getTestResults()
Undefined index: assertionsNoticesimpletest.test239SimpleTestFunctionalTest->assertAssertion()
Invalid argument supplied for foreach()Warningsimpletest.test239SimpleTestFunctionalTest->assertAssertion()
Found assertion {"SimpleTest pass.", "Other", "Pass", "simpletest.test", "SimpleTestFunctionalTest->stubTest()"}.Othersimpletest.test188SimpleTestFunctionalTest->confirmStubTestResults()
Undefined index: assertionsNoticesimpletest.test239SimpleTestFunctionalTest->assertAssertion()
Invalid argument supplied for foreach()Warningsimpletest.test239SimpleTestFunctionalTest->assertAssertion()
Found assertion {"SimpleTest fail.", "Other", "Fail", "simpletest.test", "SimpleTestFunctionalTest->stubTest()"}.Othersimpletest.test189SimpleTestFunctionalTest->confirmStubTestResults()
Undefined index: assertionsNoticesimpletest.test239SimpleTestFunctionalTest->assertAssertion()
Invalid argument supplied for foreach()Warningsimpletest.test239SimpleTestFunctionalTest->assertAssertion()
Found assertion {"Created permissions: access content", "Role", "Pass", "simpletest.test", "SimpleTestFunctionalTest->stubTest()"}.Othersimpletest.test191SimpleTestFunctionalTest->confirmStubTestResults()
Undefined index: assertionsNoticesimpletest.test239SimpleTestFunctionalTest->assertAssertion()
Invalid argument supplied for foreach()Warningsimpletest.test239SimpleTestFunctionalTest->assertAssertion()
Found assertion {"Invalid permission invalid permission.", "Role", "Fail", "simpletest.test", "SimpleTestFunctionalTest->stubTest()"}.Othersimpletest.test192SimpleTestFunctionalTest->confirmStubTestResults()
Undefined index: assertionsNoticesimpletest.test239SimpleTestFunctionalTest->assertAssertion()
Invalid argument supplied for foreach()Warningsimpletest.test239SimpleTestFunctionalTest->assertAssertion()
Found assertion {"Division by zero", "Warning", "Fail", "simpletest.test", "SimpleTestFunctionalTest->stubTest()"}.Othersimpletest.test195SimpleTestFunctionalTest->confirmStubTestResults()
Undefined index: assertionsNoticesimpletest.test239SimpleTestFunctionalTest->assertAssertion()
Invalid argument supplied for foreach()Warningsimpletest.test239SimpleTestFunctionalTest->assertAssertion()
Found assertion {"This is nothing.", "Other", "Pass", "simpletest.test", "SimpleTestFunctionalTest->stubTest()"}.Othersimpletest.test198SimpleTestFunctionalTest->confirmStubTestResults()
Undefined index: assertionsNoticesimpletest.test239SimpleTestFunctionalTest->assertAssertion()
Invalid argument supplied for foreach()Warningsimpletest.test239SimpleTestFunctionalTest->assertAssertion()
Found assertion {"array_key_exists", "Warning", "Fail", "simpletest.test", "SimpleTestFunctionalTest->stubTest()"}.Othersimpletest.test203SimpleTestFunctionalTest->confirmStubTestResults()
Undefined index: assertionsNoticesimpletest.test239SimpleTestFunctionalTest->assertAssertion()
Invalid argument supplied for foreach()Warningsimpletest.test239SimpleTestFunctionalTest->assertAssertion()
Found assertion {"Debug: 'Foo'", "Debug", "Fail", "simpletest.test", "SimpleTestFunctionalTest->stubTest()"}.Othersimpletest.test205SimpleTestFunctionalTest->confirmStubTestResults()
Undefined index: summaryNoticesimpletest.test207SimpleTestFunctionalTest->confirmStubTestResults()
Stub test summary is correctOthersimpletest.test207SimpleTestFunctionalTest->confirmStubTestResults()
Undefined index: assertionsNoticesimpletest.test217SimpleTestFunctionalTest->getTestIdFromResults()
Invalid argument supplied for foreach()Warningsimpletest.test217SimpleTestFunctionalTest->getTestIdFromResults()
Found test ID in results.Othersimpletest.test210SimpleTestFunctionalTest->confirmStubTestResults()
simplexml_import_dom(): Invalid Nodetype to importWarningdrupal_web_test_case.php1607DrupalWebTestCase->parse()
Parsed page successfully.Browsersimpletest.test257SimpleTestFunctionalTest->getTestResults()
Undefined index: assertionsNoticesimpletest.test239SimpleTestFunctionalTest->assertAssertion()
Invalid argument supplied for foreach()Warningsimpletest.test239SimpleTestFunctionalTest->assertAssertion()
Found assertion {"SimpleTest pass.", "Other", "Pass", "simpletest.test", "SimpleTestFunctionalTest->stubTest()"}.Othersimpletest.test188SimpleTestFunctionalTest->confirmStubTestResults()
Undefined index: assertionsNoticesimpletest.test239SimpleTestFunctionalTest->assertAssertion()
Invalid argument supplied for foreach()Warningsimpletest.test239SimpleTestFunctionalTest->assertAssertion()
Found assertion {"SimpleTest fail.", "Other", "Fail", "simpletest.test", "SimpleTestFunctionalTest->stubTest()"}.Othersimpletest.test189SimpleTestFunctionalTest->confirmStubTestResults()
Undefined index: assertionsNoticesimpletest.test239SimpleTestFunctionalTest->assertAssertion()
Invalid argument supplied for foreach()Warningsimpletest.test239SimpleTestFunctionalTest->assertAssertion()
Found assertion {"Created permissions: access content", "Role", "Pass", "simpletest.test", "SimpleTestFunctionalTest->stubTest()"}.Othersimpletest.test191SimpleTestFunctionalTest->confirmStubTestResults()
Undefined index: assertionsNoticesimpletest.test239SimpleTestFunctionalTest->assertAssertion()
Invalid argument supplied for foreach()Warningsimpletest.test239SimpleTestFunctionalTest->assertAssertion()
Found assertion {"Invalid permission invalid permission.", "Role", "Fail", "simpletest.test", "SimpleTestFunctionalTest->stubTest()"}.Othersimpletest.test192SimpleTestFunctionalTest->confirmStubTestResults()
Undefined index: assertionsNoticesimpletest.test239SimpleTestFunctionalTest->assertAssertion()
Invalid argument supplied for foreach()Warningsimpletest.test239SimpleTestFunctionalTest->assertAssertion()
Found assertion {"Division by zero", "Warning", "Fail", "simpletest.test", "SimpleTestFunctionalTest->stubTest()"}.Othersimpletest.test195SimpleTestFunctionalTest->confirmStubTestResults()
Undefined index: assertionsNoticesimpletest.test239SimpleTestFunctionalTest->assertAssertion()
Invalid argument supplied for foreach()Warningsimpletest.test239SimpleTestFunctionalTest->assertAssertion()
Found assertion {"This is nothing.", "Other", "Pass", "simpletest.test", "SimpleTestFunctionalTest->stubTest()"}.Othersimpletest.test198SimpleTestFunctionalTest->confirmStubTestResults()
Undefined index: assertionsNoticesimpletest.test239SimpleTestFunctionalTest->assertAssertion()
Invalid argument supplied for foreach()Warningsimpletest.test239SimpleTestFunctionalTest->assertAssertion()
Found assertion {"array_key_exists", "Warning", "Fail", "simpletest.test", "SimpleTestFunctionalTest->stubTest()"}.Othersimpletest.test203SimpleTestFunctionalTest->confirmStubTestResults()
Undefined index: assertionsNoticesimpletest.test239SimpleTestFunctionalTest->assertAssertion()
Invalid argument supplied for foreach()Warningsimpletest.test239SimpleTestFunctionalTest->assertAssertion()
Found assertion {"Debug: 'Foo'", "Debug", "Fail", "simpletest.test", "SimpleTestFunctionalTest->stubTest()"}.Othersimpletest.test205SimpleTestFunctionalTest->confirmStubTestResults()
Undefined index: summaryNoticesimpletest.test207SimpleTestFunctionalTest->confirmStubTestResults()
Stub test summary is correctOthersimpletest.test207SimpleTestFunctionalTest->confirmStubTestResults()
Undefined index: assertionsNoticesimpletest.test217SimpleTestFunctionalTest->getTestIdFromResults()
Invalid argument supplied for foreach()Warningsimpletest.test217SimpleTestFunctionalTest->getTestIdFromResults()
Found test ID in results.Othersimpletest.test210SimpleTestFunctionalTest->confirmStubTestResults()
Test ID is incrementing.Othersimpletest.test149SimpleTestFunctionalTest->testWebTestRunner()
ExpandStatistics reports tests (StatisticsReportsTestCase) [Statistics]7911
MessageGroupFilenameLineFunctionStatus
strpos(): Empty delimiterWarningdrupal_web_test_case.php2585DrupalWebTestCase->assertRaw()
Found link to visited node.Otherstatistics.test204StatisticsReportsTestCase->testPopularContentBlock()
ExpandTaxonomy term reference field (TaxonomyTermFieldTestCase) [Taxonomy]3510
MessageGroupFilenameLineFunctionStatus
Term name is displayedOthertaxonomy.test989TaxonomyTermFieldTestCase->testTaxonomyTermFieldWidgets()
ExpandTaxonomy upgrade path (UpgradePathTaxonomyTestCase) [Upgrade path]135112825
MessageGroupFilenameLineFunctionStatus
Term term 2 of vocabulary 2 (j=0) (field-name-taxonomyextra) is displayed on node 1Otherupgrade.taxonomy.test152UpgradePathTaxonomyTestCase->testTaxonomyUpgrade()
Term term 3 of vocabulary 2 (j=1) (field-name-taxonomyextra) is displayed on node 1Otherupgrade.taxonomy.test152UpgradePathTaxonomyTestCase->testTaxonomyUpgrade()
Term term 4 of vocabulary 3 (j=0) (field-name-taxonomyextra) is displayed on node 1Otherupgrade.taxonomy.test152UpgradePathTaxonomyTestCase->testTaxonomyUpgrade()
Term term 5 of vocabulary 3 (j=1) (field-name-taxonomyextra) is displayed on node 1Otherupgrade.taxonomy.test152UpgradePathTaxonomyTestCase->testTaxonomyUpgrade()
Term term 6 of vocabulary 3 (j=2) (field-name-taxonomyextra) is displayed on node 1Otherupgrade.taxonomy.test152UpgradePathTaxonomyTestCase->testTaxonomyUpgrade()
Term term 7 of vocabulary 4 (j=0) (field-name-taxonomyextra) is displayed on node 1Otherupgrade.taxonomy.test152UpgradePathTaxonomyTestCase->testTaxonomyUpgrade()
Term term 8 of vocabulary 5 (j=0) (field-name-taxonomyextra) is displayed on node 1Otherupgrade.taxonomy.test152UpgradePathTaxonomyTestCase->testTaxonomyUpgrade()
Term term 9 of vocabulary 5 (j=1) (field-name-taxonomyextra) is displayed on node 1Otherupgrade.taxonomy.test152UpgradePathTaxonomyTestCase->testTaxonomyUpgrade()
Term term 10 of vocabulary 6 (j=0) (field-name-taxonomyextra) is displayed on node 1Otherupgrade.taxonomy.test152UpgradePathTaxonomyTestCase->testTaxonomyUpgrade()
Term term 11 of vocabulary 6 (j=1) (field-name-taxonomyextra) is displayed on node 1Otherupgrade.taxonomy.test152UpgradePathTaxonomyTestCase->testTaxonomyUpgrade()
Term term 12 of vocabulary 6 (j=2) (field-name-taxonomyextra) is displayed on node 1Otherupgrade.taxonomy.test152UpgradePathTaxonomyTestCase->testTaxonomyUpgrade()
Term term 13 of vocabulary 7 (j=0) (field-name-taxonomyextra) is displayed on node 1Otherupgrade.taxonomy.test152UpgradePathTaxonomyTestCase->testTaxonomyUpgrade()
Term term 14 of vocabulary 8 (j=0) (field-name-taxonomyextra) is displayed on node 1Otherupgrade.taxonomy.test152UpgradePathTaxonomyTestCase->testTaxonomyUpgrade()
Term term 15 of vocabulary 8 (j=1) (field-name-taxonomyextra) is displayed on node 1Otherupgrade.taxonomy.test152UpgradePathTaxonomyTestCase->testTaxonomyUpgrade()
Term term 16 of vocabulary 9 (j=0) (field-name-taxonomyextra) is displayed on node 1Otherupgrade.taxonomy.test152UpgradePathTaxonomyTestCase->testTaxonomyUpgrade()
Term term 17 of vocabulary 9 (j=1) (field-name-taxonomyextra) is displayed on node 1Otherupgrade.taxonomy.test152UpgradePathTaxonomyTestCase->testTaxonomyUpgrade()
Term term 18 of vocabulary 9 (j=2) (field-name-taxonomyextra) is displayed on node 1Otherupgrade.taxonomy.test152UpgradePathTaxonomyTestCase->testTaxonomyUpgrade()
Term term 19 of vocabulary 10 (j=0) (field-name-taxonomyextra) is displayed on node 1Otherupgrade.taxonomy.test152UpgradePathTaxonomyTestCase->testTaxonomyUpgrade()
Term term 20 of vocabulary 11 (j=0) (field-name-taxonomyextra) is displayed on node 1Otherupgrade.taxonomy.test152UpgradePathTaxonomyTestCase->testTaxonomyUpgrade()
Term term 21 of vocabulary 11 (j=1) (field-name-taxonomyextra) is displayed on node 1Otherupgrade.taxonomy.test152UpgradePathTaxonomyTestCase->testTaxonomyUpgrade()
Term term 22 of vocabulary 12 (j=0) (field-name-taxonomyextra) is displayed on node 1Otherupgrade.taxonomy.test152UpgradePathTaxonomyTestCase->testTaxonomyUpgrade()
Term term 23 of vocabulary 12 (j=1) (field-name-taxonomyextra) is displayed on node 1Otherupgrade.taxonomy.test152UpgradePathTaxonomyTestCase->testTaxonomyUpgrade()
Term term 24 of vocabulary 12 (j=2) (field-name-taxonomyextra) is displayed on node 1Otherupgrade.taxonomy.test152UpgradePathTaxonomyTestCase->testTaxonomyUpgrade()
Term term 25 of vocabulary 13 (j=0) (field-name-taxonomy-vocabulary-13) is displayed on node 1Otherupgrade.taxonomy.test152UpgradePathTaxonomyTestCase->testTaxonomyUpgrade()
Term term 26 of vocabulary 14 (j=0) (field-name-taxonomy-vocabulary-14) is displayed on node 1Otherupgrade.taxonomy.test152UpgradePathTaxonomyTestCase->testTaxonomyUpgrade()
Term term 27 of vocabulary 14 (j=1) (field-name-taxonomy-vocabulary-14) is displayed on node 1Otherupgrade.taxonomy.test152UpgradePathTaxonomyTestCase->testTaxonomyUpgrade()
Term term 28 of vocabulary 15 (j=0) (field-name-taxonomy-vocabulary-15) is displayed on node 1Otherupgrade.taxonomy.test152UpgradePathTaxonomyTestCase->testTaxonomyUpgrade()
Term term 29 of vocabulary 15 (j=1) (field-name-taxonomyextra) is displayed on node 1Otherupgrade.taxonomy.test152UpgradePathTaxonomyTestCase->testTaxonomyUpgrade()
Term term 30 of vocabulary 15 (j=2) (field-name-taxonomyextra) is displayed on node 1Otherupgrade.taxonomy.test152UpgradePathTaxonomyTestCase->testTaxonomyUpgrade()
Term term 31 of vocabulary 16 (j=0) (field-name-taxonomy-vocabulary-16) is displayed on node 1Otherupgrade.taxonomy.test152UpgradePathTaxonomyTestCase->testTaxonomyUpgrade()
Term term 32 of vocabulary 17 (j=0) (field-name-taxonomy-vocabulary-17) is displayed on node 1Otherupgrade.taxonomy.test152UpgradePathTaxonomyTestCase->testTaxonomyUpgrade()
Term term 33 of vocabulary 17 (j=1) (field-name-taxonomyextra) is displayed on node 1Otherupgrade.taxonomy.test152UpgradePathTaxonomyTestCase->testTaxonomyUpgrade()
Term term 34 of vocabulary 18 (j=0) (field-name-taxonomy-vocabulary-18) is displayed on node 1Otherupgrade.taxonomy.test152UpgradePathTaxonomyTestCase->testTaxonomyUpgrade()
Term term 35 of vocabulary 18 (j=1) (field-name-taxonomy-vocabulary-18) is displayed on node 1Otherupgrade.taxonomy.test152UpgradePathTaxonomyTestCase->testTaxonomyUpgrade()
Term term 36 of vocabulary 18 (j=2) (field-name-taxonomy-vocabulary-18) is displayed on node 1Otherupgrade.taxonomy.test152UpgradePathTaxonomyTestCase->testTaxonomyUpgrade()
Term term 37 of vocabulary 19 (j=0) (field-name-taxonomy-vocabulary-19) is displayed on node 1Otherupgrade.taxonomy.test152UpgradePathTaxonomyTestCase->testTaxonomyUpgrade()
Term term 38 of vocabulary 20 (j=0) (field-name-taxonomy-vocabulary-20) is displayed on node 1Otherupgrade.taxonomy.test152UpgradePathTaxonomyTestCase->testTaxonomyUpgrade()
Term term 39 of vocabulary 20 (j=1) (field-name-taxonomy-vocabulary-20) is displayed on node 1Otherupgrade.taxonomy.test152UpgradePathTaxonomyTestCase->testTaxonomyUpgrade()
Term term 40 of vocabulary 21 (j=0) (field-name-taxonomy-vocabulary-21) is displayed on node 1Otherupgrade.taxonomy.test152UpgradePathTaxonomyTestCase->testTaxonomyUpgrade()
Term term 41 of vocabulary 21 (j=1) (field-name-taxonomyextra) is displayed on node 1Otherupgrade.taxonomy.test152UpgradePathTaxonomyTestCase->testTaxonomyUpgrade()
Term term 42 of vocabulary 21 (j=2) (field-name-taxonomyextra) is displayed on node 1Otherupgrade.taxonomy.test152UpgradePathTaxonomyTestCase->testTaxonomyUpgrade()
Term term 43 of vocabulary 22 (j=0) (field-name-taxonomy-vocabulary-22) is displayed on node 1Otherupgrade.taxonomy.test152UpgradePathTaxonomyTestCase->testTaxonomyUpgrade()
Term term 44 of vocabulary 23 (j=0) (field-name-taxonomy-vocabulary-23) is displayed on node 1Otherupgrade.taxonomy.test152UpgradePathTaxonomyTestCase->testTaxonomyUpgrade()
Term term 45 of vocabulary 23 (j=1) (field-name-taxonomyextra) is displayed on node 1Otherupgrade.taxonomy.test152UpgradePathTaxonomyTestCase->testTaxonomyUpgrade()
Term term 46 of vocabulary 24 (j=0) (field-name-taxonomy-vocabulary-24) is displayed on node 1Otherupgrade.taxonomy.test152UpgradePathTaxonomyTestCase->testTaxonomyUpgrade()
Term term 47 of vocabulary 24 (j=1) (field-name-taxonomy-vocabulary-24) is displayed on node 1Otherupgrade.taxonomy.test152UpgradePathTaxonomyTestCase->testTaxonomyUpgrade()
strpos(): Empty delimiterWarningdrupal_web_test_case.php2605DrupalWebTestCase->assertNoRaw()
strpos(): Empty delimiterWarningdrupal_web_test_case.php2585DrupalWebTestCase->assertRaw()
Term term 48 of vocabulary 24 (j=2) (field-name-taxonomy-vocabulary-24) is displayed on node 1 vid 1.Otherupgrade.taxonomy.test181UpgradePathTaxonomyTestCase->testTaxonomyUpgrade()
strpos(): Empty delimiterWarningdrupal_web_test_case.php2585DrupalWebTestCase->assertRaw()
Term term 48 of vocabulary 24 (j=2) (field-name-taxonomy-vocabulary-24) is displayed on node 1 1.Otherupgrade.taxonomy.test184UpgradePathTaxonomyTestCase->testTaxonomyUpgrade()
Term term 1 of vocabulary 1 (j=0) (field-name-taxonomyextra) is displayed on node 2Otherupgrade.taxonomy.test152UpgradePathTaxonomyTestCase->testTaxonomyUpgrade()
Term term 3 of vocabulary 2 (j=1) (field-name-taxonomyextra) is displayed on node 2Otherupgrade.taxonomy.test152UpgradePathTaxonomyTestCase->testTaxonomyUpgrade()
Term term 4 of vocabulary 3 (j=0) (field-name-taxonomyextra) is displayed on node 2Otherupgrade.taxonomy.test152UpgradePathTaxonomyTestCase->testTaxonomyUpgrade()
Term term 5 of vocabulary 3 (j=1) (field-name-taxonomyextra) is displayed on node 2Otherupgrade.taxonomy.test152UpgradePathTaxonomyTestCase->testTaxonomyUpgrade()
Term term 6 of vocabulary 3 (j=2) (field-name-taxonomyextra) is displayed on node 2Otherupgrade.taxonomy.test152UpgradePathTaxonomyTestCase->testTaxonomyUpgrade()
Term term 7 of vocabulary 4 (j=0) (field-name-taxonomyextra) is displayed on node 2Otherupgrade.taxonomy.test152UpgradePathTaxonomyTestCase->testTaxonomyUpgrade()
Term term 8 of vocabulary 5 (j=0) (field-name-taxonomyextra) is displayed on node 2Otherupgrade.taxonomy.test152UpgradePathTaxonomyTestCase->testTaxonomyUpgrade()
Term term 9 of vocabulary 5 (j=1) (field-name-taxonomyextra) is displayed on node 2Otherupgrade.taxonomy.test152UpgradePathTaxonomyTestCase->testTaxonomyUpgrade()
Term term 10 of vocabulary 6 (j=0) (field-name-taxonomyextra) is displayed on node 2Otherupgrade.taxonomy.test152UpgradePathTaxonomyTestCase->testTaxonomyUpgrade()
Term term 11 of vocabulary 6 (j=1) (field-name-taxonomyextra) is displayed on node 2Otherupgrade.taxonomy.test152UpgradePathTaxonomyTestCase->testTaxonomyUpgrade()
Term term 12 of vocabulary 6 (j=2) (field-name-taxonomyextra) is displayed on node 2Otherupgrade.taxonomy.test152UpgradePathTaxonomyTestCase->testTaxonomyUpgrade()
Term term 13 of vocabulary 7 (j=0) (field-name-taxonomyextra) is displayed on node 2Otherupgrade.taxonomy.test152UpgradePathTaxonomyTestCase->testTaxonomyUpgrade()
Term term 14 of vocabulary 8 (j=0) (field-name-taxonomyextra) is displayed on node 2Otherupgrade.taxonomy.test152UpgradePathTaxonomyTestCase->testTaxonomyUpgrade()
Term term 15 of vocabulary 8 (j=1) (field-name-taxonomyextra) is displayed on node 2Otherupgrade.taxonomy.test152UpgradePathTaxonomyTestCase->testTaxonomyUpgrade()
Term term 16 of vocabulary 9 (j=0) (field-name-taxonomyextra) is displayed on node 2Otherupgrade.taxonomy.test152UpgradePathTaxonomyTestCase->testTaxonomyUpgrade()
Term term 17 of vocabulary 9 (j=1) (field-name-taxonomyextra) is displayed on node 2Otherupgrade.taxonomy.test152UpgradePathTaxonomyTestCase->testTaxonomyUpgrade()
Term term 18 of vocabulary 9 (j=2) (field-name-taxonomyextra) is displayed on node 2Otherupgrade.taxonomy.test152UpgradePathTaxonomyTestCase->testTaxonomyUpgrade()
Term term 19 of vocabulary 10 (j=0) (field-name-taxonomyextra) is displayed on node 2Otherupgrade.taxonomy.test152UpgradePathTaxonomyTestCase->testTaxonomyUpgrade()
Term term 20 of vocabulary 11 (j=0) (field-name-taxonomyextra) is displayed on node 2Otherupgrade.taxonomy.test152UpgradePathTaxonomyTestCase->testTaxonomyUpgrade()
Term term 21 of vocabulary 11 (j=1) (field-name-taxonomyextra) is displayed on node 2Otherupgrade.taxonomy.test152UpgradePathTaxonomyTestCase->testTaxonomyUpgrade()
Term term 22 of vocabulary 12 (j=0) (field-name-taxonomyextra) is displayed on node 2Otherupgrade.taxonomy.test152UpgradePathTaxonomyTestCase->testTaxonomyUpgrade()
Term term 23 of vocabulary 12 (j=1) (field-name-taxonomyextra) is displayed on node 2Otherupgrade.taxonomy.test152UpgradePathTaxonomyTestCase->testTaxonomyUpgrade()
Term term 24 of vocabulary 12 (j=2) (field-name-taxonomyextra) is displayed on node 2Otherupgrade.taxonomy.test152UpgradePathTaxonomyTestCase->testTaxonomyUpgrade()
Term term 25 of vocabulary 13 (j=0) (field-name-taxonomy-vocabulary-13) is displayed on node 2Otherupgrade.taxonomy.test152UpgradePathTaxonomyTestCase->testTaxonomyUpgrade()
Term term 26 of vocabulary 14 (j=0) (field-name-taxonomy-vocabulary-14) is displayed on node 2Otherupgrade.taxonomy.test152UpgradePathTaxonomyTestCase->testTaxonomyUpgrade()
Term term 27 of vocabulary 14 (j=1) (field-name-taxonomy-vocabulary-14) is displayed on node 2Otherupgrade.taxonomy.test152UpgradePathTaxonomyTestCase->testTaxonomyUpgrade()
Term term 28 of vocabulary 15 (j=0) (field-name-taxonomy-vocabulary-15) is displayed on node 2Otherupgrade.taxonomy.test152UpgradePathTaxonomyTestCase->testTaxonomyUpgrade()
Term term 29 of vocabulary 15 (j=1) (field-name-taxonomyextra) is displayed on node 2Otherupgrade.taxonomy.test152UpgradePathTaxonomyTestCase->testTaxonomyUpgrade()
Term term 30 of vocabulary 15 (j=2) (field-name-taxonomyextra) is displayed on node 2Otherupgrade.taxonomy.test152UpgradePathTaxonomyTestCase->testTaxonomyUpgrade()
Term term 31 of vocabulary 16 (j=0) (field-name-taxonomy-vocabulary-16) is displayed on node 2Otherupgrade.taxonomy.test152UpgradePathTaxonomyTestCase->testTaxonomyUpgrade()
Term term 32 of vocabulary 17 (j=0) (field-name-taxonomy-vocabulary-17) is displayed on node 2Otherupgrade.taxonomy.test152UpgradePathTaxonomyTestCase->testTaxonomyUpgrade()
Term term 33 of vocabulary 17 (j=1) (field-name-taxonomyextra) is displayed on node 2Otherupgrade.taxonomy.test152UpgradePathTaxonomyTestCase->testTaxonomyUpgrade()
Term term 34 of vocabulary 18 (j=0) (field-name-taxonomy-vocabulary-18) is displayed on node 2Otherupgrade.taxonomy.test152UpgradePathTaxonomyTestCase->testTaxonomyUpgrade()
Term term 35 of vocabulary 18 (j=1) (field-name-taxonomy-vocabulary-18) is displayed on node 2Otherupgrade.taxonomy.test152UpgradePathTaxonomyTestCase->testTaxonomyUpgrade()
Term term 36 of vocabulary 18 (j=2) (field-name-taxonomy-vocabulary-18) is displayed on node 2Otherupgrade.taxonomy.test152UpgradePathTaxonomyTestCase->testTaxonomyUpgrade()
Term term 37 of vocabulary 19 (j=0) (field-name-taxonomy-vocabulary-19) is displayed on node 2Otherupgrade.taxonomy.test152UpgradePathTaxonomyTestCase->testTaxonomyUpgrade()
Term term 38 of vocabulary 20 (j=0) (field-name-taxonomy-vocabulary-20) is displayed on node 2Otherupgrade.taxonomy.test152UpgradePathTaxonomyTestCase->testTaxonomyUpgrade()
Term term 39 of vocabulary 20 (j=1) (field-name-taxonomy-vocabulary-20) is displayed on node 2Otherupgrade.taxonomy.test152UpgradePathTaxonomyTestCase->testTaxonomyUpgrade()
Term term 40 of vocabulary 21 (j=0) (field-name-taxonomy-vocabulary-21) is displayed on node 2Otherupgrade.taxonomy.test152UpgradePathTaxonomyTestCase->testTaxonomyUpgrade()
Term term 41 of vocabulary 21 (j=1) (field-name-taxonomyextra) is displayed on node 2Otherupgrade.taxonomy.test152UpgradePathTaxonomyTestCase->testTaxonomyUpgrade()
Term term 42 of vocabulary 21 (j=2) (field-name-taxonomyextra) is displayed on node 2Otherupgrade.taxonomy.test152UpgradePathTaxonomyTestCase->testTaxonomyUpgrade()
Term term 43 of vocabulary 22 (j=0) (field-name-taxonomy-vocabulary-22) is displayed on node 2Otherupgrade.taxonomy.test152UpgradePathTaxonomyTestCase->testTaxonomyUpgrade()
Term term 44 of vocabulary 23 (j=0) (field-name-taxonomy-vocabulary-23) is displayed on node 2Otherupgrade.taxonomy.test152UpgradePathTaxonomyTestCase->testTaxonomyUpgrade()
Term term 45 of vocabulary 23 (j=1) (field-name-taxonomyextra) is displayed on node 2Otherupgrade.taxonomy.test152UpgradePathTaxonomyTestCase->testTaxonomyUpgrade()
Term term 46 of vocabulary 24 (j=0) (field-name-taxonomy-vocabulary-24) is displayed on node 2Otherupgrade.taxonomy.test152UpgradePathTaxonomyTestCase->testTaxonomyUpgrade()
Term term 48 of vocabulary 24 (j=2) (field-name-taxonomy-vocabulary-24) is displayed on node 2Otherupgrade.taxonomy.test152UpgradePathTaxonomyTestCase->testTaxonomyUpgrade()
strpos(): Empty delimiterWarningdrupal_web_test_case.php2585DrupalWebTestCase->assertRaw()
Term term 48 of vocabulary 24 (j=2) (field-name-taxonomy-vocabulary-24) is displayed on node 2 vid 3.Otherupgrade.taxonomy.test181UpgradePathTaxonomyTestCase->testTaxonomyUpgrade()
strpos(): Empty delimiterWarningdrupal_web_test_case.php2585DrupalWebTestCase->assertRaw()
Term term 48 of vocabulary 24 (j=2) (field-name-taxonomy-vocabulary-24) is displayed on node 2 3.Otherupgrade.taxonomy.test184UpgradePathTaxonomyTestCase->testTaxonomyUpgrade()
Term term 1 of vocabulary 1 (j=0) (field-name-taxonomyextra) is displayed on node 3Otherupgrade.taxonomy.test152UpgradePathTaxonomyTestCase->testTaxonomyUpgrade()
Term term 2 of vocabulary 2 (j=0) (field-name-taxonomyextra) is displayed on node 3Otherupgrade.taxonomy.test152UpgradePathTaxonomyTestCase->testTaxonomyUpgrade()
Term term 4 of vocabulary 3 (j=0) (field-name-taxonomyextra) is displayed on node 3Otherupgrade.taxonomy.test152UpgradePathTaxonomyTestCase->testTaxonomyUpgrade()
Term term 5 of vocabulary 3 (j=1) (field-name-taxonomyextra) is displayed on node 3Otherupgrade.taxonomy.test152UpgradePathTaxonomyTestCase->testTaxonomyUpgrade()
Term term 6 of vocabulary 3 (j=2) (field-name-taxonomyextra) is displayed on node 3Otherupgrade.taxonomy.test152UpgradePathTaxonomyTestCase->testTaxonomyUpgrade()
Term term 7 of vocabulary 4 (j=0) (field-name-taxonomyextra) is displayed on node 3Otherupgrade.taxonomy.test152UpgradePathTaxonomyTestCase->testTaxonomyUpgrade()
Term term 8 of vocabulary 5 (j=0) (field-name-taxonomyextra) is displayed on node 3Otherupgrade.taxonomy.test152UpgradePathTaxonomyTestCase->testTaxonomyUpgrade()
Term term 9 of vocabulary 5 (j=1) (field-name-taxonomyextra) is displayed on node 3Otherupgrade.taxonomy.test152UpgradePathTaxonomyTestCase->testTaxonomyUpgrade()
Term term 10 of vocabulary 6 (j=0) (field-name-taxonomyextra) is displayed on node 3Otherupgrade.taxonomy.test152UpgradePathTaxonomyTestCase->testTaxonomyUpgrade()
Term term 11 of vocabulary 6 (j=1) (field-name-taxonomyextra) is displayed on node 3Otherupgrade.taxonomy.test152UpgradePathTaxonomyTestCase->testTaxonomyUpgrade()
Term term 12 of vocabulary 6 (j=2) (field-name-taxonomyextra) is displayed on node 3Otherupgrade.taxonomy.test152UpgradePathTaxonomyTestCase->testTaxonomyUpgrade()
Term term 13 of vocabulary 7 (j=0) (field-name-taxonomyextra) is displayed on node 3Otherupgrade.taxonomy.test152UpgradePathTaxonomyTestCase->testTaxonomyUpgrade()
Term term 14 of vocabulary 8 (j=0) (field-name-taxonomyextra) is displayed on node 3Otherupgrade.taxonomy.test152UpgradePathTaxonomyTestCase->testTaxonomyUpgrade()
Term term 15 of vocabulary 8 (j=1) (field-name-taxonomyextra) is displayed on node 3Otherupgrade.taxonomy.test152UpgradePathTaxonomyTestCase->testTaxonomyUpgrade()
Term term 16 of vocabulary 9 (j=0) (field-name-taxonomyextra) is displayed on node 3Otherupgrade.taxonomy.test152UpgradePathTaxonomyTestCase->testTaxonomyUpgrade()
Term term 17 of vocabulary 9 (j=1) (field-name-taxonomyextra) is displayed on node 3Otherupgrade.taxonomy.test152UpgradePathTaxonomyTestCase->testTaxonomyUpgrade()
Term term 18 of vocabulary 9 (j=2) (field-name-taxonomyextra) is displayed on node 3Otherupgrade.taxonomy.test152UpgradePathTaxonomyTestCase->testTaxonomyUpgrade()
Term term 19 of vocabulary 10 (j=0) (field-name-taxonomyextra) is displayed on node 3Otherupgrade.taxonomy.test152UpgradePathTaxonomyTestCase->testTaxonomyUpgrade()
Term term 20 of vocabulary 11 (j=0) (field-name-taxonomyextra) is displayed on node 3Otherupgrade.taxonomy.test152UpgradePathTaxonomyTestCase->testTaxonomyUpgrade()
Term term 21 of vocabulary 11 (j=1) (field-name-taxonomyextra) is displayed on node 3Otherupgrade.taxonomy.test152UpgradePathTaxonomyTestCase->testTaxonomyUpgrade()
Term term 22 of vocabulary 12 (j=0) (field-name-taxonomyextra) is displayed on node 3Otherupgrade.taxonomy.test152UpgradePathTaxonomyTestCase->testTaxonomyUpgrade()
Term term 23 of vocabulary 12 (j=1) (field-name-taxonomyextra) is displayed on node 3Otherupgrade.taxonomy.test152UpgradePathTaxonomyTestCase->testTaxonomyUpgrade()
Term term 24 of vocabulary 12 (j=2) (field-name-taxonomyextra) is displayed on node 3Otherupgrade.taxonomy.test152UpgradePathTaxonomyTestCase->testTaxonomyUpgrade()
Term term 25 of vocabulary 13 (j=0) (field-name-taxonomy-vocabulary-13) is displayed on node 3Otherupgrade.taxonomy.test152UpgradePathTaxonomyTestCase->testTaxonomyUpgrade()
Term term 26 of vocabulary 14 (j=0) (field-name-taxonomy-vocabulary-14) is displayed on node 3Otherupgrade.taxonomy.test152UpgradePathTaxonomyTestCase->testTaxonomyUpgrade()
Term term 27 of vocabulary 14 (j=1) (field-name-taxonomy-vocabulary-14) is displayed on node 3Otherupgrade.taxonomy.test152UpgradePathTaxonomyTestCase->testTaxonomyUpgrade()
Term term 28 of vocabulary 15 (j=0) (field-name-taxonomy-vocabulary-15) is displayed on node 3Otherupgrade.taxonomy.test152UpgradePathTaxonomyTestCase->testTaxonomyUpgrade()
Term term 29 of vocabulary 15 (j=1) (field-name-taxonomyextra) is displayed on node 3Otherupgrade.taxonomy.test152UpgradePathTaxonomyTestCase->testTaxonomyUpgrade()
Term term 30 of vocabulary 15 (j=2) (field-name-taxonomyextra) is displayed on node 3Otherupgrade.taxonomy.test152UpgradePathTaxonomyTestCase->testTaxonomyUpgrade()
Term term 31 of vocabulary 16 (j=0) (field-name-taxonomy-vocabulary-16) is displayed on node 3Otherupgrade.taxonomy.test152UpgradePathTaxonomyTestCase->testTaxonomyUpgrade()
Term term 32 of vocabulary 17 (j=0) (field-name-taxonomy-vocabulary-17) is displayed on node 3Otherupgrade.taxonomy.test152UpgradePathTaxonomyTestCase->testTaxonomyUpgrade()
Term term 33 of vocabulary 17 (j=1) (field-name-taxonomyextra) is displayed on node 3Otherupgrade.taxonomy.test152UpgradePathTaxonomyTestCase->testTaxonomyUpgrade()
Term term 34 of vocabulary 18 (j=0) (field-name-taxonomy-vocabulary-18) is displayed on node 3Otherupgrade.taxonomy.test152UpgradePathTaxonomyTestCase->testTaxonomyUpgrade()
Term term 35 of vocabulary 18 (j=1) (field-name-taxonomy-vocabulary-18) is displayed on node 3Otherupgrade.taxonomy.test152UpgradePathTaxonomyTestCase->testTaxonomyUpgrade()
Term term 36 of vocabulary 18 (j=2) (field-name-taxonomy-vocabulary-18) is displayed on node 3Otherupgrade.taxonomy.test152UpgradePathTaxonomyTestCase->testTaxonomyUpgrade()
Term term 37 of vocabulary 19 (j=0) (field-name-taxonomy-vocabulary-19) is displayed on node 3Otherupgrade.taxonomy.test152UpgradePathTaxonomyTestCase->testTaxonomyUpgrade()
Term term 38 of vocabulary 20 (j=0) (field-name-taxonomy-vocabulary-20) is displayed on node 3Otherupgrade.taxonomy.test152UpgradePathTaxonomyTestCase->testTaxonomyUpgrade()
Term term 39 of vocabulary 20 (j=1) (field-name-taxonomy-vocabulary-20) is displayed on node 3Otherupgrade.taxonomy.test152UpgradePathTaxonomyTestCase->testTaxonomyUpgrade()
Term term 40 of vocabulary 21 (j=0) (field-name-taxonomy-vocabulary-21) is displayed on node 3Otherupgrade.taxonomy.test152UpgradePathTaxonomyTestCase->testTaxonomyUpgrade()
Term term 41 of vocabulary 21 (j=1) (field-name-taxonomyextra) is displayed on node 3Otherupgrade.taxonomy.test152UpgradePathTaxonomyTestCase->testTaxonomyUpgrade()
Term term 42 of vocabulary 21 (j=2) (field-name-taxonomyextra) is displayed on node 3Otherupgrade.taxonomy.test152UpgradePathTaxonomyTestCase->testTaxonomyUpgrade()
Term term 43 of vocabulary 22 (j=0) (field-name-taxonomy-vocabulary-22) is displayed on node 3Otherupgrade.taxonomy.test152UpgradePathTaxonomyTestCase->testTaxonomyUpgrade()
Term term 44 of vocabulary 23 (j=0) (field-name-taxonomy-vocabulary-23) is displayed on node 3Otherupgrade.taxonomy.test152UpgradePathTaxonomyTestCase->testTaxonomyUpgrade()
Term term 45 of vocabulary 23 (j=1) (field-name-taxonomyextra) is displayed on node 3Otherupgrade.taxonomy.test152UpgradePathTaxonomyTestCase->testTaxonomyUpgrade()
Term term 47 of vocabulary 24 (j=1) (field-name-taxonomy-vocabulary-24) is displayed on node 3Otherupgrade.taxonomy.test152UpgradePathTaxonomyTestCase->testTaxonomyUpgrade()
Term term 48 of vocabulary 24 (j=2) (field-name-taxonomy-vocabulary-24) is displayed on node 3Otherupgrade.taxonomy.test152UpgradePathTaxonomyTestCase->testTaxonomyUpgrade()
strpos(): Empty delimiterWarningdrupal_web_test_case.php2585DrupalWebTestCase->assertRaw()
Term term 48 of vocabulary 24 (j=2) (field-name-taxonomy-vocabulary-24) is displayed on node 3 vid 5.Otherupgrade.taxonomy.test181UpgradePathTaxonomyTestCase->testTaxonomyUpgrade()
strpos(): Empty delimiterWarningdrupal_web_test_case.php2585DrupalWebTestCase->assertRaw()
Term term 48 of vocabulary 24 (j=2) (field-name-taxonomy-vocabulary-24) is displayed on node 3 5.Otherupgrade.taxonomy.test184UpgradePathTaxonomyTestCase->testTaxonomyUpgrade()
Term term 1 of vocabulary 1 (j=0) (field-name-taxonomyextra) is displayed on node 4Otherupgrade.taxonomy.test152UpgradePathTaxonomyTestCase->testTaxonomyUpgrade()
Term term 2 of vocabulary 2 (j=0) (field-name-taxonomyextra) is displayed on node 4Otherupgrade.taxonomy.test152UpgradePathTaxonomyTestCase->testTaxonomyUpgrade()
Term term 3 of vocabulary 2 (j=1) (field-name-taxonomyextra) is displayed on node 4Otherupgrade.taxonomy.test152UpgradePathTaxonomyTestCase->testTaxonomyUpgrade()
Term term 5 of vocabulary 3 (j=1) (field-name-taxonomyextra) is displayed on node 4Otherupgrade.taxonomy.test152UpgradePathTaxonomyTestCase->testTaxonomyUpgrade()
Term term 6 of vocabulary 3 (j=2) (field-name-taxonomyextra) is displayed on node 4Otherupgrade.taxonomy.test152UpgradePathTaxonomyTestCase->testTaxonomyUpgrade()
Term term 7 of vocabulary 4 (j=0) (field-name-taxonomyextra) is displayed on node 4Otherupgrade.taxonomy.test152UpgradePathTaxonomyTestCase->testTaxonomyUpgrade()
Term term 8 of vocabulary 5 (j=0) (field-name-taxonomyextra) is displayed on node 4Otherupgrade.taxonomy.test152UpgradePathTaxonomyTestCase->testTaxonomyUpgrade()
Term term 9 of vocabulary 5 (j=1) (field-name-taxonomyextra) is displayed on node 4Otherupgrade.taxonomy.test152UpgradePathTaxonomyTestCase->testTaxonomyUpgrade()
Term term 10 of vocabulary 6 (j=0) (field-name-taxonomyextra) is displayed on node 4Otherupgrade.taxonomy.test152UpgradePathTaxonomyTestCase->testTaxonomyUpgrade()
Term term 11 of vocabulary 6 (j=1) (field-name-taxonomyextra) is displayed on node 4Otherupgrade.taxonomy.test152UpgradePathTaxonomyTestCase->testTaxonomyUpgrade()
Term term 12 of vocabulary 6 (j=2) (field-name-taxonomyextra) is displayed on node 4Otherupgrade.taxonomy.test152UpgradePathTaxonomyTestCase->testTaxonomyUpgrade()
Term term 13 of vocabulary 7 (j=0) (field-name-taxonomyextra) is displayed on node 4Otherupgrade.taxonomy.test152UpgradePathTaxonomyTestCase->testTaxonomyUpgrade()
Term term 14 of vocabulary 8 (j=0) (field-name-taxonomyextra) is displayed on node 4Otherupgrade.taxonomy.test152UpgradePathTaxonomyTestCase->testTaxonomyUpgrade()
Term term 15 of vocabulary 8 (j=1) (field-name-taxonomyextra) is displayed on node 4Otherupgrade.taxonomy.test152UpgradePathTaxonomyTestCase->testTaxonomyUpgrade()
Term term 16 of vocabulary 9 (j=0) (field-name-taxonomyextra) is displayed on node 4Otherupgrade.taxonomy.test152UpgradePathTaxonomyTestCase->testTaxonomyUpgrade()
Term term 17 of vocabulary 9 (j=1) (field-name-taxonomyextra) is displayed on node 4Otherupgrade.taxonomy.test152UpgradePathTaxonomyTestCase->testTaxonomyUpgrade()
Term term 18 of vocabulary 9 (j=2) (field-name-taxonomyextra) is displayed on node 4Otherupgrade.taxonomy.test152UpgradePathTaxonomyTestCase->testTaxonomyUpgrade()
Term term 19 of vocabulary 10 (j=0) (field-name-taxonomyextra) is displayed on node 4Otherupgrade.taxonomy.test152UpgradePathTaxonomyTestCase->testTaxonomyUpgrade()
Term term 20 of vocabulary 11 (j=0) (field-name-taxonomyextra) is displayed on node 4Otherupgrade.taxonomy.test152UpgradePathTaxonomyTestCase->testTaxonomyUpgrade()
Term term 21 of vocabulary 11 (j=1) (field-name-taxonomyextra) is displayed on node 4Otherupgrade.taxonomy.test152UpgradePathTaxonomyTestCase->testTaxonomyUpgrade()
Term term 22 of vocabulary 12 (j=0) (field-name-taxonomyextra) is displayed on node 4Otherupgrade.taxonomy.test152UpgradePathTaxonomyTestCase->testTaxonomyUpgrade()
Term term 23 of vocabulary 12 (j=1) (field-name-taxonomyextra) is displayed on node 4Otherupgrade.taxonomy.test152UpgradePathTaxonomyTestCase->testTaxonomyUpgrade()
Term term 24 of vocabulary 12 (j=2) (field-name-taxonomyextra) is displayed on node 4Otherupgrade.taxonomy.test152UpgradePathTaxonomyTestCase->testTaxonomyUpgrade()
Term term 25 of vocabulary 13 (j=0) (field-name-taxonomy-vocabulary-13) is displayed on node 4Otherupgrade.taxonomy.test152UpgradePathTaxonomyTestCase->testTaxonomyUpgrade()
Term term 26 of vocabulary 14 (j=0) (field-name-taxonomy-vocabulary-14) is displayed on node 4Otherupgrade.taxonomy.test152UpgradePathTaxonomyTestCase->testTaxonomyUpgrade()
Term term 27 of vocabulary 14 (j=1) (field-name-taxonomy-vocabulary-14) is displayed on node 4Otherupgrade.taxonomy.test152UpgradePathTaxonomyTestCase->testTaxonomyUpgrade()
Term term 28 of vocabulary 15 (j=0) (field-name-taxonomy-vocabulary-15) is displayed on node 4Otherupgrade.taxonomy.test152UpgradePathTaxonomyTestCase->testTaxonomyUpgrade()
Term term 29 of vocabulary 15 (j=1) (field-name-taxonomyextra) is displayed on node 4Otherupgrade.taxonomy.test152UpgradePathTaxonomyTestCase->testTaxonomyUpgrade()
Term term 30 of vocabulary 15 (j=2) (field-name-taxonomyextra) is displayed on node 4Otherupgrade.taxonomy.test152UpgradePathTaxonomyTestCase->testTaxonomyUpgrade()
Term term 31 of vocabulary 16 (j=0) (field-name-taxonomy-vocabulary-16) is displayed on node 4Otherupgrade.taxonomy.test152UpgradePathTaxonomyTestCase->testTaxonomyUpgrade()
Term term 32 of vocabulary 17 (j=0) (field-name-taxonomy-vocabulary-17) is displayed on node 4Otherupgrade.taxonomy.test152UpgradePathTaxonomyTestCase->testTaxonomyUpgrade()
Term term 33 of vocabulary 17 (j=1) (field-name-taxonomyextra) is displayed on node 4Otherupgrade.taxonomy.test152UpgradePathTaxonomyTestCase->testTaxonomyUpgrade()
Term term 34 of vocabulary 18 (j=0) (field-name-taxonomy-vocabulary-18) is displayed on node 4Otherupgrade.taxonomy.test152UpgradePathTaxonomyTestCase->testTaxonomyUpgrade()
Term term 35 of vocabulary 18 (j=1) (field-name-taxonomy-vocabulary-18) is displayed on node 4Otherupgrade.taxonomy.test152UpgradePathTaxonomyTestCase->testTaxonomyUpgrade()
Term term 36 of vocabulary 18 (j=2) (field-name-taxonomy-vocabulary-18) is displayed on node 4Otherupgrade.taxonomy.test152UpgradePathTaxonomyTestCase->testTaxonomyUpgrade()
Term term 37 of vocabulary 19 (j=0) (field-name-taxonomy-vocabulary-19) is displayed on node 4Otherupgrade.taxonomy.test152UpgradePathTaxonomyTestCase->testTaxonomyUpgrade()
Term term 38 of vocabulary 20 (j=0) (field-name-taxonomy-vocabulary-20) is displayed on node 4Otherupgrade.taxonomy.test152UpgradePathTaxonomyTestCase->testTaxonomyUpgrade()
Term term 39 of vocabulary 20 (j=1) (field-name-taxonomy-vocabulary-20) is displayed on node 4Otherupgrade.taxonomy.test152UpgradePathTaxonomyTestCase->testTaxonomyUpgrade()
Term term 40 of vocabulary 21 (j=0) (field-name-taxonomy-vocabulary-21) is displayed on node 4Otherupgrade.taxonomy.test152UpgradePathTaxonomyTestCase->testTaxonomyUpgrade()
Term term 41 of vocabulary 21 (j=1) (field-name-taxonomyextra) is displayed on node 4Otherupgrade.taxonomy.test152UpgradePathTaxonomyTestCase->testTaxonomyUpgrade()
Term term 42 of vocabulary 21 (j=2) (field-name-taxonomyextra) is displayed on node 4Otherupgrade.taxonomy.test152UpgradePathTaxonomyTestCase->testTaxonomyUpgrade()
Term term 43 of vocabulary 22 (j=0) (field-name-taxonomy-vocabulary-22) is displayed on node 4Otherupgrade.taxonomy.test152UpgradePathTaxonomyTestCase->testTaxonomyUpgrade()
Term term 44 of vocabulary 23 (j=0) (field-name-taxonomy-vocabulary-23) is displayed on node 4Otherupgrade.taxonomy.test152UpgradePathTaxonomyTestCase->testTaxonomyUpgrade()
Term term 46 of vocabulary 24 (j=0) (field-name-taxonomy-vocabulary-24) is displayed on node 4Otherupgrade.taxonomy.test152UpgradePathTaxonomyTestCase->testTaxonomyUpgrade()
Term term 47 of vocabulary 24 (j=1) (field-name-taxonomy-vocabulary-24) is displayed on node 4Otherupgrade.taxonomy.test152UpgradePathTaxonomyTestCase->testTaxonomyUpgrade()
Term term 48 of vocabulary 24 (j=2) (field-name-taxonomy-vocabulary-24) is displayed on node 4Otherupgrade.taxonomy.test152UpgradePathTaxonomyTestCase->testTaxonomyUpgrade()
strpos(): Empty delimiterWarningdrupal_web_test_case.php2585DrupalWebTestCase->assertRaw()
Term term 48 of vocabulary 24 (j=2) (field-name-taxonomy-vocabulary-24) is displayed on node 4 vid 7.Otherupgrade.taxonomy.test181UpgradePathTaxonomyTestCase->testTaxonomyUpgrade()
strpos(): Empty delimiterWarningdrupal_web_test_case.php2585DrupalWebTestCase->assertRaw()
Term term 48 of vocabulary 24 (j=2) (field-name-taxonomy-vocabulary-24) is displayed on node 4 7.Otherupgrade.taxonomy.test184UpgradePathTaxonomyTestCase->testTaxonomyUpgrade()
Term term 1 of vocabulary 1 (j=0) (field-name-taxonomyextra) is displayed on node 5Otherupgrade.taxonomy.test152UpgradePathTaxonomyTestCase->testTaxonomyUpgrade()
Term term 2 of vocabulary 2 (j=0) (field-name-taxonomyextra) is displayed on node 5Otherupgrade.taxonomy.test152UpgradePathTaxonomyTestCase->testTaxonomyUpgrade()
Term term 3 of vocabulary 2 (j=1) (field-name-taxonomyextra) is displayed on node 5Otherupgrade.taxonomy.test152UpgradePathTaxonomyTestCase->testTaxonomyUpgrade()
Term term 4 of vocabulary 3 (j=0) (field-name-taxonomyextra) is displayed on node 5Otherupgrade.taxonomy.test152UpgradePathTaxonomyTestCase->testTaxonomyUpgrade()
Term term 6 of vocabulary 3 (j=2) (field-name-taxonomyextra) is displayed on node 5Otherupgrade.taxonomy.test152UpgradePathTaxonomyTestCase->testTaxonomyUpgrade()
Term term 7 of vocabulary 4 (j=0) (field-name-taxonomyextra) is displayed on node 5Otherupgrade.taxonomy.test152UpgradePathTaxonomyTestCase->testTaxonomyUpgrade()
Term term 8 of vocabulary 5 (j=0) (field-name-taxonomyextra) is displayed on node 5Otherupgrade.taxonomy.test152UpgradePathTaxonomyTestCase->testTaxonomyUpgrade()
Term term 9 of vocabulary 5 (j=1) (field-name-taxonomyextra) is displayed on node 5Otherupgrade.taxonomy.test152UpgradePathTaxonomyTestCase->testTaxonomyUpgrade()
Term term 10 of vocabulary 6 (j=0) (field-name-taxonomyextra) is displayed on node 5Otherupgrade.taxonomy.test152UpgradePathTaxonomyTestCase->testTaxonomyUpgrade()
Term term 11 of vocabulary 6 (j=1) (field-name-taxonomyextra) is displayed on node 5Otherupgrade.taxonomy.test152UpgradePathTaxonomyTestCase->testTaxonomyUpgrade()
Term term 12 of vocabulary 6 (j=2) (field-name-taxonomyextra) is displayed on node 5Otherupgrade.taxonomy.test152UpgradePathTaxonomyTestCase->testTaxonomyUpgrade()
Term term 13 of vocabulary 7 (j=0) (field-name-taxonomyextra) is displayed on node 5Otherupgrade.taxonomy.test152UpgradePathTaxonomyTestCase->testTaxonomyUpgrade()
Term term 14 of vocabulary 8 (j=0) (field-name-taxonomyextra) is displayed on node 5Otherupgrade.taxonomy.test152UpgradePathTaxonomyTestCase->testTaxonomyUpgrade()
Term term 15 of vocabulary 8 (j=1) (field-name-taxonomyextra) is displayed on node 5Otherupgrade.taxonomy.test152UpgradePathTaxonomyTestCase->testTaxonomyUpgrade()
Term term 16 of vocabulary 9 (j=0) (field-name-taxonomyextra) is displayed on node 5Otherupgrade.taxonomy.test152UpgradePathTaxonomyTestCase->testTaxonomyUpgrade()
Term term 17 of vocabulary 9 (j=1) (field-name-taxonomyextra) is displayed on node 5Otherupgrade.taxonomy.test152UpgradePathTaxonomyTestCase->testTaxonomyUpgrade()
Term term 18 of vocabulary 9 (j=2) (field-name-taxonomyextra) is displayed on node 5Otherupgrade.taxonomy.test152UpgradePathTaxonomyTestCase->testTaxonomyUpgrade()
Term term 19 of vocabulary 10 (j=0) (field-name-taxonomyextra) is displayed on node 5Otherupgrade.taxonomy.test152UpgradePathTaxonomyTestCase->testTaxonomyUpgrade()
Term term 20 of vocabulary 11 (j=0) (field-name-taxonomyextra) is displayed on node 5Otherupgrade.taxonomy.test152UpgradePathTaxonomyTestCase->testTaxonomyUpgrade()
Term term 21 of vocabulary 11 (j=1) (field-name-taxonomyextra) is displayed on node 5Otherupgrade.taxonomy.test152UpgradePathTaxonomyTestCase->testTaxonomyUpgrade()
Term term 22 of vocabulary 12 (j=0) (field-name-taxonomyextra) is displayed on node 5Otherupgrade.taxonomy.test152UpgradePathTaxonomyTestCase->testTaxonomyUpgrade()
Term term 23 of vocabulary 12 (j=1) (field-name-taxonomyextra) is displayed on node 5Otherupgrade.taxonomy.test152UpgradePathTaxonomyTestCase->testTaxonomyUpgrade()
Term term 24 of vocabulary 12 (j=2) (field-name-taxonomyextra) is displayed on node 5Otherupgrade.taxonomy.test152UpgradePathTaxonomyTestCase->testTaxonomyUpgrade()
Term term 25 of vocabulary 13 (j=0) (field-name-taxonomy-vocabulary-13) is displayed on node 5Otherupgrade.taxonomy.test152UpgradePathTaxonomyTestCase->testTaxonomyUpgrade()
Term term 26 of vocabulary 14 (j=0) (field-name-taxonomy-vocabulary-14) is displayed on node 5Otherupgrade.taxonomy.test152UpgradePathTaxonomyTestCase->testTaxonomyUpgrade()
Term term 27 of vocabulary 14 (j=1) (field-name-taxonomy-vocabulary-14) is displayed on node 5Otherupgrade.taxonomy.test152UpgradePathTaxonomyTestCase->testTaxonomyUpgrade()
Term term 28 of vocabulary 15 (j=0) (field-name-taxonomy-vocabulary-15) is displayed on node 5Otherupgrade.taxonomy.test152UpgradePathTaxonomyTestCase->testTaxonomyUpgrade()
Term term 29 of vocabulary 15 (j=1) (field-name-taxonomyextra) is displayed on node 5Otherupgrade.taxonomy.test152UpgradePathTaxonomyTestCase->testTaxonomyUpgrade()
Term term 30 of vocabulary 15 (j=2) (field-name-taxonomyextra) is displayed on node 5Otherupgrade.taxonomy.test152UpgradePathTaxonomyTestCase->testTaxonomyUpgrade()
Term term 31 of vocabulary 16 (j=0) (field-name-taxonomy-vocabulary-16) is displayed on node 5Otherupgrade.taxonomy.test152UpgradePathTaxonomyTestCase->testTaxonomyUpgrade()
Term term 32 of vocabulary 17 (j=0) (field-name-taxonomy-vocabulary-17) is displayed on node 5Otherupgrade.taxonomy.test152UpgradePathTaxonomyTestCase->testTaxonomyUpgrade()
Term term 33 of vocabulary 17 (j=1) (field-name-taxonomyextra) is displayed on node 5Otherupgrade.taxonomy.test152UpgradePathTaxonomyTestCase->testTaxonomyUpgrade()
Term term 34 of vocabulary 18 (j=0) (field-name-taxonomy-vocabulary-18) is displayed on node 5Otherupgrade.taxonomy.test152UpgradePathTaxonomyTestCase->testTaxonomyUpgrade()
Term term 35 of vocabulary 18 (j=1) (field-name-taxonomy-vocabulary-18) is displayed on node 5Otherupgrade.taxonomy.test152UpgradePathTaxonomyTestCase->testTaxonomyUpgrade()
Term term 36 of vocabulary 18 (j=2) (field-name-taxonomy-vocabulary-18) is displayed on node 5Otherupgrade.taxonomy.test152UpgradePathTaxonomyTestCase->testTaxonomyUpgrade()
Term term 37 of vocabulary 19 (j=0) (field-name-taxonomy-vocabulary-19) is displayed on node 5Otherupgrade.taxonomy.test152UpgradePathTaxonomyTestCase->testTaxonomyUpgrade()
Term term 38 of vocabulary 20 (j=0) (field-name-taxonomy-vocabulary-20) is displayed on node 5Otherupgrade.taxonomy.test152UpgradePathTaxonomyTestCase->testTaxonomyUpgrade()
Term term 39 of vocabulary 20 (j=1) (field-name-taxonomy-vocabulary-20) is displayed on node 5Otherupgrade.taxonomy.test152UpgradePathTaxonomyTestCase->testTaxonomyUpgrade()
Term term 40 of vocabulary 21 (j=0) (field-name-taxonomy-vocabulary-21) is displayed on node 5Otherupgrade.taxonomy.test152UpgradePathTaxonomyTestCase->testTaxonomyUpgrade()
Term term 41 of vocabulary 21 (j=1) (field-name-taxonomyextra) is displayed on node 5Otherupgrade.taxonomy.test152UpgradePathTaxonomyTestCase->testTaxonomyUpgrade()
Term term 42 of vocabulary 21 (j=2) (field-name-taxonomyextra) is displayed on node 5Otherupgrade.taxonomy.test152UpgradePathTaxonomyTestCase->testTaxonomyUpgrade()
Term term 43 of vocabulary 22 (j=0) (field-name-taxonomy-vocabulary-22) is displayed on node 5Otherupgrade.taxonomy.test152UpgradePathTaxonomyTestCase->testTaxonomyUpgrade()
Term term 45 of vocabulary 23 (j=1) (field-name-taxonomy-vocabulary-23) is displayed on node 5Otherupgrade.taxonomy.test152UpgradePathTaxonomyTestCase->testTaxonomyUpgrade()
Term term 46 of vocabulary 24 (j=0) (field-name-taxonomy-vocabulary-24) is displayed on node 5Otherupgrade.taxonomy.test152UpgradePathTaxonomyTestCase->testTaxonomyUpgrade()
Term term 47 of vocabulary 24 (j=1) (field-name-taxonomy-vocabulary-24) is displayed on node 5Otherupgrade.taxonomy.test152UpgradePathTaxonomyTestCase->testTaxonomyUpgrade()
Term term 48 of vocabulary 24 (j=2) (field-name-taxonomy-vocabulary-24) is displayed on node 5Otherupgrade.taxonomy.test152UpgradePathTaxonomyTestCase->testTaxonomyUpgrade()
strpos(): Empty delimiterWarningdrupal_web_test_case.php2585DrupalWebTestCase->assertRaw()
Term term 48 of vocabulary 24 (j=2) (field-name-taxonomy-vocabulary-24) is displayed on node 5 vid 9.Otherupgrade.taxonomy.test181UpgradePathTaxonomyTestCase->testTaxonomyUpgrade()
strpos(): Empty delimiterWarningdrupal_web_test_case.php2585DrupalWebTestCase->assertRaw()
Term term 48 of vocabulary 24 (j=2) (field-name-taxonomy-vocabulary-24) is displayed on node 5 9.Otherupgrade.taxonomy.test184UpgradePathTaxonomyTestCase->testTaxonomyUpgrade()
Term term 1 of vocabulary 1 (j=0) (field-name-taxonomyextra) is displayed on node 6Otherupgrade.taxonomy.test152UpgradePathTaxonomyTestCase->testTaxonomyUpgrade()
Term term 2 of vocabulary 2 (j=0) (field-name-taxonomyextra) is displayed on node 6Otherupgrade.taxonomy.test152UpgradePathTaxonomyTestCase->testTaxonomyUpgrade()
Term term 3 of vocabulary 2 (j=1) (field-name-taxonomyextra) is displayed on node 6Otherupgrade.taxonomy.test152UpgradePathTaxonomyTestCase->testTaxonomyUpgrade()
Term term 4 of vocabulary 3 (j=0) (field-name-taxonomyextra) is displayed on node 6Otherupgrade.taxonomy.test152UpgradePathTaxonomyTestCase->testTaxonomyUpgrade()
Term term 5 of vocabulary 3 (j=1) (field-name-taxonomyextra) is displayed on node 6Otherupgrade.taxonomy.test152UpgradePathTaxonomyTestCase->testTaxonomyUpgrade()
Term term 7 of vocabulary 4 (j=0) (field-name-taxonomyextra) is displayed on node 6Otherupgrade.taxonomy.test152UpgradePathTaxonomyTestCase->testTaxonomyUpgrade()
Term term 8 of vocabulary 5 (j=0) (field-name-taxonomyextra) is displayed on node 6Otherupgrade.taxonomy.test152UpgradePathTaxonomyTestCase->testTaxonomyUpgrade()
Term term 9 of vocabulary 5 (j=1) (field-name-taxonomyextra) is displayed on node 6Otherupgrade.taxonomy.test152UpgradePathTaxonomyTestCase->testTaxonomyUpgrade()
Term term 10 of vocabulary 6 (j=0) (field-name-taxonomyextra) is displayed on node 6Otherupgrade.taxonomy.test152UpgradePathTaxonomyTestCase->testTaxonomyUpgrade()
Term term 11 of vocabulary 6 (j=1) (field-name-taxonomyextra) is displayed on node 6Otherupgrade.taxonomy.test152UpgradePathTaxonomyTestCase->testTaxonomyUpgrade()
Term term 12 of vocabulary 6 (j=2) (field-name-taxonomyextra) is displayed on node 6Otherupgrade.taxonomy.test152UpgradePathTaxonomyTestCase->testTaxonomyUpgrade()
Term term 13 of vocabulary 7 (j=0) (field-name-taxonomyextra) is displayed on node 6Otherupgrade.taxonomy.test152UpgradePathTaxonomyTestCase->testTaxonomyUpgrade()
Term term 14 of vocabulary 8 (j=0) (field-name-taxonomyextra) is displayed on node 6Otherupgrade.taxonomy.test152UpgradePathTaxonomyTestCase->testTaxonomyUpgrade()
Term term 15 of vocabulary 8 (j=1) (field-name-taxonomyextra) is displayed on node 6Otherupgrade.taxonomy.test152UpgradePathTaxonomyTestCase->testTaxonomyUpgrade()
Term term 16 of vocabulary 9 (j=0) (field-name-taxonomyextra) is displayed on node 6Otherupgrade.taxonomy.test152UpgradePathTaxonomyTestCase->testTaxonomyUpgrade()
Term term 17 of vocabulary 9 (j=1) (field-name-taxonomyextra) is displayed on node 6Otherupgrade.taxonomy.test152UpgradePathTaxonomyTestCase->testTaxonomyUpgrade()
Term term 18 of vocabulary 9 (j=2) (field-name-taxonomyextra) is displayed on node 6Otherupgrade.taxonomy.test152UpgradePathTaxonomyTestCase->testTaxonomyUpgrade()
Term term 19 of vocabulary 10 (j=0) (field-name-taxonomyextra) is displayed on node 6Otherupgrade.taxonomy.test152UpgradePathTaxonomyTestCase->testTaxonomyUpgrade()
Term term 20 of vocabulary 11 (j=0) (field-name-taxonomyextra) is displayed on node 6Otherupgrade.taxonomy.test152UpgradePathTaxonomyTestCase->testTaxonomyUpgrade()
Term term 21 of vocabulary 11 (j=1) (field-name-taxonomyextra) is displayed on node 6Otherupgrade.taxonomy.test152UpgradePathTaxonomyTestCase->testTaxonomyUpgrade()
Term term 22 of vocabulary 12 (j=0) (field-name-taxonomyextra) is displayed on node 6Otherupgrade.taxonomy.test152UpgradePathTaxonomyTestCase->testTaxonomyUpgrade()
Term term 23 of vocabulary 12 (j=1) (field-name-taxonomyextra) is displayed on node 6Otherupgrade.taxonomy.test152UpgradePathTaxonomyTestCase->testTaxonomyUpgrade()
Term term 24 of vocabulary 12 (j=2) (field-name-taxonomyextra) is displayed on node 6Otherupgrade.taxonomy.test152UpgradePathTaxonomyTestCase->testTaxonomyUpgrade()
Term term 25 of vocabulary 13 (j=0) (field-name-taxonomy-vocabulary-13) is displayed on node 6Otherupgrade.taxonomy.test152UpgradePathTaxonomyTestCase->testTaxonomyUpgrade()
Term term 26 of vocabulary 14 (j=0) (field-name-taxonomy-vocabulary-14) is displayed on node 6Otherupgrade.taxonomy.test152UpgradePathTaxonomyTestCase->testTaxonomyUpgrade()
Term term 27 of vocabulary 14 (j=1) (field-name-taxonomy-vocabulary-14) is displayed on node 6Otherupgrade.taxonomy.test152UpgradePathTaxonomyTestCase->testTaxonomyUpgrade()
Term term 28 of vocabulary 15 (j=0) (field-name-taxonomy-vocabulary-15) is displayed on node 6Otherupgrade.taxonomy.test152UpgradePathTaxonomyTestCase->testTaxonomyUpgrade()
Term term 29 of vocabulary 15 (j=1) (field-name-taxonomyextra) is displayed on node 6Otherupgrade.taxonomy.test152UpgradePathTaxonomyTestCase->testTaxonomyUpgrade()
Term term 30 of vocabulary 15 (j=2) (field-name-taxonomyextra) is displayed on node 6Otherupgrade.taxonomy.test152UpgradePathTaxonomyTestCase->testTaxonomyUpgrade()
Term term 31 of vocabulary 16 (j=0) (field-name-taxonomy-vocabulary-16) is displayed on node 6Otherupgrade.taxonomy.test152UpgradePathTaxonomyTestCase->testTaxonomyUpgrade()
Term term 32 of vocabulary 17 (j=0) (field-name-taxonomy-vocabulary-17) is displayed on node 6Otherupgrade.taxonomy.test152UpgradePathTaxonomyTestCase->testTaxonomyUpgrade()
Term term 33 of vocabulary 17 (j=1) (field-name-taxonomyextra) is displayed on node 6Otherupgrade.taxonomy.test152UpgradePathTaxonomyTestCase->testTaxonomyUpgrade()
Term term 34 of vocabulary 18 (j=0) (field-name-taxonomy-vocabulary-18) is displayed on node 6Otherupgrade.taxonomy.test152UpgradePathTaxonomyTestCase->testTaxonomyUpgrade()
Term term 35 of vocabulary 18 (j=1) (field-name-taxonomy-vocabulary-18) is displayed on node 6Otherupgrade.taxonomy.test152UpgradePathTaxonomyTestCase->testTaxonomyUpgrade()
Term term 36 of vocabulary 18 (j=2) (field-name-taxonomy-vocabulary-18) is displayed on node 6Otherupgrade.taxonomy.test152UpgradePathTaxonomyTestCase->testTaxonomyUpgrade()
Term term 37 of vocabulary 19 (j=0) (field-name-taxonomy-vocabulary-19) is displayed on node 6Otherupgrade.taxonomy.test152UpgradePathTaxonomyTestCase->testTaxonomyUpgrade()
Term term 38 of vocabulary 20 (j=0) (field-name-taxonomy-vocabulary-20) is displayed on node 6Otherupgrade.taxonomy.test152UpgradePathTaxonomyTestCase->testTaxonomyUpgrade()
Term term 39 of vocabulary 20 (j=1) (field-name-taxonomy-vocabulary-20) is displayed on node 6Otherupgrade.taxonomy.test152UpgradePathTaxonomyTestCase->testTaxonomyUpgrade()
Term term 40 of vocabulary 21 (j=0) (field-name-taxonomy-vocabulary-21) is displayed on node 6Otherupgrade.taxonomy.test152UpgradePathTaxonomyTestCase->testTaxonomyUpgrade()
Term term 41 of vocabulary 21 (j=1) (field-name-taxonomyextra) is displayed on node 6Otherupgrade.taxonomy.test152UpgradePathTaxonomyTestCase->testTaxonomyUpgrade()
Term term 42 of vocabulary 21 (j=2) (field-name-taxonomyextra) is displayed on node 6Otherupgrade.taxonomy.test152UpgradePathTaxonomyTestCase->testTaxonomyUpgrade()
Term term 44 of vocabulary 23 (j=0) (field-name-taxonomy-vocabulary-23) is displayed on node 6Otherupgrade.taxonomy.test152UpgradePathTaxonomyTestCase->testTaxonomyUpgrade()
Term term 45 of vocabulary 23 (j=1) (field-name-taxonomyextra) is displayed on node 6Otherupgrade.taxonomy.test152UpgradePathTaxonomyTestCase->testTaxonomyUpgrade()
Term term 46 of vocabulary 24 (j=0) (field-name-taxonomy-vocabulary-24) is displayed on node 6Otherupgrade.taxonomy.test152UpgradePathTaxonomyTestCase->testTaxonomyUpgrade()
Term term 47 of vocabulary 24 (j=1) (field-name-taxonomy-vocabulary-24) is displayed on node 6Otherupgrade.taxonomy.test152UpgradePathTaxonomyTestCase->testTaxonomyUpgrade()
Term term 48 of vocabulary 24 (j=2) (field-name-taxonomy-vocabulary-24) is displayed on node 6Otherupgrade.taxonomy.test152UpgradePathTaxonomyTestCase->testTaxonomyUpgrade()
strpos(): Empty delimiterWarningdrupal_web_test_case.php2585DrupalWebTestCase->assertRaw()
Term term 48 of vocabulary 24 (j=2) (field-name-taxonomy-vocabulary-24) is displayed on node 6 vid 11.Otherupgrade.taxonomy.test181UpgradePathTaxonomyTestCase->testTaxonomyUpgrade()
strpos(): Empty delimiterWarningdrupal_web_test_case.php2585DrupalWebTestCase->assertRaw()
Term term 48 of vocabulary 24 (j=2) (field-name-taxonomy-vocabulary-24) is displayed on node 6 11.Otherupgrade.taxonomy.test184UpgradePathTaxonomyTestCase->testTaxonomyUpgrade()
Term term 1 of vocabulary 1 (j=0) (field-name-taxonomyextra) is displayed on node 7Otherupgrade.taxonomy.test152UpgradePathTaxonomyTestCase->testTaxonomyUpgrade()
Term term 2 of vocabulary 2 (j=0) (field-name-taxonomyextra) is displayed on node 7Otherupgrade.taxonomy.test152UpgradePathTaxonomyTestCase->testTaxonomyUpgrade()
Term term 3 of vocabulary 2 (j=1) (field-name-taxonomyextra) is displayed on node 7Otherupgrade.taxonomy.test152UpgradePathTaxonomyTestCase->testTaxonomyUpgrade()
Term term 4 of vocabulary 3 (j=0) (field-name-taxonomyextra) is displayed on node 7Otherupgrade.taxonomy.test152UpgradePathTaxonomyTestCase->testTaxonomyUpgrade()
Term term 5 of vocabulary 3 (j=1) (field-name-taxonomyextra) is displayed on node 7Otherupgrade.taxonomy.test152UpgradePathTaxonomyTestCase->testTaxonomyUpgrade()
Term term 6 of vocabulary 3 (j=2) (field-name-taxonomyextra) is displayed on node 7Otherupgrade.taxonomy.test152UpgradePathTaxonomyTestCase->testTaxonomyUpgrade()
Term term 8 of vocabulary 5 (j=0) (field-name-taxonomyextra) is displayed on node 7Otherupgrade.taxonomy.test152UpgradePathTaxonomyTestCase->testTaxonomyUpgrade()
Term term 9 of vocabulary 5 (j=1) (field-name-taxonomyextra) is displayed on node 7Otherupgrade.taxonomy.test152UpgradePathTaxonomyTestCase->testTaxonomyUpgrade()
ExpandUpdate contrib functionality (UpdateTestContribCase) [Update]1681318
MessageGroupFilenameLineFunctionStatus
strpos(): Empty delimiterWarningdrupal_web_test_case.php2585DrupalWebTestCase->assertRaw()
Raw "" foundOtherupdate.test251UpdateTestContribCase->testNoReleasesAvailable()
strpos(): Empty delimiterWarningdrupal_web_test_case.php2605DrupalWebTestCase->assertNoRaw()
strpos(): Empty delimiterWarningdrupal_web_test_case.php2585DrupalWebTestCase->assertRaw()
Link to the Drupal project appears.Otherupdate.test48UpdateTestHelper->standardTests()
strpos(): Empty delimiterWarningdrupal_web_test_case.php2585DrupalWebTestCase->assertRaw()
Link to aaa_update_test project appears.Otherupdate.test284UpdateTestContribCase->testUpdateContribBasic()
strpos(): Empty delimiterWarningdrupal_web_test_case.php2585DrupalWebTestCase->assertRaw()
Link to the Drupal project appears.Otherupdate.test48UpdateTestHelper->standardTests()
strpos(): Empty delimiterWarningdrupal_web_test_case.php2605DrupalWebTestCase->assertNoRaw()
strpos(): Empty delimiterWarningdrupal_web_test_case.php2585DrupalWebTestCase->assertRaw()
Link to bbb_update_test project appears.Otherupdate.test347UpdateTestContribCase->testUpdateContribOrder()
strpos(): Empty delimiterWarningdrupal_web_test_case.php2585DrupalWebTestCase->assertRaw()
Link to bbb_update_test project appears.Otherupdate.test348UpdateTestContribCase->testUpdateContribOrder()
strpos(): Empty delimiterWarningdrupal_web_test_case.php2585DrupalWebTestCase->assertRaw()
Link to the Update test base theme project appears.Otherupdate.test397UpdateTestContribCase->testUpdateBaseThemeSecurityUpdate()
strpos(): Empty delimiterWarningdrupal_web_test_case.php2585DrupalWebTestCase->assertRaw()
Link to the Update test base theme project appears.Otherupdate.test445UpdateTestContribCase->testUpdateShowDisabledThemes()
strpos(): Empty delimiterWarningdrupal_web_test_case.php2585DrupalWebTestCase->assertRaw()
Link to the Update test subtheme project appears.Otherupdate.test446UpdateTestContribCase->testUpdateShowDisabledThemes()
strpos(): Empty delimiterWarningdrupal_web_test_case.php2605DrupalWebTestCase->assertNoRaw()
strpos(): Empty delimiterWarningdrupal_web_test_case.php2605DrupalWebTestCase->assertNoRaw()
strpos(): Empty delimiterWarningdrupal_web_test_case.php2585DrupalWebTestCase->assertRaw()
Link to aaa_update_test project appears.Otherupdate.test507UpdateTestContribCase->testUpdateBrokenFetchURL()
strpos(): Empty delimiterWarningdrupal_web_test_case.php2605DrupalWebTestCase->assertNoRaw()
strpos(): Empty delimiterWarningdrupal_web_test_case.php2585DrupalWebTestCase->assertRaw()
Link to bbb_update_test project appears.Otherupdate.test509UpdateTestContribCase->testUpdateBrokenFetchURL()
ExpandUpdate core functionality (UpdateCoreTestCase) [Update]15199
MessageGroupFilenameLineFunctionStatus
strpos(): Empty delimiterWarningdrupal_web_test_case.php2585DrupalWebTestCase->assertRaw()
Link to the Drupal project appears.Otherupdate.test48UpdateTestHelper->standardTests()
strpos(): Empty delimiterWarningdrupal_web_test_case.php2585DrupalWebTestCase->assertRaw()
Link to the Drupal project appears.Otherupdate.test48UpdateTestHelper->standardTests()
strpos(): Empty delimiterWarningdrupal_web_test_case.php2585DrupalWebTestCase->assertRaw()
Link to release appears.Otherupdate.test92UpdateCoreTestCase->testNormalUpdateAvailable()
strpos(): Empty delimiterWarningdrupal_web_test_case.php2585DrupalWebTestCase->assertRaw()
Link to download appears.Otherupdate.test93UpdateCoreTestCase->testNormalUpdateAvailable()
strpos(): Empty delimiterWarningdrupal_web_test_case.php2585DrupalWebTestCase->assertRaw()
Link to release notes appears.Otherupdate.test94UpdateCoreTestCase->testNormalUpdateAvailable()
strpos(): Empty delimiterWarningdrupal_web_test_case.php2585DrupalWebTestCase->assertRaw()
Link to the Drupal project appears.Otherupdate.test48UpdateTestHelper->standardTests()
strpos(): Empty delimiterWarningdrupal_web_test_case.php2585DrupalWebTestCase->assertRaw()
Link to release appears.Otherupdate.test107UpdateCoreTestCase->testSecurityUpdateAvailable()
strpos(): Empty delimiterWarningdrupal_web_test_case.php2585DrupalWebTestCase->assertRaw()
Link to download appears.Otherupdate.test108UpdateCoreTestCase->testSecurityUpdateAvailable()
strpos(): Empty delimiterWarningdrupal_web_test_case.php2585DrupalWebTestCase->assertRaw()
Link to release notes appears.Otherupdate.test109UpdateCoreTestCase->testSecurityUpdateAvailable()
ExpandURL generation tests (CommonURLUnitTest) [System]5240
MessageGroupFilenameLineFunctionStatus
XSS attack <SCRIPT>alert('XSS')</SCRIPT> was filteredOthercommon.test86CommonURLUnitTest->testLXSS()
Class active is present on link to the current pageOthercommon.test94CommonURLUnitTest->testLActiveClass()
Custom class y1SwlB7w is present on link when requestedOthercommon.test103CommonURLUnitTest->testLCustomClass()
Class active is present on link to the current pageOthercommon.test104CommonURLUnitTest->testLCustomClass()
LeafUser administration (UserAdminTestCase) [User]6411
LeafUser blocks (UserBlocksUnitTests) [User]4030

All

Test namePassFailException
Leaf403 functionality (AccessDeniedTestCase) [System]7500
Leaf404 functionality (PageNotFoundTestCase) [System]1800
LeafActions configuration (ActionsConfigurationTestCase) [Actions]3800
LeafActions executing in a potentially infinite loop (ActionLoopTestCase) [Actions]2500
LeafAdd feed functionality (AddFeedTestCase) [Aggregator]2800
LeafAdmin theme block admin accessibility (BlockAdminThemeTestCase) [Block]1800
LeafAdministrative pages (SystemAdminTestCase) [System]19100
LeafAdvanced search form (SearchAdvancedSearchForm) [Search]3100
LeafAJAX command form values (AJAXFormValuesTestCase) [AJAX]2800
LeafAJAX commands (AJAXCommandsTestCase) [AJAX]6800
LeafAJAX framework (AJAXFrameworkTestCase) [AJAX]1000
LeafAJAX multi form (AJAXMultiFormTestCase) [AJAX]3500
LeafAnonymous comments (CommentAnonymous) [Comment]15600
LeafAuthmap assignment (UserAuthmapAssignmentTestCase) [User]800
LeafAuthorize API (SystemAuthorizeCase) [System]1500
LeafAutocompletion (ProfileTestAutocomplete) [Profile]5400
LeafBasic SQL syntax tests (DatabaseBasicSyntaxTestCase) [Database]2600
LeafBasic upgrade path (BasicUpgradePath) [Upgrade path]7000
LeafBatch percentages (BatchPercentagesUnitTestCase) [Batch API]1300
LeafBatch processing (BatchProcessingTestCase) [Batch API]15400
LeafBatch progress page (BatchPageTestCase) [Batch API]1500
LeafBlock availability (NodeBlockTestCase) [Node]1800
LeafBlock availability (PollBlockTestCase) [Poll]11800
LeafBlock availability (ProfileBlockTestCase) [Profile]9000
LeafBlock availability (SearchBlockTestCase) [Search]5800
LeafBlock caching (BlockCacheTestCase) [Block]22800
ExpandBlock functionality (BlockTestCase) [Block]31122
MessageGroupFilenameLineFunctionStatus
strpos(): Empty delimiterWarningdrupal_web_test_case.php2585DrupalWebTestCase->assertRaw()
Add block link is present on block overview page for default theme.Otherblock.test49BlockTestCase->testCustomBlock()
strpos(): Empty delimiterWarningdrupal_web_test_case.php2585DrupalWebTestCase->assertRaw()
Add block link is present on block overview page for non-default theme.Otherblock.test51BlockTestCase->testCustomBlock()
LeafBlock functionality (SystemBlockTestCase) [System]3400
LeafBlock HTML id (BlockHTMLIdTestCase) [Block]1500
ExpandBlog functionality (BlogTestCase) [Blog]23744
MessageGroupFilenameLineFunctionStatus
strpos(): Empty delimiterWarningdrupal_web_test_case.php2585DrupalWebTestCase->assertRaw()
Breadcrumbs were displayedOtherblog.test149BlogTestCase->verifyBlogs()
strpos(): Empty delimiterWarningdrupal_web_test_case.php2585DrupalWebTestCase->assertRaw()
Breadcrumbs were displayedOtherblog.test149BlogTestCase->verifyBlogs()
strpos(): Empty delimiterWarningdrupal_web_test_case.php2585DrupalWebTestCase->assertRaw()
Breadcrumbs were displayedOtherblog.test149BlogTestCase->verifyBlogs()
strpos(): Empty delimiterWarningdrupal_web_test_case.php2585DrupalWebTestCase->assertRaw()
Breadcrumbs were displayedOtherblog.test149BlogTestCase->verifyBlogs()
ExpandBook functionality (BookTestCase) [Book]3281818
MessageGroupFilenameLineFunctionStatus
strpos(): Empty delimiterWarningdrupal_web_test_case.php2585DrupalWebTestCase->assertRaw()
Next page link found.Otherbook.test141BookTestCase->checkBookNode()
strpos(): Empty delimiterWarningdrupal_web_test_case.php2585DrupalWebTestCase->assertRaw()
Previous page link found.Otherbook.test133BookTestCase->checkBookNode()
strpos(): Empty delimiterWarningdrupal_web_test_case.php2585DrupalWebTestCase->assertRaw()
Up page link found.Otherbook.test137BookTestCase->checkBookNode()
strpos(): Empty delimiterWarningdrupal_web_test_case.php2585DrupalWebTestCase->assertRaw()
Next page link found.Otherbook.test141BookTestCase->checkBookNode()
strpos(): Empty delimiterWarningdrupal_web_test_case.php2585DrupalWebTestCase->assertRaw()
Previous page link found.Otherbook.test133BookTestCase->checkBookNode()
strpos(): Empty delimiterWarningdrupal_web_test_case.php2585DrupalWebTestCase->assertRaw()
Up page link found.Otherbook.test137BookTestCase->checkBookNode()
strpos(): Empty delimiterWarningdrupal_web_test_case.php2585DrupalWebTestCase->assertRaw()
Next page link found.Otherbook.test141BookTestCase->checkBookNode()
strpos(): Empty delimiterWarningdrupal_web_test_case.php2585DrupalWebTestCase->assertRaw()
Previous page link found.Otherbook.test133BookTestCase->checkBookNode()
strpos(): Empty delimiterWarningdrupal_web_test_case.php2585DrupalWebTestCase->assertRaw()
Up page link found.Otherbook.test137BookTestCase->checkBookNode()
strpos(): Empty delimiterWarningdrupal_web_test_case.php2585DrupalWebTestCase->assertRaw()
Next page link found.Otherbook.test141BookTestCase->checkBookNode()
strpos(): Empty delimiterWarningdrupal_web_test_case.php2585DrupalWebTestCase->assertRaw()
Previous page link found.Otherbook.test133BookTestCase->checkBookNode()
strpos(): Empty delimiterWarningdrupal_web_test_case.php2585DrupalWebTestCase->assertRaw()
Up page link found.Otherbook.test137BookTestCase->checkBookNode()
strpos(): Empty delimiterWarningdrupal_web_test_case.php2585DrupalWebTestCase->assertRaw()
Next page link found.Otherbook.test141BookTestCase->checkBookNode()
strpos(): Empty delimiterWarningdrupal_web_test_case.php2585DrupalWebTestCase->assertRaw()
Previous page link found.Otherbook.test133BookTestCase->checkBookNode()
strpos(): Empty delimiterWarningdrupal_web_test_case.php2585DrupalWebTestCase->assertRaw()
Up page link found.Otherbook.test137BookTestCase->checkBookNode()
strpos(): Empty delimiterWarningdrupal_web_test_case.php2585DrupalWebTestCase->assertRaw()
Next page link found.Otherbook.test141BookTestCase->checkBookNode()
strpos(): Empty delimiterWarningdrupal_web_test_case.php2585DrupalWebTestCase->assertRaw()
Previous page link found.Otherbook.test133BookTestCase->checkBookNode()
strpos(): Empty delimiterWarningdrupal_web_test_case.php2585DrupalWebTestCase->assertRaw()
Up page link found.Otherbook.test137BookTestCase->checkBookNode()
LeafBoot and exit hook invocation (HookBootExitTestCase) [Bootstrap]1800
LeafBreadcrumbs (MenuBreadcrumbTestCase) [Menu]41000
LeafCache clear test (CacheClearCase) [Cache]1300
LeafCache emptiness test (CacheIsEmptyCase) [Cache]500
LeafCache saving test (CacheSavingCase) [Cache]500
LeafCancel account (UserCancelTestCase) [User]27300
ExpandCascading stylesheets (CascadingStylesheetsTestCase) [System]1780
MessageGroupFilenameLineFunctionStatus
Rendered CSS includes the added stylesheet.Othercommon.test637CascadingStylesheetsTestCase->testRenderFile()
Rendering an external CSS file.Othercommon.test649CascadingStylesheetsTestCase->testRenderExternal()
Rendering preprocessed inline CSS adds it to the page.Othercommon.test660CascadingStylesheetsTestCase->testRenderInlinePreprocess()
Rendering non-preprocessed inline CSS adds it to the page.Othercommon.test670CascadingStylesheetsTestCase->testRenderInlineNoPreprocess()
The CSS files are in the expected order.Othercommon.test733CascadingStylesheetsTestCase->testRenderOrder()
The overriding CSS file is output.Othercommon.test748CascadingStylesheetsTestCase->testRenderOverride()
The overriding CSS file is output.Othercommon.test756CascadingStylesheetsTestCase->testRenderOverride()
CSS is alterable as right to left overrides are added.Othercommon.test772CascadingStylesheetsTestCase->testAlter()
LeafCategorize feed functionality (CategorizeFeedTestCase) [Aggregator]1900
LeafCategorize feed item functionality (CategorizeFeedItemTestCase) [Aggregator]5300
LeafChecks display of aggregator items (AggregatorRenderingTestCase) [Aggregator]6800
LeafCJK tokenizer (SearchTokenizerTestCase) [Search]200
LeafColor functionality (ColorTestCase) [Color]6700
LeafComment actions (CommentActionsTestCase) [Comment]2800
LeafComment approval (CommentApprovalTest) [Comment]15400
LeafComment blocks (CommentBlockFunctionalTest) [Comment]11500
LeafComment count toggle (SearchCommentCountToggleTestCase) [Search]3000
LeafComment interface (CommentInterfaceTest) [Comment]32300
LeafComment language (LocaleCommentLanguageFunctionalTest) [Locale]5200
LeafComment node access (CommentNodeAccessTest) [Comment]5300
LeafComment paging settings (CommentPagerTest) [Comment]20800
LeafComment preview (CommentPreviewTest) [Comment]7200
LeafComment Rebuild (CommentContentRebuild) [Comment]3200
LeafComment RSS (CommentRSSUnitTest) [Comment]2400
LeafComment Search tests (SearchCommentTestCase) [Search]23000
LeafComment token replacement (CommentTokenReplaceTestCase) [Comment]6400
LeafComment upgrade path (CommentUpgradePathTestCase) [Upgrade path]2600
LeafConfig settings form (SearchConfigSettingsForm) [Search]14600
LeafConnection tests (DatabaseConnectionTestCase) [Database]3400
LeafContent language settings (LocaleContentFunctionalTest) [Locale]6400
LeafCron run (CronRunTestCase) [System]4500
LeafCSS Unit Tests (CascadingStylesheetsUnitTest) [System]1200
LeafCustom query syntax tests (DatabaseQueryTestCase) [Database]600
LeafDashboard blocks (DashboardBlocksTestCase) [Dashboard]10900
LeafData API functions (DrupalDataApiTest) [System]3200
LeafDate and time (DateTimeFunctionalTest) [System]9600
LeafDBLog functionality (DBLogTestCase) [DBLog]44500
LeafDefault text format functionality (FilterDefaultFormatTestCase) [Filter]3300
LeafDelete/Truncate tests (DatabaseDeleteTruncateTestCase) [Database]2000
LeafDrupal error handlers (DrupalErrorHandlerUnitTest) [System]2800
LeafDrupal goto (DrupalGotoTest) [System]1800
LeafDrupal HTTP request (DrupalHTTPRequestTestCase) [System]2700
LeafDrupal match path (DrupalMatchPathTestCase) [Path API]4100
LeafDrupal set/get regions (DrupalSetContentTestCase) [System]4000
LeafDrupal system listing (DrupalSystemListingTestCase) [System]600
LeafDrupal tags handling (DrupalTagsHandlingTestCase) [System]800
Expanddrupal_add_feed() tests (DrupalAddFeedTestCase) [System]060
MessageGroupFilenameLineFunctionStatus
Found correct feed header for path without titleOthercommon.test2374DrupalAddFeedTestCase->testBasicFeedAddNoTitle()
Found correct feed header for external url without titleOthercommon.test2374DrupalAddFeedTestCase->testBasicFeedAddNoTitle()
Found correct feed header for local url without titleOthercommon.test2374DrupalAddFeedTestCase->testBasicFeedAddNoTitle()
Found correct feed header for path with titleOthercommon.test2374DrupalAddFeedTestCase->testBasicFeedAddNoTitle()
Found correct feed header for external url with titleOthercommon.test2374DrupalAddFeedTestCase->testBasicFeedAddNoTitle()
Found correct feed header for local url with titleOthercommon.test2374DrupalAddFeedTestCase->testBasicFeedAddNoTitle()
Leafdrupal_alter() tests (DrupalAlterTestCase) [System]500
Expanddrupal_render() (DrupalRenderTestCase) [System]182813
MessageGroupFilenameLineFunctionStatus
Defaults workOthercommon.test1512DrupalRenderTestCase->testDrupalRenderThemeArguments()
Passing arguments to theme functions worksOthercommon.test1519DrupalRenderTestCase->testDrupalRenderThemeArguments()
simplexml_import_dom(): Invalid Nodetype to importWarningdrupal_web_test_case.php1607DrupalWebTestCase->parse()
Parsed page successfully.Browsercommon.test1531DrupalRenderTestCase->testDrupalRenderFormElements()
#type 'button' was properly rendered.Othercommon.test1531DrupalRenderTestCase->testDrupalRenderFormElements()
simplexml_import_dom(): Invalid Nodetype to importWarningdrupal_web_test_case.php1607DrupalWebTestCase->parse()
Parsed page successfully.Browsercommon.test1538DrupalRenderTestCase->testDrupalRenderFormElements()
#type 'textfield' was properly rendered.Othercommon.test1538DrupalRenderTestCase->testDrupalRenderFormElements()
simplexml_import_dom(): Invalid Nodetype to importWarningdrupal_web_test_case.php1607DrupalWebTestCase->parse()
Parsed page successfully.Browsercommon.test1544DrupalRenderTestCase->testDrupalRenderFormElements()
#type 'password' was properly rendered.Othercommon.test1544DrupalRenderTestCase->testDrupalRenderFormElements()
simplexml_import_dom(): Invalid Nodetype to importWarningdrupal_web_test_case.php1607DrupalWebTestCase->parse()
Parsed page successfully.Browsercommon.test1551DrupalRenderTestCase->testDrupalRenderFormElements()
#type 'textarea' was properly rendered.Othercommon.test1551DrupalRenderTestCase->testDrupalRenderFormElements()
simplexml_import_dom(): Invalid Nodetype to importWarningdrupal_web_test_case.php1607DrupalWebTestCase->parse()
Parsed page successfully.Browsercommon.test1558DrupalRenderTestCase->testDrupalRenderFormElements()
#type 'radio' was properly rendered.Othercommon.test1558DrupalRenderTestCase->testDrupalRenderFormElements()
simplexml_import_dom(): Invalid Nodetype to importWarningdrupal_web_test_case.php1607DrupalWebTestCase->parse()
Parsed page successfully.Browsercommon.test1564DrupalRenderTestCase->testDrupalRenderFormElements()
#type 'checkbox' was properly rendered.Othercommon.test1564DrupalRenderTestCase->testDrupalRenderFormElements()
simplexml_import_dom(): Invalid Nodetype to importWarningdrupal_web_test_case.php1607DrupalWebTestCase->parse()
Parsed page successfully.Browsercommon.test1574DrupalRenderTestCase->testDrupalRenderFormElements()
#type 'select' was properly rendered.Othercommon.test1574DrupalRenderTestCase->testDrupalRenderFormElements()
simplexml_import_dom(): Invalid Nodetype to importWarningdrupal_web_test_case.php1607DrupalWebTestCase->parse()
Parsed page successfully.Browsercommon.test1580DrupalRenderTestCase->testDrupalRenderFormElements()
#type 'file' was properly rendered.Othercommon.test1580DrupalRenderTestCase->testDrupalRenderFormElements()
simplexml_import_dom(): Invalid Nodetype to importWarningdrupal_web_test_case.php1607DrupalWebTestCase->parse()
Parsed page successfully.Browsercommon.test1591DrupalRenderTestCase->testDrupalRenderFormElements()
#type 'item' was properly rendered.Othercommon.test1591DrupalRenderTestCase->testDrupalRenderFormElements()
simplexml_import_dom(): Invalid Nodetype to importWarningdrupal_web_test_case.php1607DrupalWebTestCase->parse()
Parsed page successfully.Browsercommon.test1598DrupalRenderTestCase->testDrupalRenderFormElements()
#type 'hidden' was properly rendered.Othercommon.test1598DrupalRenderTestCase->testDrupalRenderFormElements()
simplexml_import_dom(): Invalid Nodetype to importWarningdrupal_web_test_case.php1607DrupalWebTestCase->parse()
Parsed page successfully.Browsercommon.test1611DrupalRenderTestCase->testDrupalRenderFormElements()
#type 'link' was properly rendered.Othercommon.test1611DrupalRenderTestCase->testDrupalRenderFormElements()
simplexml_import_dom(): Invalid Nodetype to importWarningdrupal_web_test_case.php1607DrupalWebTestCase->parse()
Parsed page successfully.Browsercommon.test1619DrupalRenderTestCase->testDrupalRenderFormElements()
#type 'fieldset' was properly rendered.Othercommon.test1619DrupalRenderTestCase->testDrupalRenderFormElements()
simplexml_import_dom(): Invalid Nodetype to importWarningdrupal_web_test_case.php1607DrupalWebTestCase->parse()
Parsed page successfully.Browsercommon.test1629DrupalRenderTestCase->testDrupalRenderFormElements()
#type 'fieldset' was properly rendered.Othercommon.test1629DrupalRenderTestCase->testDrupalRenderFormElements()
LeafElement processing (FormElementTestCase) [Form API]2200
LeafEmbedded forms (SearchEmbedForm) [Search]2900
LeafEmpty statement (DatabaseEmptyStatementTestCase) [Database]400
LeafEnable/disable modules (EnableDisableTestCase) [Module]5600
LeafEntity CRUD hooks (EntityCrudHookTestCase) [Entity API]4800
LeafEntity properties (EntityPropertiesTestCase) [Entity API]300
LeafEntity query (EntityFieldQueryTestCase) [Entity API]10000
LeafFeed parser functionality (FeedParserTestCase) [Aggregator]4000
LeafFetch tests (DatabaseFetchTestCase) [Database]3300
LeafFetch tests, part 2 (DatabaseFetch2TestCase) [Database]2600
LeafFetching multiple cache items (CacheGetMultipleUnitTest) [Cache]700
ExpandField attach tests (other) (FieldAttachOtherTestCase) [Field API]4310
MessageGroupFilenameLineFunctionStatus
Label is displayed.Otherfield.test669FieldAttachOtherTestCase->testFieldAttachView()
LeafField attach tests (storage-related) (FieldAttachStorageTestCase) [Field API]8300
LeafField bulk delete tests (FieldBulkDeleteTestCase) [Field API]4000
LeafField CRUD tests (FieldCrudTestCase) [Field API]5900
ExpandField Display API tests (FieldDisplayAPITestCase) [Field API]4130
MessageGroupFilenameLineFunctionStatus
Label was displayed.Otherfield.test1739FieldDisplayAPITestCase->testFieldViewField()
Label was displayed.Otherfield.test1787FieldDisplayAPITestCase->testFieldViewField()
Label was displayed.Otherfield.test1797FieldDisplayAPITestCase->testFieldViewField()
LeafField form tests (FieldFormTestCase) [Field API]23700
LeafField info tests (FieldInfoTestCase) [Field API]7900
LeafField instance CRUD tests (FieldInstanceCrudTestCase) [Field API]3200
LeafField SQL storage tests (FieldSqlStorageTestCase) [Field API]8800
LeafField translations tests (FieldTranslationsTestCase) [Field API]4600
LeafFile copying (FileCopyTest) [File API]10600
LeafFile delete (FileDeleteTest) [File API]1800
LeafFile download (FileDownloadTest) [File API]3500
ExpandFile field display tests (FileFieldDisplayTestCase) [File]1912
MessageGroupFilenameLineFunctionStatus
strpos(): Empty delimiterWarningdrupal_web_test_case.php2585DrupalWebTestCase->assertRaw()
Default formatter displaying correctly on full node view.Otherfile.test719FileFieldDisplayTestCase->testNodeDisplay()
strpos(): Empty delimiterWarningdrupal_web_test_case.php2605DrupalWebTestCase->assertNoRaw()
LeafFile field file path tests (FileFieldPathTestCase) [File]2300
LeafFile field revision test (FileFieldRevisionTestCase) [File]6700
LeafFile field validation tests (FileFieldValidateTestCase) [File]10300
LeafFile field widget test (FileFieldWidgetTestCase) [File]19200
LeafFile loading (FileLoadTest) [File API]2900
LeafFile mimetypes (FileMimeTypeTest) [File API]3800
LeafFile moving (FileMoveTest) [File API]10500
LeafFile naming (FileNameMungingTest) [File API]500
LeafFile paths and directories (FileDirectoryTest) [File API]2000
LeafFile save data (FileSaveDataTest) [File API]8800
LeafFile saving (FileSaveTest) [File API]1400
LeafFile scan directory (FileScanDirectoryTest) [File API]2500
LeafFile space used tests (FileSpaceUsedTest) [File API]1100
LeafFile token replacement (FileTokenReplaceTestCase) [File]3500
LeafFile uploading (FileSaveUploadTest) [File API]33300
LeafFile URL rewriting (FileURLRewritingTest) [File]1500
LeafFile usage (FileUsageTest) [File]2100
LeafFile validate (FileValidateTest) [File API]2200
LeafFile validator tests (FileValidatorTest) [File API]4200
LeafFileTransfer unit tests (FileTranferTest) [System]200
LeafFilter administration functionality (FilterAdminTestCase) [Filter]22600
LeafFilter CRUD operations (FilterCRUDTestCase) [Filter]42800
LeafFilter format access (FilterFormatAccessTestCase) [Filter]24400
LeafFilter format hooks (FilterHooksTestCase) [Filter]3200
LeafFilter format upgrade path (FilterFormatUpgradePathTestCase) [Upgrade path]3400
LeafFilter module filters (FilterUnitTestCase) [Filter]20200
LeafFingerprinting meta tag (AdminMetaTagTestCase) [System]300
LeafFlood control mechanism (FloodFunctionalTest) [System]600
LeafForm alter hooks (FormAlterTestCase) [Form API]300
ExpandForm API checkbox (FormCheckboxTestCase) [Form API]82140
MessageGroupFilenameLineFunctionStatus
#default_value is true #return_value is '0'.Otherform.test1480FormCheckboxTestCase->testFormCheckbox()
#default_value is true #return_value is ''.Otherform.test1480FormCheckboxTestCase->testFormCheckbox()
#default_value is true #return_value is 1.Otherform.test1480FormCheckboxTestCase->testFormCheckbox()
#default_value is true #return_value is '1'.Otherform.test1480FormCheckboxTestCase->testFormCheckbox()
#default_value is true #return_value is 'foobar'.Otherform.test1480FormCheckboxTestCase->testFormCheckbox()
#default_value is true #return_value is '1foobar'.Otherform.test1480FormCheckboxTestCase->testFormCheckbox()
#default_value is '0' #return_value is '0'.Otherform.test1480FormCheckboxTestCase->testFormCheckbox()
#default_value is '' #return_value is ''.Otherform.test1480FormCheckboxTestCase->testFormCheckbox()
#default_value is 1 #return_value is 1.Otherform.test1480FormCheckboxTestCase->testFormCheckbox()
#default_value is 1 #return_value is '1'.Otherform.test1480FormCheckboxTestCase->testFormCheckbox()
#default_value is '1' #return_value is 1.Otherform.test1480FormCheckboxTestCase->testFormCheckbox()
#default_value is '1' #return_value is '1'.Otherform.test1480FormCheckboxTestCase->testFormCheckbox()
#default_value is 'foobar' #return_value is 'foobar'.Otherform.test1480FormCheckboxTestCase->testFormCheckbox()
#default_value is '1foobar' #return_value is '1foobar'.Otherform.test1480FormCheckboxTestCase->testFormCheckbox()
LeafForm API file inclusion (FormsFileInclusionTestCase) [Form API]900
LeafForm element and label output test (FormsElementsLabelsTestCase) [Form API]1500
LeafForm element validation (FormsTestCase) [Form API]19400
LeafForm rebuilding (FormsRebuildTestCase) [Form API]5000
LeafForm state values clearance (FormStateValuesCleanTestCase) [Form API]1300
LeafForm triggering element determination (FormsTriggeringElementTestCase) [Form API]4800
LeafForm validation handlers (FormValidationTestCase) [Form API]4700
LeafForm wrapper callback (FormsFormWrapperTestCase) [Form API]400
LeafFormat date (FormatDateUnitTest) [System]6100
ExpandForum functionality (ForumTestCase) [Forum]5921616
MessageGroupFilenameLineFunctionStatus
strpos(): Empty delimiterWarningdrupal_web_test_case.php2585DrupalWebTestCase->assertRaw()
Breadcrumbs were displayedOtherforum.test486ForumTestCase->verifyForumView()
strpos(): Empty delimiterWarningdrupal_web_test_case.php2585DrupalWebTestCase->assertRaw()
Breadcrumbs were displayedOtherforum.test486ForumTestCase->verifyForumView()
strpos(): Empty delimiterWarningdrupal_web_test_case.php2585DrupalWebTestCase->assertRaw()
Breadcrumbs were displayedOtherforum.test486ForumTestCase->verifyForumView()
strpos(): Empty delimiterWarningdrupal_web_test_case.php2585DrupalWebTestCase->assertRaw()
Breadcrumbs were displayedOtherforum.test431ForumTestCase->verifyForums()
strpos(): Empty delimiterWarningdrupal_web_test_case.php2585DrupalWebTestCase->assertRaw()
Breadcrumbs were displayedOtherforum.test486ForumTestCase->verifyForumView()
strpos(): Empty delimiterWarningdrupal_web_test_case.php2585DrupalWebTestCase->assertRaw()
Breadcrumbs were displayedOtherforum.test486ForumTestCase->verifyForumView()
strpos(): Empty delimiterWarningdrupal_web_test_case.php2585DrupalWebTestCase->assertRaw()
Breadcrumbs were displayedOtherforum.test486ForumTestCase->verifyForumView()
strpos(): Empty delimiterWarningdrupal_web_test_case.php2585DrupalWebTestCase->assertRaw()
Breadcrumbs were displayedOtherforum.test431ForumTestCase->verifyForums()
strpos(): Empty delimiterWarningdrupal_web_test_case.php2585DrupalWebTestCase->assertRaw()
Breadcrumbs were displayedOtherforum.test486ForumTestCase->verifyForumView()
strpos(): Empty delimiterWarningdrupal_web_test_case.php2585DrupalWebTestCase->assertRaw()
Breadcrumbs were displayedOtherforum.test486ForumTestCase->verifyForumView()
strpos(): Empty delimiterWarningdrupal_web_test_case.php2585DrupalWebTestCase->assertRaw()
Breadcrumbs were displayedOtherforum.test486ForumTestCase->verifyForumView()
strpos(): Empty delimiterWarningdrupal_web_test_case.php2585DrupalWebTestCase->assertRaw()
Breadcrumbs were displayedOtherforum.test431ForumTestCase->verifyForums()
strpos(): Empty delimiterWarningdrupal_web_test_case.php2585DrupalWebTestCase->assertRaw()
Breadcrumbs were displayedOtherforum.test486ForumTestCase->verifyForumView()
strpos(): Empty delimiterWarningdrupal_web_test_case.php2585DrupalWebTestCase->assertRaw()
Breadcrumbs were displayedOtherforum.test486ForumTestCase->verifyForumView()
strpos(): Empty delimiterWarningdrupal_web_test_case.php2585DrupalWebTestCase->assertRaw()
Breadcrumbs were displayedOtherforum.test486ForumTestCase->verifyForumView()
strpos(): Empty delimiterWarningdrupal_web_test_case.php2585DrupalWebTestCase->assertRaw()
Breadcrumbs were displayedOtherforum.test431ForumTestCase->verifyForums()
LeafFront page (FrontPageTestCase) [System]3600
LeafGet filename test (BootstrapGetFilenameTestCase) [Bootstrap]400
LeafGraph (GraphUnitTest) [System]2800
LeafHelp functionality (HelpTestCase) [Help]30800
LeafHTML Attributes (DrupalAttributesUnitTest) [System]600
LeafHTML identifiers (DrupalHTMLIdentifierTestCase) [System]1000
LeafHTML in page titles (PageTitleFiltering) [System]4000
LeafHTTP file retrieval (RetrieveFileTestCase) [System]700
LeafImage effects (ImageEffectsUnitTest) [Image]3300
ExpandImage field display tests (ImageFieldDisplayTestCase) [Image]1221213
MessageGroupFilenameLineFunctionStatus
strpos(): Empty delimiterWarningdrupal_web_test_case.php2585DrupalWebTestCase->assertRaw()
Default formatter displaying correctly on full node view.Otherimage.test655ImageFieldDisplayTestCase->_testImageFieldFormatters()
strpos(): Empty delimiterWarningdrupal_web_test_case.php2585DrupalWebTestCase->assertRaw()
Image linked to file formatter displaying correctly on full node view.Otherimage.test664ImageFieldDisplayTestCase->_testImageFieldFormatters()
strpos(): Empty delimiterWarningdrupal_web_test_case.php2585DrupalWebTestCase->assertRaw()
Image linked to content formatter displaying correctly on full node view.Otherimage.test688ImageFieldDisplayTestCase->_testImageFieldFormatters()
strpos(): Empty delimiterWarningdrupal_web_test_case.php2585DrupalWebTestCase->assertRaw()
Image style thumbnail formatter displaying correctly on full node view.Otherimage.test701ImageFieldDisplayTestCase->_testImageFieldFormatters()
strpos(): Empty delimiterWarningdrupal_web_test_case.php2585DrupalWebTestCase->assertRaw()
Default formatter displaying correctly on full node view.Otherimage.test655ImageFieldDisplayTestCase->_testImageFieldFormatters()
strpos(): Empty delimiterWarningdrupal_web_test_case.php2585DrupalWebTestCase->assertRaw()
Image linked to file formatter displaying correctly on full node view.Otherimage.test664ImageFieldDisplayTestCase->_testImageFieldFormatters()
strpos(): Empty delimiterWarningdrupal_web_test_case.php2585DrupalWebTestCase->assertRaw()
Image linked to content formatter displaying correctly on full node view.Otherimage.test688ImageFieldDisplayTestCase->_testImageFieldFormatters()
strpos(): Empty delimiterWarningdrupal_web_test_case.php2585DrupalWebTestCase->assertRaw()
Image style thumbnail formatter displaying correctly on full node view.Otherimage.test701ImageFieldDisplayTestCase->_testImageFieldFormatters()
strpos(): Empty delimiterWarningdrupal_web_test_case.php2585DrupalWebTestCase->assertRaw()
Preview image is displayed using 'medium' style.Otherimage.test750ImageFieldDisplayTestCase->testImageFieldSettings()
strpos(): Empty delimiterWarningdrupal_web_test_case.php2585DrupalWebTestCase->assertRaw()
Image displayed using user supplied alt and title attributes.Otherimage.test764ImageFieldDisplayTestCase->testImageFieldSettings()
strpos(): Empty delimiterWarningdrupal_web_test_case.php2585DrupalWebTestCase->assertRaw()
Default image displayed when no user supplied image is present.Otherimage.test795ImageFieldDisplayTestCase->testImageFieldDefaultImage()
strpos(): Empty delimiterWarningdrupal_web_test_case.php2605DrupalWebTestCase->assertNoRaw()
strpos(): Empty delimiterWarningdrupal_web_test_case.php2585DrupalWebTestCase->assertRaw()
User supplied image is displayed.Otherimage.test807ImageFieldDisplayTestCase->testImageFieldDefaultImage()
LeafImage field validation tests (ImageFieldValidateTestCase) [Image]1800
LeafImage GD manipulation tests (ImageToolkitGdTestCase) [Image]100
LeafImage styles and effects UI configuration (ImageAdminStylesUnitTest) [Image]16700
LeafImage styles path and URL functions (ImageStylesPathAndUrlUnitTest) [Image]2100
LeafImage toolkit tests (ImageToolkitUnitTest) [Image]4400
LeafImport feeds from OPML functionality (ImportOPMLTestCase) [Aggregator]5300
LeafInfo file format parser (InfoFileParserTestCase) [System]900
LeafInsert tests (DatabaseInsertTestCase) [Database]4500
LeafInsert tests, default fields (DatabaseInsertDefaultsTestCase) [Database]1900
LeafInsert tests, LOB fields (DatabaseInsertLOBTestCase) [Database]1300
LeafInvalid data (DatabaseInvalidDataTestCase) [Database]700
LeafIP address and HTTP_HOST test (BootstrapIPAddressTestCase) [Bootstrap]1100
LeafIP address blocking (IPAddressBlockingTestCase) [System]4200
ExpandJavaScript (JavaScriptTestCase) [System]24140
MessageGroupFilenameLineFunctionStatus
Rendered JavaScript header returns basePath setting.Othercommon.test1210JavaScriptTestCase->testHeaderSetting()
Rendered JavaScript header includes jQuery.Othercommon.test1211JavaScriptTestCase->testHeaderSetting()
Rendered JavaScript header returns custom setting.Othercommon.test1214JavaScriptTestCase->testHeaderSetting()
drupal_add_js() correctly adds settings to the end of an indexed array.Othercommon.test1220JavaScriptTestCase->testHeaderSetting()
drupal_add_js() correctly overrides settings within an associative array.Othercommon.test1225JavaScriptTestCase->testHeaderSetting()
Rendering an external JavaScript file.Othercommon.test1256JavaScriptTestCase->testRenderExternal()
Rendered JavaScript footer returns the inline code.Othercommon.test1266JavaScriptTestCase->testFooterHTML()
JavaScript is added in the expected weight order.Othercommon.test1332JavaScriptTestCase->testRenderOrder()
Rendering a JavaScript file above jQuery.Othercommon.test1344JavaScriptTestCase->testRenderDifferentWeight()
Altering JavaScript weight through the alter hook.Othercommon.test1361JavaScriptTestCase->testAlter()
JavaScript of library was added to the page.Othercommon.test1372JavaScriptTestCase->testLibraryRender()
Stylesheet of library was added to the page.Othercommon.test1373JavaScriptTestCase->testLibraryRender()
Altered library dependencies are added to the page.Othercommon.test1389JavaScriptTestCase->testLibraryAlter()
The attached_library property adds the additional libraries.Othercommon.test1423JavaScriptTestCase->testAttachedLibrary()
LeafJSON (DrupalJSONTest) [System]1400
LeafKeywords and conditions (SearchKeywordsConditions) [Search]2500
LeafLanguage configuration (LocaleConfigurationTest) [Locale]8100
LeafLanguage switching (LocaleLanguageSwitchingFunctionalTest) [Locale]2500
ExpandLinks (ThemeLinksUnitTest) [Theme]001
MessageGroupFilenameLineFunctionStatus
PDOException: SQLSTATE[42S02]: Base table or view not found: 1146 Table 'drupaltestbotmysql.simpletest894184watchdog' doesn't exist: INSERT INTO {watchdog} (uid, type, message, variables, severity, link, location, referer, hostname, timestamp) VALUES (:db_insert_placeholder_0, :db_insert_placeholder_1, :db_insert_placeholder_2, :db_insert_placeholder_3, :db_insert_placeholder_4, :db_insert_placeholder_5, :db_insert_placeholder_6, :db_insert_placeholder_7, :db_insert_placeholder_8, :db_insert_placeholder_9); Array ( [:db_insert_placeholder_0] => 0 [:db_insert_placeholder_1] => theme [:db_insert_placeholder_2] => Theme key "@key" not found. [:db_insert_placeholder_3] => a:1:{s:4:"@key";s:5:"links";} [:db_insert_placeholder_4] => 4 [:db_insert_placeholder_5] => [:db_insert_placeholder_6] => http://2010120716947-pifr-mysql/checkout/ [:db_insert_placeholder_7] => [:db_insert_placeholder_8] => 127.0.0.1 [:db_insert_placeholder_9] => 1291904482 ) in dblog_watchdog() (line 155 of /var/lib/drupaltestbot/sites/default/files/checkout/modules/dblog/dblog.module).Uncaught exceptiondatabase.inc2005PDOStatement->execute()
LeafList field (ListFieldTestCase) [Field types]1400
LeafList field UI (ListFieldUITestCase) [Field types]3600
LeafLoad multiple nodes (NodeLoadMultipleUnitTest) [Node]3600
LeafLocale uninstall (EN) (LocaleUninstallFunctionalTest) [Locale]3100
LeafLocale uninstall (FR) (LocaleUninstallFrenchFunctionalTest) [Locale]3100
LeafLocale upgrade path (LocaleUpgradePathTestCase) [Upgrade path]16500
LeafLocalize date formats (LocaleDateFormatsFunctionalTest) [Locale]3500
LeafLocking framework tests (LockFunctionalTest) [System]1700
LeafMail system (MailTestCase) [System]100
LeafMain content rendering fallback (SystemMainContentFallback) [System]6600
LeafManage display (FieldUIManageDisplayTestCase) [Field UI]8100
LeafManage fields (FieldUIManageFieldsTestCase) [Field UI]15000
LeafManaged file element test (FileManagedFileElementTestCase) [File]26400
LeafMenu link creation/deletion (MenuTestCase) [Menu]64400
LeafMenu links (MenuLinksUnitTestCase) [Menu]5000
LeafMenu rebuild test (MenuRebuildTestCase) [Menu]500
LeafMenu router (MenuRouterTestCase) [Menu]19900
LeafMenu settings for nodes (MenuNodeTestCase) [Menu]4700
LeafMenu tree generation (MenuTreeDataTestCase) [Menu]400
LeafMerge tests (DatabaseMergeTestCase) [Database]7500
LeafMiscellaneous AJAX tests (AJAXElementValidation) [AJAX]800
LeafMiscellaneous bootstrap unit tests (BootstrapMiscTestCase) [Bootstrap]100
LeafMissing update dependencies (UpdateDependencyMissingTestCase) [Update API]300
LeafModule API (ModuleUnitTest) [Module]6400
LeafModule dependencies (ModuleDependencyTestCase) [Module]15800
LeafModule installation (ModuleInstallTestCase) [Module]200
LeafModule uninstallation (ModuleUninstallTestCase) [Module]100
LeafModule versions (ModuleVersionTestCase) [Module]5000
LeafMultilingual fields (LocaleMultilingualFieldsFunctionalTest) [Locale]6000
LeafMultistep form using form storage (FormsFormStorageTestCase) [Form API]11500
LeafMultistep node form basic options (MultiStepNodeFormBasicOptionsTest) [Node]1500
LeafNew default theme blocks (NewDefaultThemeBlocks) [Block]2400
LeafNo help (NoHelpTestCase) [Help]1100
LeafNode access (NodeAccessUnitTest) [Node]3100
LeafNode access rebuild (NodeAccessRebuildTestCase) [Node]1600
LeafNode access records (NodeAccessRecordsUnitTest) [Node]2300
LeafNode administration (NodeAdminTestCase) [Node]13900
LeafNode blocks (NodeBlockFunctionalTest) [Node]8300
LeafNode body upgrade path (NodeBodyUpgradePathTestCase) [Upgrade path]3500
LeafNode creation (NodeCreationTestCase) [Node]2500
LeafNode edit (PageEditTestCase) [Node]9300
LeafNode edit permissions (PageViewTestCase) [Node]3200
LeafNode entity query alter (NodeEntityFieldQueryAlter) [Node]3000
LeafNode feed (NodeFeedTestCase) [Node]100
LeafNode load hooks (NodeLoadHooksTestCase) [Node]400
LeafNode post information display (NodePostSettingsTestCase) [Node]3400
LeafNode preview (PagePreviewTestCase) [Node]3500
LeafNode query alter (NodeQueryAlter) [Node]7900
LeafNode revisions (NodeRevisionsTestCase) [Node]4400
LeafNode RSS Content (NodeRSSContentTestCase) [Node]1600
LeafNode save (NodeSaveTestCase) [Node]3900
LeafNode title (NodeTitleTestCase) [Node]2000
LeafNode title XSS filtering (NodeTitleXSSTestCase) [Node]2000
LeafNode token replacement (NodeTokenReplaceTestCase) [Node]3400
LeafNode type persist (NodeTypePersistenceTestCase) [Node]6200
LeafNode types (NodeTypeTestCase) [Node]8400
LeafNon default theme admin (NonDefaultBlockAdmin) [Block]1000
LeafNumber field (NumberFieldTestCase) [Field types]1500
LeafOpenID account registration (OpenIDRegistrationTestCase) [OpenID]13100
LeafOpenID discovery and login (OpenIDFunctionalTestCase) [OpenID]24800
LeafOpenID helper functions (OpenIDUnitTest) [OpenID]3200
LeafOptions widgets (OptionsWidgetsTestCase) [Field types]25600
LeafOverriding server variables (BootstrapOverrideServerVariablesTestCase) [Bootstrap]600
LeafPage cache test (BootstrapPageCacheTestCase) [Bootstrap]7800
LeafPager query tests (DatabaseSelectPagerDefaultTestCase) [Database]4200
LeafParsing .info files (ParseInfoFilesTestCase) [System]300
LeafPath alias functionality (PathTestCase) [Path]10200
LeafPath aliases with languages (PathLanguageUITestCase) [Path]6900
LeafPath aliases with translated nodes (PathLanguageTestCase) [Path]6300
LeafPath language settings (LocalePathFunctionalTest) [Locale]4900
LeafPath lookup (PathLookupTest) [Path API]1700
LeafPaths on non-English monolingual sites (PathMonolingualTestCase) [Path]3400
LeafPersonal contact form (ContactPersonalTestCase) [Contact]14200
LeafPHP filter access check (PHPAccessTestCase) [PHP]3700
LeafPHP filter functionality (PHPFilterTestCase) [PHP]4100
LeafPoll add choice (PollJSAddChoice) [Poll]1500
LeafPoll create (PollCreateTestCase) [Poll]14300
LeafPoll expiration (PollExpirationTestCase) [Poll]3200
LeafPoll token replacement (PollTokenReplaceTestCase) [Poll]11000
LeafPoll upgrade path (PollUpgradePathTestCase) [Upgrade path]21200
LeafPoll vote (PollVoteTestCase) [Poll]8400
LeafProfile browsing (ProfileTestBrowsing) [Profile]3200
LeafProgrammatic form submissions (FormsProgrammaticTestCase) [Form API]1800
LeafQuery altering tests (DatabaseAlterTestCase) [Database]5500
LeafQuery logging (DatabaseLoggingTestCase) [Database]3800
LeafQuery tagging tests (DatabaseTaggingTestCase) [Database]2800
LeafQueue functionality (QueueTestCase) [System]700
LeafRange query test (DatabaseRangeQueryTestCase) [Database]200
LeafRDF comment mapping (RdfCommentAttributesTestCase) [RDF]20400
LeafRDF mapping CRUD functions (RdfCrudTestCase) [RDF]900
LeafRDF mapping definition functionality (RdfMappingDefinitionTestCase) [RDF]5800
LeafRDF mapping hook (RdfMappingHookTestCase) [RDF]500
LeafRDF namespaces (RdfGetRdfNamespacesTestCase) [RDF]400
LeafRDF namespaces XML serialization tests (DrupalGetRdfNamespacesTestCase) [System]600
LeafRDF tracker page mapping (RdfTrackerAttributesTestCase) [RDF]3200
LeafRDFa markup (RdfRdfaMarkupTestCase) [RDF]2100
LeafRebuild arbitrary forms (FormsArbitraryRebuildTestCase) [Form API]1400
LeafRebuild content (NodeBuildContent) [Node]100
LeafRegistry parse file test (RegistryParseFileTestCase) [System]200
LeafRegistry parse files test (RegistryParseFilesTestCase) [System]600
LeafRegression tests (DatabaseRegressionTestCase) [Database]2700
LeafRemove feed functionality (RemoveFeedTestCase) [Aggregator]2300
LeafRemove feed item functionality (RemoveFeedItemTestCase) [Aggregator]19600
LeafRequired modules (ModuleRequiredTestCase) [Module]1800
LeafRequirements hook failure (HookRequirementsTestCase) [Module]1500
LeafResettable static variables test (BootstrapResettableStaticTestCase) [Bootstrap]500
LeafRole assignment (UserRolesAssignmentTestCase) [User]5300
LeafRole permissions (UserPermissionsTestCase) [User]5000
LeafSchema API (SchemaTestCase) [Database]58800
LeafSearch engine phrase queries (SearchExactTestCase) [Search]2200
LeafSearch engine queries (SearchMatchTestCase) [Search]28800
ExpandSearch engine ranking (SearchRankingTestCase) [Search]5642
MessageGroupFilenameLineFunctionStatus
Search tag ranking for "<a>" order.Othersearch.test495SearchRankingTestCase->testHTMLRankings()
Search tag ranking for "<h5>" order.Othersearch.test495SearchRankingTestCase->testHTMLRankings()
Search tag ranking for "<h6>" order.Othersearch.test495SearchRankingTestCase->testHTMLRankings()
Undefined offset: 7Noticesearch.test493SearchRankingTestCase->testHTMLRankings()
Trying to get property of non-objectNoticesearch.test493SearchRankingTestCase->testHTMLRankings()
Search tag ranking for plain text order.Othersearch.test493SearchRankingTestCase->testHTMLRankings()
LeafSearch excerpt extraction (SearchExcerptTestCase) [Search]500
LeafSearch expression insert/extract (SearchExpressionInsertExtractTestCase) [Search]2400
LeafSearch language selection (SearchLanguageTestCase) [Search]9000
LeafSearch number matching (SearchNumberMatchingTestCase) [Search]32100
LeafSearch numbers (SearchNumbersTestCase) [Search]17200
LeafSearch page override (SearchPageOverride) [Search]1200
LeafSearch page text (SearchPageText) [Search]2900
LeafSearch simplify (SearchSimplifyTestCase) [Search]65100
LeafSecurity (FilterSecurityTestCase) [Filter]2600
LeafSelect tests (DatabaseSelectTestCase) [Database]11700
LeafSelect tests, complex (DatabaseSelectComplexTestCase) [Database]11500
LeafSelect tests, complex 2 (DatabaseSelectComplexTestCase2) [Database]1400
LeafSelect tests, ordered (DatabaseSelectOrderedTestCase) [Database]2600
LeafSelect tests, subqueries (DatabaseSelectSubqueryTestCase) [Database]2400
LeafSequences API (DatabaseNextIdCase) [Database]200
LeafSession https handling (SessionHttpsTestCase) [Session]8200
LeafSession tests (SessionTestCase) [Session]18700
LeafShortcut link functionality (ShortcutLinksTestCase) [Shortcut]10300
LeafShortcut set functionality (ShortcutSetsTestCase) [Shortcut]15300
LeafShutdown functions (ShutdownFunctionsTest) [System]400
LeafSimpleTest browser (SimpleTestBrowserTestCase) [SimpleTest]1600
LeafSimpleTest e-mail capturing (SimpleTestMailCaptureTestCase) [SimpleTest]1300
LeafSimpleTest error collector (DrupalErrorCollectionUnitTest) [SimpleTest]1500
ExpandSimpleTest functionality (SimpleTestFunctionalTest) [SimpleTest]892340
MessageGroupFilenameLineFunctionStatus
simplexml_import_dom(): Invalid Nodetype to importWarningdrupal_web_test_case.php1607DrupalWebTestCase->parse()
Parsed page successfully.Browsersimpletest.test257SimpleTestFunctionalTest->getTestResults()
Undefined index: assertionsNoticesimpletest.test239SimpleTestFunctionalTest->assertAssertion()
Invalid argument supplied for foreach()Warningsimpletest.test239SimpleTestFunctionalTest->assertAssertion()
Found assertion {"SimpleTest pass.", "Other", "Pass", "simpletest.test", "SimpleTestFunctionalTest->stubTest()"}.Othersimpletest.test188SimpleTestFunctionalTest->confirmStubTestResults()
Undefined index: assertionsNoticesimpletest.test239SimpleTestFunctionalTest->assertAssertion()
Invalid argument supplied for foreach()Warningsimpletest.test239SimpleTestFunctionalTest->assertAssertion()
Found assertion {"SimpleTest fail.", "Other", "Fail", "simpletest.test", "SimpleTestFunctionalTest->stubTest()"}.Othersimpletest.test189SimpleTestFunctionalTest->confirmStubTestResults()
Undefined index: assertionsNoticesimpletest.test239SimpleTestFunctionalTest->assertAssertion()
Invalid argument supplied for foreach()Warningsimpletest.test239SimpleTestFunctionalTest->assertAssertion()
Found assertion {"Created permissions: access content", "Role", "Pass", "simpletest.test", "SimpleTestFunctionalTest->stubTest()"}.Othersimpletest.test191SimpleTestFunctionalTest->confirmStubTestResults()
Undefined index: assertionsNoticesimpletest.test239SimpleTestFunctionalTest->assertAssertion()
Invalid argument supplied for foreach()Warningsimpletest.test239SimpleTestFunctionalTest->assertAssertion()
Found assertion {"Invalid permission invalid permission.", "Role", "Fail", "simpletest.test", "SimpleTestFunctionalTest->stubTest()"}.Othersimpletest.test192SimpleTestFunctionalTest->confirmStubTestResults()
Undefined index: assertionsNoticesimpletest.test239SimpleTestFunctionalTest->assertAssertion()
Invalid argument supplied for foreach()Warningsimpletest.test239SimpleTestFunctionalTest->assertAssertion()
Found assertion {"Division by zero", "Warning", "Fail", "simpletest.test", "SimpleTestFunctionalTest->stubTest()"}.Othersimpletest.test195SimpleTestFunctionalTest->confirmStubTestResults()
Undefined index: assertionsNoticesimpletest.test239SimpleTestFunctionalTest->assertAssertion()
Invalid argument supplied for foreach()Warningsimpletest.test239SimpleTestFunctionalTest->assertAssertion()
Found assertion {"This is nothing.", "Other", "Pass", "simpletest.test", "SimpleTestFunctionalTest->stubTest()"}.Othersimpletest.test198SimpleTestFunctionalTest->confirmStubTestResults()
Undefined index: assertionsNoticesimpletest.test239SimpleTestFunctionalTest->assertAssertion()
Invalid argument supplied for foreach()Warningsimpletest.test239SimpleTestFunctionalTest->assertAssertion()
Found assertion {"array_key_exists", "Warning", "Fail", "simpletest.test", "SimpleTestFunctionalTest->stubTest()"}.Othersimpletest.test203SimpleTestFunctionalTest->confirmStubTestResults()
Undefined index: assertionsNoticesimpletest.test239SimpleTestFunctionalTest->assertAssertion()
Invalid argument supplied for foreach()Warningsimpletest.test239SimpleTestFunctionalTest->assertAssertion()
Found assertion {"Debug: 'Foo'", "Debug", "Fail", "simpletest.test", "SimpleTestFunctionalTest->stubTest()"}.Othersimpletest.test205SimpleTestFunctionalTest->confirmStubTestResults()
Undefined index: summaryNoticesimpletest.test207SimpleTestFunctionalTest->confirmStubTestResults()
Stub test summary is correctOthersimpletest.test207SimpleTestFunctionalTest->confirmStubTestResults()
Undefined index: assertionsNoticesimpletest.test217SimpleTestFunctionalTest->getTestIdFromResults()
Invalid argument supplied for foreach()Warningsimpletest.test217SimpleTestFunctionalTest->getTestIdFromResults()
Found test ID in results.Othersimpletest.test210SimpleTestFunctionalTest->confirmStubTestResults()
simplexml_import_dom(): Invalid Nodetype to importWarningdrupal_web_test_case.php1607DrupalWebTestCase->parse()
Parsed page successfully.Browsersimpletest.test257SimpleTestFunctionalTest->getTestResults()
Undefined index: assertionsNoticesimpletest.test239SimpleTestFunctionalTest->assertAssertion()
Invalid argument supplied for foreach()Warningsimpletest.test239SimpleTestFunctionalTest->assertAssertion()
Found assertion {"SimpleTest pass.", "Other", "Pass", "simpletest.test", "SimpleTestFunctionalTest->stubTest()"}.Othersimpletest.test188SimpleTestFunctionalTest->confirmStubTestResults()
Undefined index: assertionsNoticesimpletest.test239SimpleTestFunctionalTest->assertAssertion()
Invalid argument supplied for foreach()Warningsimpletest.test239SimpleTestFunctionalTest->assertAssertion()
Found assertion {"SimpleTest fail.", "Other", "Fail", "simpletest.test", "SimpleTestFunctionalTest->stubTest()"}.Othersimpletest.test189SimpleTestFunctionalTest->confirmStubTestResults()
Undefined index: assertionsNoticesimpletest.test239SimpleTestFunctionalTest->assertAssertion()
Invalid argument supplied for foreach()Warningsimpletest.test239SimpleTestFunctionalTest->assertAssertion()
Found assertion {"Created permissions: access content", "Role", "Pass", "simpletest.test", "SimpleTestFunctionalTest->stubTest()"}.Othersimpletest.test191SimpleTestFunctionalTest->confirmStubTestResults()
Undefined index: assertionsNoticesimpletest.test239SimpleTestFunctionalTest->assertAssertion()
Invalid argument supplied for foreach()Warningsimpletest.test239SimpleTestFunctionalTest->assertAssertion()
Found assertion {"Invalid permission invalid permission.", "Role", "Fail", "simpletest.test", "SimpleTestFunctionalTest->stubTest()"}.Othersimpletest.test192SimpleTestFunctionalTest->confirmStubTestResults()
Undefined index: assertionsNoticesimpletest.test239SimpleTestFunctionalTest->assertAssertion()
Invalid argument supplied for foreach()Warningsimpletest.test239SimpleTestFunctionalTest->assertAssertion()
Found assertion {"Division by zero", "Warning", "Fail", "simpletest.test", "SimpleTestFunctionalTest->stubTest()"}.Othersimpletest.test195SimpleTestFunctionalTest->confirmStubTestResults()
Undefined index: assertionsNoticesimpletest.test239SimpleTestFunctionalTest->assertAssertion()
Invalid argument supplied for foreach()Warningsimpletest.test239SimpleTestFunctionalTest->assertAssertion()
Found assertion {"This is nothing.", "Other", "Pass", "simpletest.test", "SimpleTestFunctionalTest->stubTest()"}.Othersimpletest.test198SimpleTestFunctionalTest->confirmStubTestResults()
Undefined index: assertionsNoticesimpletest.test239SimpleTestFunctionalTest->assertAssertion()
Invalid argument supplied for foreach()Warningsimpletest.test239SimpleTestFunctionalTest->assertAssertion()
Found assertion {"array_key_exists", "Warning", "Fail", "simpletest.test", "SimpleTestFunctionalTest->stubTest()"}.Othersimpletest.test203SimpleTestFunctionalTest->confirmStubTestResults()
Undefined index: assertionsNoticesimpletest.test239SimpleTestFunctionalTest->assertAssertion()
Invalid argument supplied for foreach()Warningsimpletest.test239SimpleTestFunctionalTest->assertAssertion()
Found assertion {"Debug: 'Foo'", "Debug", "Fail", "simpletest.test", "SimpleTestFunctionalTest->stubTest()"}.Othersimpletest.test205SimpleTestFunctionalTest->confirmStubTestResults()
Undefined index: summaryNoticesimpletest.test207SimpleTestFunctionalTest->confirmStubTestResults()
Stub test summary is correctOthersimpletest.test207SimpleTestFunctionalTest->confirmStubTestResults()
Undefined index: assertionsNoticesimpletest.test217SimpleTestFunctionalTest->getTestIdFromResults()
Invalid argument supplied for foreach()Warningsimpletest.test217SimpleTestFunctionalTest->getTestIdFromResults()
Found test ID in results.Othersimpletest.test210SimpleTestFunctionalTest->confirmStubTestResults()
Test ID is incrementing.Othersimpletest.test149SimpleTestFunctionalTest->testWebTestRunner()
LeafSite maintenance mode functionality (SiteMaintenanceTestCase) [System]8000
LeafSite-wide contact form (ContactSitewideTestCase) [Contact]23700
LeafSize parsing test (CommonSizeTestCase) [System]3500
LeafStatistics logging tests (StatisticsLoggingTestCase) [Statistics]2500
ExpandStatistics reports tests (StatisticsReportsTestCase) [Statistics]7911
MessageGroupFilenameLineFunctionStatus
strpos(): Empty delimiterWarningdrupal_web_test_case.php2585DrupalWebTestCase->assertRaw()
Found link to visited node.Otherstatistics.test204StatisticsReportsTestCase->testPopularContentBlock()
LeafStatistics token replacement (StatisticsTokenReplaceTestCase) [Statistics]2900
LeafStream wrappers (StreamWrapperTest) [File API]2200
LeafString filtering tests (CommonXssUnitTest) [System]900
LeafString translate, search and validate (LocaleTranslationFunctionalTest) [Locale]25000
LeafString translation using st() (LocaleInstallTest) [Locale]100
LeafSummary length (SummaryLengthTestCase) [Node]1500
LeafSyslog functionality (SyslogTestCase) [Syslog]1600
LeafSystem info alter (SystemInfoAlterTestCase) [System]1000
LeafTableselect form element type test (FormsElementsTableSelectFunctionalTest) [Form API]5200
LeafTablesort query tests (DatabaseSelectTableSortDefaultTestCase) [Database]4100
LeafTaxonomy term functions and forms. (TaxonomyTermTestCase) [Taxonomy]16800
LeafTaxonomy term hooks (TaxonomyHooksTestCase) [Taxonomy]1900
LeafTaxonomy term multiple loading (TaxonomyLoadMultipleUnitTest) [Taxonomy]1700
ExpandTaxonomy term reference field (TaxonomyTermFieldTestCase) [Taxonomy]3510
MessageGroupFilenameLineFunctionStatus
Term name is displayedOthertaxonomy.test989TaxonomyTermFieldTestCase->testTaxonomyTermFieldWidgets()
LeafTaxonomy term unit tests (TaxonomyTermUnitTest) [Taxonomy]100
LeafTaxonomy term URL aliases (PathTaxonomyTermTestCase) [Path]3400
LeafTaxonomy theme switching (TaxonomyThemeTestCase) [Taxonomy]1700
LeafTaxonomy token replacement (TaxonomyTokenReplaceTestCase) [Taxonomy]5300
ExpandTaxonomy upgrade path (UpgradePathTaxonomyTestCase) [Upgrade path]135112825
MessageGroupFilenameLineFunctionStatus
Term term 2 of vocabulary 2 (j=0) (field-name-taxonomyextra) is displayed on node 1Otherupgrade.taxonomy.test152UpgradePathTaxonomyTestCase->testTaxonomyUpgrade()
Term term 3 of vocabulary 2 (j=1) (field-name-taxonomyextra) is displayed on node 1Otherupgrade.taxonomy.test152UpgradePathTaxonomyTestCase->testTaxonomyUpgrade()
Term term 4 of vocabulary 3 (j=0) (field-name-taxonomyextra) is displayed on node 1Otherupgrade.taxonomy.test152UpgradePathTaxonomyTestCase->testTaxonomyUpgrade()
Term term 5 of vocabulary 3 (j=1) (field-name-taxonomyextra) is displayed on node 1Otherupgrade.taxonomy.test152UpgradePathTaxonomyTestCase->testTaxonomyUpgrade()
Term term 6 of vocabulary 3 (j=2) (field-name-taxonomyextra) is displayed on node 1Otherupgrade.taxonomy.test152UpgradePathTaxonomyTestCase->testTaxonomyUpgrade()
Term term 7 of vocabulary 4 (j=0) (field-name-taxonomyextra) is displayed on node 1Otherupgrade.taxonomy.test152UpgradePathTaxonomyTestCase->testTaxonomyUpgrade()
Term term 8 of vocabulary 5 (j=0) (field-name-taxonomyextra) is displayed on node 1Otherupgrade.taxonomy.test152UpgradePathTaxonomyTestCase->testTaxonomyUpgrade()
Term term 9 of vocabulary 5 (j=1) (field-name-taxonomyextra) is displayed on node 1Otherupgrade.taxonomy.test152UpgradePathTaxonomyTestCase->testTaxonomyUpgrade()
Term term 10 of vocabulary 6 (j=0) (field-name-taxonomyextra) is displayed on node 1Otherupgrade.taxonomy.test152UpgradePathTaxonomyTestCase->testTaxonomyUpgrade()
Term term 11 of vocabulary 6 (j=1) (field-name-taxonomyextra) is displayed on node 1Otherupgrade.taxonomy.test152UpgradePathTaxonomyTestCase->testTaxonomyUpgrade()
Term term 12 of vocabulary 6 (j=2) (field-name-taxonomyextra) is displayed on node 1Otherupgrade.taxonomy.test152UpgradePathTaxonomyTestCase->testTaxonomyUpgrade()
Term term 13 of vocabulary 7 (j=0) (field-name-taxonomyextra) is displayed on node 1Otherupgrade.taxonomy.test152UpgradePathTaxonomyTestCase->testTaxonomyUpgrade()
Term term 14 of vocabulary 8 (j=0) (field-name-taxonomyextra) is displayed on node 1Otherupgrade.taxonomy.test152UpgradePathTaxonomyTestCase->testTaxonomyUpgrade()
Term term 15 of vocabulary 8 (j=1) (field-name-taxonomyextra) is displayed on node 1Otherupgrade.taxonomy.test152UpgradePathTaxonomyTestCase->testTaxonomyUpgrade()
Term term 16 of vocabulary 9 (j=0) (field-name-taxonomyextra) is displayed on node 1Otherupgrade.taxonomy.test152UpgradePathTaxonomyTestCase->testTaxonomyUpgrade()
Term term 17 of vocabulary 9 (j=1) (field-name-taxonomyextra) is displayed on node 1Otherupgrade.taxonomy.test152UpgradePathTaxonomyTestCase->testTaxonomyUpgrade()
Term term 18 of vocabulary 9 (j=2) (field-name-taxonomyextra) is displayed on node 1Otherupgrade.taxonomy.test152UpgradePathTaxonomyTestCase->testTaxonomyUpgrade()
Term term 19 of vocabulary 10 (j=0) (field-name-taxonomyextra) is displayed on node 1Otherupgrade.taxonomy.test152UpgradePathTaxonomyTestCase->testTaxonomyUpgrade()
Term term 20 of vocabulary 11 (j=0) (field-name-taxonomyextra) is displayed on node 1Otherupgrade.taxonomy.test152UpgradePathTaxonomyTestCase->testTaxonomyUpgrade()
Term term 21 of vocabulary 11 (j=1) (field-name-taxonomyextra) is displayed on node 1Otherupgrade.taxonomy.test152UpgradePathTaxonomyTestCase->testTaxonomyUpgrade()
Term term 22 of vocabulary 12 (j=0) (field-name-taxonomyextra) is displayed on node 1Otherupgrade.taxonomy.test152UpgradePathTaxonomyTestCase->testTaxonomyUpgrade()
Term term 23 of vocabulary 12 (j=1) (field-name-taxonomyextra) is displayed on node 1Otherupgrade.taxonomy.test152UpgradePathTaxonomyTestCase->testTaxonomyUpgrade()
Term term 24 of vocabulary 12 (j=2) (field-name-taxonomyextra) is displayed on node 1Otherupgrade.taxonomy.test152UpgradePathTaxonomyTestCase->testTaxonomyUpgrade()
Term term 25 of vocabulary 13 (j=0) (field-name-taxonomy-vocabulary-13) is displayed on node 1Otherupgrade.taxonomy.test152UpgradePathTaxonomyTestCase->testTaxonomyUpgrade()
Term term 26 of vocabulary 14 (j=0) (field-name-taxonomy-vocabulary-14) is displayed on node 1Otherupgrade.taxonomy.test152UpgradePathTaxonomyTestCase->testTaxonomyUpgrade()
Term term 27 of vocabulary 14 (j=1) (field-name-taxonomy-vocabulary-14) is displayed on node 1Otherupgrade.taxonomy.test152UpgradePathTaxonomyTestCase->testTaxonomyUpgrade()
Term term 28 of vocabulary 15 (j=0) (field-name-taxonomy-vocabulary-15) is displayed on node 1Otherupgrade.taxonomy.test152UpgradePathTaxonomyTestCase->testTaxonomyUpgrade()
Term term 29 of vocabulary 15 (j=1) (field-name-taxonomyextra) is displayed on node 1Otherupgrade.taxonomy.test152UpgradePathTaxonomyTestCase->testTaxonomyUpgrade()
Term term 30 of vocabulary 15 (j=2) (field-name-taxonomyextra) is displayed on node 1Otherupgrade.taxonomy.test152UpgradePathTaxonomyTestCase->testTaxonomyUpgrade()
Term term 31 of vocabulary 16 (j=0) (field-name-taxonomy-vocabulary-16) is displayed on node 1Otherupgrade.taxonomy.test152UpgradePathTaxonomyTestCase->testTaxonomyUpgrade()
Term term 32 of vocabulary 17 (j=0) (field-name-taxonomy-vocabulary-17) is displayed on node 1Otherupgrade.taxonomy.test152UpgradePathTaxonomyTestCase->testTaxonomyUpgrade()
Term term 33 of vocabulary 17 (j=1) (field-name-taxonomyextra) is displayed on node 1Otherupgrade.taxonomy.test152UpgradePathTaxonomyTestCase->testTaxonomyUpgrade()
Term term 34 of vocabulary 18 (j=0) (field-name-taxonomy-vocabulary-18) is displayed on node 1Otherupgrade.taxonomy.test152UpgradePathTaxonomyTestCase->testTaxonomyUpgrade()
Term term 35 of vocabulary 18 (j=1) (field-name-taxonomy-vocabulary-18) is displayed on node 1Otherupgrade.taxonomy.test152UpgradePathTaxonomyTestCase->testTaxonomyUpgrade()
Term term 36 of vocabulary 18 (j=2) (field-name-taxonomy-vocabulary-18) is displayed on node 1Otherupgrade.taxonomy.test152UpgradePathTaxonomyTestCase->testTaxonomyUpgrade()
Term term 37 of vocabulary 19 (j=0) (field-name-taxonomy-vocabulary-19) is displayed on node 1Otherupgrade.taxonomy.test152UpgradePathTaxonomyTestCase->testTaxonomyUpgrade()
Term term 38 of vocabulary 20 (j=0) (field-name-taxonomy-vocabulary-20) is displayed on node 1Otherupgrade.taxonomy.test152UpgradePathTaxonomyTestCase->testTaxonomyUpgrade()
Term term 39 of vocabulary 20 (j=1) (field-name-taxonomy-vocabulary-20) is displayed on node 1Otherupgrade.taxonomy.test152UpgradePathTaxonomyTestCase->testTaxonomyUpgrade()
Term term 40 of vocabulary 21 (j=0) (field-name-taxonomy-vocabulary-21) is displayed on node 1Otherupgrade.taxonomy.test152UpgradePathTaxonomyTestCase->testTaxonomyUpgrade()
Term term 41 of vocabulary 21 (j=1) (field-name-taxonomyextra) is displayed on node 1Otherupgrade.taxonomy.test152UpgradePathTaxonomyTestCase->testTaxonomyUpgrade()
Term term 42 of vocabulary 21 (j=2) (field-name-taxonomyextra) is displayed on node 1Otherupgrade.taxonomy.test152UpgradePathTaxonomyTestCase->testTaxonomyUpgrade()
Term term 43 of vocabulary 22 (j=0) (field-name-taxonomy-vocabulary-22) is displayed on node 1Otherupgrade.taxonomy.test152UpgradePathTaxonomyTestCase->testTaxonomyUpgrade()
Term term 44 of vocabulary 23 (j=0) (field-name-taxonomy-vocabulary-23) is displayed on node 1Otherupgrade.taxonomy.test152UpgradePathTaxonomyTestCase->testTaxonomyUpgrade()
Term term 45 of vocabulary 23 (j=1) (field-name-taxonomyextra) is displayed on node 1Otherupgrade.taxonomy.test152UpgradePathTaxonomyTestCase->testTaxonomyUpgrade()
Term term 46 of vocabulary 24 (j=0) (field-name-taxonomy-vocabulary-24) is displayed on node 1Otherupgrade.taxonomy.test152UpgradePathTaxonomyTestCase->testTaxonomyUpgrade()
Term term 47 of vocabulary 24 (j=1) (field-name-taxonomy-vocabulary-24) is displayed on node 1Otherupgrade.taxonomy.test152UpgradePathTaxonomyTestCase->testTaxonomyUpgrade()
strpos(): Empty delimiterWarningdrupal_web_test_case.php2605DrupalWebTestCase->assertNoRaw()
strpos(): Empty delimiterWarningdrupal_web_test_case.php2585DrupalWebTestCase->assertRaw()
Term term 48 of vocabulary 24 (j=2) (field-name-taxonomy-vocabulary-24) is displayed on node 1 vid 1.Otherupgrade.taxonomy.test181UpgradePathTaxonomyTestCase->testTaxonomyUpgrade()
strpos(): Empty delimiterWarningdrupal_web_test_case.php2585DrupalWebTestCase->assertRaw()
Term term 48 of vocabulary 24 (j=2) (field-name-taxonomy-vocabulary-24) is displayed on node 1 1.Otherupgrade.taxonomy.test184UpgradePathTaxonomyTestCase->testTaxonomyUpgrade()
Term term 1 of vocabulary 1 (j=0) (field-name-taxonomyextra) is displayed on node 2Otherupgrade.taxonomy.test152UpgradePathTaxonomyTestCase->testTaxonomyUpgrade()
Term term 3 of vocabulary 2 (j=1) (field-name-taxonomyextra) is displayed on node 2Otherupgrade.taxonomy.test152UpgradePathTaxonomyTestCase->testTaxonomyUpgrade()
Term term 4 of vocabulary 3 (j=0) (field-name-taxonomyextra) is displayed on node 2Otherupgrade.taxonomy.test152UpgradePathTaxonomyTestCase->testTaxonomyUpgrade()
Term term 5 of vocabulary 3 (j=1) (field-name-taxonomyextra) is displayed on node 2Otherupgrade.taxonomy.test152UpgradePathTaxonomyTestCase->testTaxonomyUpgrade()
Term term 6 of vocabulary 3 (j=2) (field-name-taxonomyextra) is displayed on node 2Otherupgrade.taxonomy.test152UpgradePathTaxonomyTestCase->testTaxonomyUpgrade()
Term term 7 of vocabulary 4 (j=0) (field-name-taxonomyextra) is displayed on node 2Otherupgrade.taxonomy.test152UpgradePathTaxonomyTestCase->testTaxonomyUpgrade()
Term term 8 of vocabulary 5 (j=0) (field-name-taxonomyextra) is displayed on node 2Otherupgrade.taxonomy.test152UpgradePathTaxonomyTestCase->testTaxonomyUpgrade()
Term term 9 of vocabulary 5 (j=1) (field-name-taxonomyextra) is displayed on node 2Otherupgrade.taxonomy.test152UpgradePathTaxonomyTestCase->testTaxonomyUpgrade()
Term term 10 of vocabulary 6 (j=0) (field-name-taxonomyextra) is displayed on node 2Otherupgrade.taxonomy.test152UpgradePathTaxonomyTestCase->testTaxonomyUpgrade()
Term term 11 of vocabulary 6 (j=1) (field-name-taxonomyextra) is displayed on node 2Otherupgrade.taxonomy.test152UpgradePathTaxonomyTestCase->testTaxonomyUpgrade()
Term term 12 of vocabulary 6 (j=2) (field-name-taxonomyextra) is displayed on node 2Otherupgrade.taxonomy.test152UpgradePathTaxonomyTestCase->testTaxonomyUpgrade()
Term term 13 of vocabulary 7 (j=0) (field-name-taxonomyextra) is displayed on node 2Otherupgrade.taxonomy.test152UpgradePathTaxonomyTestCase->testTaxonomyUpgrade()
Term term 14 of vocabulary 8 (j=0) (field-name-taxonomyextra) is displayed on node 2Otherupgrade.taxonomy.test152UpgradePathTaxonomyTestCase->testTaxonomyUpgrade()
Term term 15 of vocabulary 8 (j=1) (field-name-taxonomyextra) is displayed on node 2Otherupgrade.taxonomy.test152UpgradePathTaxonomyTestCase->testTaxonomyUpgrade()
Term term 16 of vocabulary 9 (j=0) (field-name-taxonomyextra) is displayed on node 2Otherupgrade.taxonomy.test152UpgradePathTaxonomyTestCase->testTaxonomyUpgrade()
Term term 17 of vocabulary 9 (j=1) (field-name-taxonomyextra) is displayed on node 2Otherupgrade.taxonomy.test152UpgradePathTaxonomyTestCase->testTaxonomyUpgrade()
Term term 18 of vocabulary 9 (j=2) (field-name-taxonomyextra) is displayed on node 2Otherupgrade.taxonomy.test152UpgradePathTaxonomyTestCase->testTaxonomyUpgrade()
Term term 19 of vocabulary 10 (j=0) (field-name-taxonomyextra) is displayed on node 2Otherupgrade.taxonomy.test152UpgradePathTaxonomyTestCase->testTaxonomyUpgrade()
Term term 20 of vocabulary 11 (j=0) (field-name-taxonomyextra) is displayed on node 2Otherupgrade.taxonomy.test152UpgradePathTaxonomyTestCase->testTaxonomyUpgrade()
Term term 21 of vocabulary 11 (j=1) (field-name-taxonomyextra) is displayed on node 2Otherupgrade.taxonomy.test152UpgradePathTaxonomyTestCase->testTaxonomyUpgrade()
Term term 22 of vocabulary 12 (j=0) (field-name-taxonomyextra) is displayed on node 2Otherupgrade.taxonomy.test152UpgradePathTaxonomyTestCase->testTaxonomyUpgrade()
Term term 23 of vocabulary 12 (j=1) (field-name-taxonomyextra) is displayed on node 2Otherupgrade.taxonomy.test152UpgradePathTaxonomyTestCase->testTaxonomyUpgrade()
Term term 24 of vocabulary 12 (j=2) (field-name-taxonomyextra) is displayed on node 2Otherupgrade.taxonomy.test152UpgradePathTaxonomyTestCase->testTaxonomyUpgrade()
Term term 25 of vocabulary 13 (j=0) (field-name-taxonomy-vocabulary-13) is displayed on node 2Otherupgrade.taxonomy.test152UpgradePathTaxonomyTestCase->testTaxonomyUpgrade()
Term term 26 of vocabulary 14 (j=0) (field-name-taxonomy-vocabulary-14) is displayed on node 2Otherupgrade.taxonomy.test152UpgradePathTaxonomyTestCase->testTaxonomyUpgrade()
Term term 27 of vocabulary 14 (j=1) (field-name-taxonomy-vocabulary-14) is displayed on node 2Otherupgrade.taxonomy.test152UpgradePathTaxonomyTestCase->testTaxonomyUpgrade()
Term term 28 of vocabulary 15 (j=0) (field-name-taxonomy-vocabulary-15) is displayed on node 2Otherupgrade.taxonomy.test152UpgradePathTaxonomyTestCase->testTaxonomyUpgrade()
Term term 29 of vocabulary 15 (j=1) (field-name-taxonomyextra) is displayed on node 2Otherupgrade.taxonomy.test152UpgradePathTaxonomyTestCase->testTaxonomyUpgrade()
Term term 30 of vocabulary 15 (j=2) (field-name-taxonomyextra) is displayed on node 2Otherupgrade.taxonomy.test152UpgradePathTaxonomyTestCase->testTaxonomyUpgrade()
Term term 31 of vocabulary 16 (j=0) (field-name-taxonomy-vocabulary-16) is displayed on node 2Otherupgrade.taxonomy.test152UpgradePathTaxonomyTestCase->testTaxonomyUpgrade()
Term term 32 of vocabulary 17 (j=0) (field-name-taxonomy-vocabulary-17) is displayed on node 2Otherupgrade.taxonomy.test152UpgradePathTaxonomyTestCase->testTaxonomyUpgrade()
Term term 33 of vocabulary 17 (j=1) (field-name-taxonomyextra) is displayed on node 2Otherupgrade.taxonomy.test152UpgradePathTaxonomyTestCase->testTaxonomyUpgrade()
Term term 34 of vocabulary 18 (j=0) (field-name-taxonomy-vocabulary-18) is displayed on node 2Otherupgrade.taxonomy.test152UpgradePathTaxonomyTestCase->testTaxonomyUpgrade()
Term term 35 of vocabulary 18 (j=1) (field-name-taxonomy-vocabulary-18) is displayed on node 2Otherupgrade.taxonomy.test152UpgradePathTaxonomyTestCase->testTaxonomyUpgrade()
Term term 36 of vocabulary 18 (j=2) (field-name-taxonomy-vocabulary-18) is displayed on node 2Otherupgrade.taxonomy.test152UpgradePathTaxonomyTestCase->testTaxonomyUpgrade()
Term term 37 of vocabulary 19 (j=0) (field-name-taxonomy-vocabulary-19) is displayed on node 2Otherupgrade.taxonomy.test152UpgradePathTaxonomyTestCase->testTaxonomyUpgrade()
Term term 38 of vocabulary 20 (j=0) (field-name-taxonomy-vocabulary-20) is displayed on node 2Otherupgrade.taxonomy.test152UpgradePathTaxonomyTestCase->testTaxonomyUpgrade()
Term term 39 of vocabulary 20 (j=1) (field-name-taxonomy-vocabulary-20) is displayed on node 2Otherupgrade.taxonomy.test152UpgradePathTaxonomyTestCase->testTaxonomyUpgrade()
Term term 40 of vocabulary 21 (j=0) (field-name-taxonomy-vocabulary-21) is displayed on node 2Otherupgrade.taxonomy.test152UpgradePathTaxonomyTestCase->testTaxonomyUpgrade()
Term term 41 of vocabulary 21 (j=1) (field-name-taxonomyextra) is displayed on node 2Otherupgrade.taxonomy.test152UpgradePathTaxonomyTestCase->testTaxonomyUpgrade()
Term term 42 of vocabulary 21 (j=2) (field-name-taxonomyextra) is displayed on node 2Otherupgrade.taxonomy.test152UpgradePathTaxonomyTestCase->testTaxonomyUpgrade()
Term term 43 of vocabulary 22 (j=0) (field-name-taxonomy-vocabulary-22) is displayed on node 2Otherupgrade.taxonomy.test152UpgradePathTaxonomyTestCase->testTaxonomyUpgrade()
Term term 44 of vocabulary 23 (j=0) (field-name-taxonomy-vocabulary-23) is displayed on node 2Otherupgrade.taxonomy.test152UpgradePathTaxonomyTestCase->testTaxonomyUpgrade()
Term term 45 of vocabulary 23 (j=1) (field-name-taxonomyextra) is displayed on node 2Otherupgrade.taxonomy.test152UpgradePathTaxonomyTestCase->testTaxonomyUpgrade()
Term term 46 of vocabulary 24 (j=0) (field-name-taxonomy-vocabulary-24) is displayed on node 2Otherupgrade.taxonomy.test152UpgradePathTaxonomyTestCase->testTaxonomyUpgrade()
Term term 48 of vocabulary 24 (j=2) (field-name-taxonomy-vocabulary-24) is displayed on node 2Otherupgrade.taxonomy.test152UpgradePathTaxonomyTestCase->testTaxonomyUpgrade()
strpos(): Empty delimiterWarningdrupal_web_test_case.php2585DrupalWebTestCase->assertRaw()
Term term 48 of vocabulary 24 (j=2) (field-name-taxonomy-vocabulary-24) is displayed on node 2 vid 3.Otherupgrade.taxonomy.test181UpgradePathTaxonomyTestCase->testTaxonomyUpgrade()
strpos(): Empty delimiterWarningdrupal_web_test_case.php2585DrupalWebTestCase->assertRaw()
Term term 48 of vocabulary 24 (j=2) (field-name-taxonomy-vocabulary-24) is displayed on node 2 3.Otherupgrade.taxonomy.test184UpgradePathTaxonomyTestCase->testTaxonomyUpgrade()
Term term 1 of vocabulary 1 (j=0) (field-name-taxonomyextra) is displayed on node 3Otherupgrade.taxonomy.test152UpgradePathTaxonomyTestCase->testTaxonomyUpgrade()
Term term 2 of vocabulary 2 (j=0) (field-name-taxonomyextra) is displayed on node 3Otherupgrade.taxonomy.test152UpgradePathTaxonomyTestCase->testTaxonomyUpgrade()
Term term 4 of vocabulary 3 (j=0) (field-name-taxonomyextra) is displayed on node 3Otherupgrade.taxonomy.test152UpgradePathTaxonomyTestCase->testTaxonomyUpgrade()
Term term 5 of vocabulary 3 (j=1) (field-name-taxonomyextra) is displayed on node 3Otherupgrade.taxonomy.test152UpgradePathTaxonomyTestCase->testTaxonomyUpgrade()
Term term 6 of vocabulary 3 (j=2) (field-name-taxonomyextra) is displayed on node 3Otherupgrade.taxonomy.test152UpgradePathTaxonomyTestCase->testTaxonomyUpgrade()
Term term 7 of vocabulary 4 (j=0) (field-name-taxonomyextra) is displayed on node 3Otherupgrade.taxonomy.test152UpgradePathTaxonomyTestCase->testTaxonomyUpgrade()
Term term 8 of vocabulary 5 (j=0) (field-name-taxonomyextra) is displayed on node 3Otherupgrade.taxonomy.test152UpgradePathTaxonomyTestCase->testTaxonomyUpgrade()
Term term 9 of vocabulary 5 (j=1) (field-name-taxonomyextra) is displayed on node 3Otherupgrade.taxonomy.test152UpgradePathTaxonomyTestCase->testTaxonomyUpgrade()
Term term 10 of vocabulary 6 (j=0) (field-name-taxonomyextra) is displayed on node 3Otherupgrade.taxonomy.test152UpgradePathTaxonomyTestCase->testTaxonomyUpgrade()
Term term 11 of vocabulary 6 (j=1) (field-name-taxonomyextra) is displayed on node 3Otherupgrade.taxonomy.test152UpgradePathTaxonomyTestCase->testTaxonomyUpgrade()
Term term 12 of vocabulary 6 (j=2) (field-name-taxonomyextra) is displayed on node 3Otherupgrade.taxonomy.test152UpgradePathTaxonomyTestCase->testTaxonomyUpgrade()
Term term 13 of vocabulary 7 (j=0) (field-name-taxonomyextra) is displayed on node 3Otherupgrade.taxonomy.test152UpgradePathTaxonomyTestCase->testTaxonomyUpgrade()
Term term 14 of vocabulary 8 (j=0) (field-name-taxonomyextra) is displayed on node 3Otherupgrade.taxonomy.test152UpgradePathTaxonomyTestCase->testTaxonomyUpgrade()
Term term 15 of vocabulary 8 (j=1) (field-name-taxonomyextra) is displayed on node 3Otherupgrade.taxonomy.test152UpgradePathTaxonomyTestCase->testTaxonomyUpgrade()
Term term 16 of vocabulary 9 (j=0) (field-name-taxonomyextra) is displayed on node 3Otherupgrade.taxonomy.test152UpgradePathTaxonomyTestCase->testTaxonomyUpgrade()
Term term 17 of vocabulary 9 (j=1) (field-name-taxonomyextra) is displayed on node 3Otherupgrade.taxonomy.test152UpgradePathTaxonomyTestCase->testTaxonomyUpgrade()
Term term 18 of vocabulary 9 (j=2) (field-name-taxonomyextra) is displayed on node 3Otherupgrade.taxonomy.test152UpgradePathTaxonomyTestCase->testTaxonomyUpgrade()
Term term 19 of vocabulary 10 (j=0) (field-name-taxonomyextra) is displayed on node 3Otherupgrade.taxonomy.test152UpgradePathTaxonomyTestCase->testTaxonomyUpgrade()
Term term 20 of vocabulary 11 (j=0) (field-name-taxonomyextra) is displayed on node 3Otherupgrade.taxonomy.test152UpgradePathTaxonomyTestCase->testTaxonomyUpgrade()
Term term 21 of vocabulary 11 (j=1) (field-name-taxonomyextra) is displayed on node 3Otherupgrade.taxonomy.test152UpgradePathTaxonomyTestCase->testTaxonomyUpgrade()
Term term 22 of vocabulary 12 (j=0) (field-name-taxonomyextra) is displayed on node 3Otherupgrade.taxonomy.test152UpgradePathTaxonomyTestCase->testTaxonomyUpgrade()
Term term 23 of vocabulary 12 (j=1) (field-name-taxonomyextra) is displayed on node 3Otherupgrade.taxonomy.test152UpgradePathTaxonomyTestCase->testTaxonomyUpgrade()
Term term 24 of vocabulary 12 (j=2) (field-name-taxonomyextra) is displayed on node 3Otherupgrade.taxonomy.test152UpgradePathTaxonomyTestCase->testTaxonomyUpgrade()
Term term 25 of vocabulary 13 (j=0) (field-name-taxonomy-vocabulary-13) is displayed on node 3Otherupgrade.taxonomy.test152UpgradePathTaxonomyTestCase->testTaxonomyUpgrade()
Term term 26 of vocabulary 14 (j=0) (field-name-taxonomy-vocabulary-14) is displayed on node 3Otherupgrade.taxonomy.test152UpgradePathTaxonomyTestCase->testTaxonomyUpgrade()
Term term 27 of vocabulary 14 (j=1) (field-name-taxonomy-vocabulary-14) is displayed on node 3Otherupgrade.taxonomy.test152UpgradePathTaxonomyTestCase->testTaxonomyUpgrade()
Term term 28 of vocabulary 15 (j=0) (field-name-taxonomy-vocabulary-15) is displayed on node 3Otherupgrade.taxonomy.test152UpgradePathTaxonomyTestCase->testTaxonomyUpgrade()
Term term 29 of vocabulary 15 (j=1) (field-name-taxonomyextra) is displayed on node 3Otherupgrade.taxonomy.test152UpgradePathTaxonomyTestCase->testTaxonomyUpgrade()
Term term 30 of vocabulary 15 (j=2) (field-name-taxonomyextra) is displayed on node 3Otherupgrade.taxonomy.test152UpgradePathTaxonomyTestCase->testTaxonomyUpgrade()
Term term 31 of vocabulary 16 (j=0) (field-name-taxonomy-vocabulary-16) is displayed on node 3Otherupgrade.taxonomy.test152UpgradePathTaxonomyTestCase->testTaxonomyUpgrade()
Term term 32 of vocabulary 17 (j=0) (field-name-taxonomy-vocabulary-17) is displayed on node 3Otherupgrade.taxonomy.test152UpgradePathTaxonomyTestCase->testTaxonomyUpgrade()
Term term 33 of vocabulary 17 (j=1) (field-name-taxonomyextra) is displayed on node 3Otherupgrade.taxonomy.test152UpgradePathTaxonomyTestCase->testTaxonomyUpgrade()
Term term 34 of vocabulary 18 (j=0) (field-name-taxonomy-vocabulary-18) is displayed on node 3Otherupgrade.taxonomy.test152UpgradePathTaxonomyTestCase->testTaxonomyUpgrade()
Term term 35 of vocabulary 18 (j=1) (field-name-taxonomy-vocabulary-18) is displayed on node 3Otherupgrade.taxonomy.test152UpgradePathTaxonomyTestCase->testTaxonomyUpgrade()
Term term 36 of vocabulary 18 (j=2) (field-name-taxonomy-vocabulary-18) is displayed on node 3Otherupgrade.taxonomy.test152UpgradePathTaxonomyTestCase->testTaxonomyUpgrade()
Term term 37 of vocabulary 19 (j=0) (field-name-taxonomy-vocabulary-19) is displayed on node 3Otherupgrade.taxonomy.test152UpgradePathTaxonomyTestCase->testTaxonomyUpgrade()
Term term 38 of vocabulary 20 (j=0) (field-name-taxonomy-vocabulary-20) is displayed on node 3Otherupgrade.taxonomy.test152UpgradePathTaxonomyTestCase->testTaxonomyUpgrade()
Term term 39 of vocabulary 20 (j=1) (field-name-taxonomy-vocabulary-20) is displayed on node 3Otherupgrade.taxonomy.test152UpgradePathTaxonomyTestCase->testTaxonomyUpgrade()
Term term 40 of vocabulary 21 (j=0) (field-name-taxonomy-vocabulary-21) is displayed on node 3Otherupgrade.taxonomy.test152UpgradePathTaxonomyTestCase->testTaxonomyUpgrade()
Term term 41 of vocabulary 21 (j=1) (field-name-taxonomyextra) is displayed on node 3Otherupgrade.taxonomy.test152UpgradePathTaxonomyTestCase->testTaxonomyUpgrade()
Term term 42 of vocabulary 21 (j=2) (field-name-taxonomyextra) is displayed on node 3Otherupgrade.taxonomy.test152UpgradePathTaxonomyTestCase->testTaxonomyUpgrade()
Term term 43 of vocabulary 22 (j=0) (field-name-taxonomy-vocabulary-22) is displayed on node 3Otherupgrade.taxonomy.test152UpgradePathTaxonomyTestCase->testTaxonomyUpgrade()
Term term 44 of vocabulary 23 (j=0) (field-name-taxonomy-vocabulary-23) is displayed on node 3Otherupgrade.taxonomy.test152UpgradePathTaxonomyTestCase->testTaxonomyUpgrade()
Term term 45 of vocabulary 23 (j=1) (field-name-taxonomyextra) is displayed on node 3Otherupgrade.taxonomy.test152UpgradePathTaxonomyTestCase->testTaxonomyUpgrade()
Term term 47 of vocabulary 24 (j=1) (field-name-taxonomy-vocabulary-24) is displayed on node 3Otherupgrade.taxonomy.test152UpgradePathTaxonomyTestCase->testTaxonomyUpgrade()
Term term 48 of vocabulary 24 (j=2) (field-name-taxonomy-vocabulary-24) is displayed on node 3Otherupgrade.taxonomy.test152UpgradePathTaxonomyTestCase->testTaxonomyUpgrade()
strpos(): Empty delimiterWarningdrupal_web_test_case.php2585DrupalWebTestCase->assertRaw()
Term term 48 of vocabulary 24 (j=2) (field-name-taxonomy-vocabulary-24) is displayed on node 3 vid 5.Otherupgrade.taxonomy.test181UpgradePathTaxonomyTestCase->testTaxonomyUpgrade()
strpos(): Empty delimiterWarningdrupal_web_test_case.php2585DrupalWebTestCase->assertRaw()
Term term 48 of vocabulary 24 (j=2) (field-name-taxonomy-vocabulary-24) is displayed on node 3 5.Otherupgrade.taxonomy.test184UpgradePathTaxonomyTestCase->testTaxonomyUpgrade()
Term term 1 of vocabulary 1 (j=0) (field-name-taxonomyextra) is displayed on node 4Otherupgrade.taxonomy.test152UpgradePathTaxonomyTestCase->testTaxonomyUpgrade()
Term term 2 of vocabulary 2 (j=0) (field-name-taxonomyextra) is displayed on node 4Otherupgrade.taxonomy.test152UpgradePathTaxonomyTestCase->testTaxonomyUpgrade()
Term term 3 of vocabulary 2 (j=1) (field-name-taxonomyextra) is displayed on node 4Otherupgrade.taxonomy.test152UpgradePathTaxonomyTestCase->testTaxonomyUpgrade()
Term term 5 of vocabulary 3 (j=1) (field-name-taxonomyextra) is displayed on node 4Otherupgrade.taxonomy.test152UpgradePathTaxonomyTestCase->testTaxonomyUpgrade()
Term term 6 of vocabulary 3 (j=2) (field-name-taxonomyextra) is displayed on node 4Otherupgrade.taxonomy.test152UpgradePathTaxonomyTestCase->testTaxonomyUpgrade()
Term term 7 of vocabulary 4 (j=0) (field-name-taxonomyextra) is displayed on node 4Otherupgrade.taxonomy.test152UpgradePathTaxonomyTestCase->testTaxonomyUpgrade()
Term term 8 of vocabulary 5 (j=0) (field-name-taxonomyextra) is displayed on node 4Otherupgrade.taxonomy.test152UpgradePathTaxonomyTestCase->testTaxonomyUpgrade()
Term term 9 of vocabulary 5 (j=1) (field-name-taxonomyextra) is displayed on node 4Otherupgrade.taxonomy.test152UpgradePathTaxonomyTestCase->testTaxonomyUpgrade()
Term term 10 of vocabulary 6 (j=0) (field-name-taxonomyextra) is displayed on node 4Otherupgrade.taxonomy.test152UpgradePathTaxonomyTestCase->testTaxonomyUpgrade()
Term term 11 of vocabulary 6 (j=1) (field-name-taxonomyextra) is displayed on node 4Otherupgrade.taxonomy.test152UpgradePathTaxonomyTestCase->testTaxonomyUpgrade()
Term term 12 of vocabulary 6 (j=2) (field-name-taxonomyextra) is displayed on node 4Otherupgrade.taxonomy.test152UpgradePathTaxonomyTestCase->testTaxonomyUpgrade()
Term term 13 of vocabulary 7 (j=0) (field-name-taxonomyextra) is displayed on node 4Otherupgrade.taxonomy.test152UpgradePathTaxonomyTestCase->testTaxonomyUpgrade()
Term term 14 of vocabulary 8 (j=0) (field-name-taxonomyextra) is displayed on node 4Otherupgrade.taxonomy.test152UpgradePathTaxonomyTestCase->testTaxonomyUpgrade()
Term term 15 of vocabulary 8 (j=1) (field-name-taxonomyextra) is displayed on node 4Otherupgrade.taxonomy.test152UpgradePathTaxonomyTestCase->testTaxonomyUpgrade()
Term term 16 of vocabulary 9 (j=0) (field-name-taxonomyextra) is displayed on node 4Otherupgrade.taxonomy.test152UpgradePathTaxonomyTestCase->testTaxonomyUpgrade()
Term term 17 of vocabulary 9 (j=1) (field-name-taxonomyextra) is displayed on node 4Otherupgrade.taxonomy.test152UpgradePathTaxonomyTestCase->testTaxonomyUpgrade()
Term term 18 of vocabulary 9 (j=2) (field-name-taxonomyextra) is displayed on node 4Otherupgrade.taxonomy.test152UpgradePathTaxonomyTestCase->testTaxonomyUpgrade()
Term term 19 of vocabulary 10 (j=0) (field-name-taxonomyextra) is displayed on node 4Otherupgrade.taxonomy.test152UpgradePathTaxonomyTestCase->testTaxonomyUpgrade()
Term term 20 of vocabulary 11 (j=0) (field-name-taxonomyextra) is displayed on node 4Otherupgrade.taxonomy.test152UpgradePathTaxonomyTestCase->testTaxonomyUpgrade()
Term term 21 of vocabulary 11 (j=1) (field-name-taxonomyextra) is displayed on node 4Otherupgrade.taxonomy.test152UpgradePathTaxonomyTestCase->testTaxonomyUpgrade()
Term term 22 of vocabulary 12 (j=0) (field-name-taxonomyextra) is displayed on node 4Otherupgrade.taxonomy.test152UpgradePathTaxonomyTestCase->testTaxonomyUpgrade()
Term term 23 of vocabulary 12 (j=1) (field-name-taxonomyextra) is displayed on node 4Otherupgrade.taxonomy.test152UpgradePathTaxonomyTestCase->testTaxonomyUpgrade()
Term term 24 of vocabulary 12 (j=2) (field-name-taxonomyextra) is displayed on node 4Otherupgrade.taxonomy.test152UpgradePathTaxonomyTestCase->testTaxonomyUpgrade()
Term term 25 of vocabulary 13 (j=0) (field-name-taxonomy-vocabulary-13) is displayed on node 4Otherupgrade.taxonomy.test152UpgradePathTaxonomyTestCase->testTaxonomyUpgrade()
Term term 26 of vocabulary 14 (j=0) (field-name-taxonomy-vocabulary-14) is displayed on node 4Otherupgrade.taxonomy.test152UpgradePathTaxonomyTestCase->testTaxonomyUpgrade()
Term term 27 of vocabulary 14 (j=1) (field-name-taxonomy-vocabulary-14) is displayed on node 4Otherupgrade.taxonomy.test152UpgradePathTaxonomyTestCase->testTaxonomyUpgrade()
Term term 28 of vocabulary 15 (j=0) (field-name-taxonomy-vocabulary-15) is displayed on node 4Otherupgrade.taxonomy.test152UpgradePathTaxonomyTestCase->testTaxonomyUpgrade()
Term term 29 of vocabulary 15 (j=1) (field-name-taxonomyextra) is displayed on node 4Otherupgrade.taxonomy.test152UpgradePathTaxonomyTestCase->testTaxonomyUpgrade()
Term term 30 of vocabulary 15 (j=2) (field-name-taxonomyextra) is displayed on node 4Otherupgrade.taxonomy.test152UpgradePathTaxonomyTestCase->testTaxonomyUpgrade()
Term term 31 of vocabulary 16 (j=0) (field-name-taxonomy-vocabulary-16) is displayed on node 4Otherupgrade.taxonomy.test152UpgradePathTaxonomyTestCase->testTaxonomyUpgrade()
Term term 32 of vocabulary 17 (j=0) (field-name-taxonomy-vocabulary-17) is displayed on node 4Otherupgrade.taxonomy.test152UpgradePathTaxonomyTestCase->testTaxonomyUpgrade()
Term term 33 of vocabulary 17 (j=1) (field-name-taxonomyextra) is displayed on node 4Otherupgrade.taxonomy.test152UpgradePathTaxonomyTestCase->testTaxonomyUpgrade()
Term term 34 of vocabulary 18 (j=0) (field-name-taxonomy-vocabulary-18) is displayed on node 4Otherupgrade.taxonomy.test152UpgradePathTaxonomyTestCase->testTaxonomyUpgrade()
Term term 35 of vocabulary 18 (j=1) (field-name-taxonomy-vocabulary-18) is displayed on node 4Otherupgrade.taxonomy.test152UpgradePathTaxonomyTestCase->testTaxonomyUpgrade()
Term term 36 of vocabulary 18 (j=2) (field-name-taxonomy-vocabulary-18) is displayed on node 4Otherupgrade.taxonomy.test152UpgradePathTaxonomyTestCase->testTaxonomyUpgrade()
Term term 37 of vocabulary 19 (j=0) (field-name-taxonomy-vocabulary-19) is displayed on node 4Otherupgrade.taxonomy.test152UpgradePathTaxonomyTestCase->testTaxonomyUpgrade()
Term term 38 of vocabulary 20 (j=0) (field-name-taxonomy-vocabulary-20) is displayed on node 4Otherupgrade.taxonomy.test152UpgradePathTaxonomyTestCase->testTaxonomyUpgrade()
Term term 39 of vocabulary 20 (j=1) (field-name-taxonomy-vocabulary-20) is displayed on node 4Otherupgrade.taxonomy.test152UpgradePathTaxonomyTestCase->testTaxonomyUpgrade()
Term term 40 of vocabulary 21 (j=0) (field-name-taxonomy-vocabulary-21) is displayed on node 4Otherupgrade.taxonomy.test152UpgradePathTaxonomyTestCase->testTaxonomyUpgrade()
Term term 41 of vocabulary 21 (j=1) (field-name-taxonomyextra) is displayed on node 4Otherupgrade.taxonomy.test152UpgradePathTaxonomyTestCase->testTaxonomyUpgrade()
Term term 42 of vocabulary 21 (j=2) (field-name-taxonomyextra) is displayed on node 4Otherupgrade.taxonomy.test152UpgradePathTaxonomyTestCase->testTaxonomyUpgrade()
Term term 43 of vocabulary 22 (j=0) (field-name-taxonomy-vocabulary-22) is displayed on node 4Otherupgrade.taxonomy.test152UpgradePathTaxonomyTestCase->testTaxonomyUpgrade()
Term term 44 of vocabulary 23 (j=0) (field-name-taxonomy-vocabulary-23) is displayed on node 4Otherupgrade.taxonomy.test152UpgradePathTaxonomyTestCase->testTaxonomyUpgrade()
Term term 46 of vocabulary 24 (j=0) (field-name-taxonomy-vocabulary-24) is displayed on node 4Otherupgrade.taxonomy.test152UpgradePathTaxonomyTestCase->testTaxonomyUpgrade()
Term term 47 of vocabulary 24 (j=1) (field-name-taxonomy-vocabulary-24) is displayed on node 4Otherupgrade.taxonomy.test152UpgradePathTaxonomyTestCase->testTaxonomyUpgrade()
Term term 48 of vocabulary 24 (j=2) (field-name-taxonomy-vocabulary-24) is displayed on node 4Otherupgrade.taxonomy.test152UpgradePathTaxonomyTestCase->testTaxonomyUpgrade()
strpos(): Empty delimiterWarningdrupal_web_test_case.php2585DrupalWebTestCase->assertRaw()
Term term 48 of vocabulary 24 (j=2) (field-name-taxonomy-vocabulary-24) is displayed on node 4 vid 7.Otherupgrade.taxonomy.test181UpgradePathTaxonomyTestCase->testTaxonomyUpgrade()
strpos(): Empty delimiterWarningdrupal_web_test_case.php2585DrupalWebTestCase->assertRaw()
Term term 48 of vocabulary 24 (j=2) (field-name-taxonomy-vocabulary-24) is displayed on node 4 7.Otherupgrade.taxonomy.test184UpgradePathTaxonomyTestCase->testTaxonomyUpgrade()
Term term 1 of vocabulary 1 (j=0) (field-name-taxonomyextra) is displayed on node 5Otherupgrade.taxonomy.test152UpgradePathTaxonomyTestCase->testTaxonomyUpgrade()
Term term 2 of vocabulary 2 (j=0) (field-name-taxonomyextra) is displayed on node 5Otherupgrade.taxonomy.test152UpgradePathTaxonomyTestCase->testTaxonomyUpgrade()
Term term 3 of vocabulary 2 (j=1) (field-name-taxonomyextra) is displayed on node 5Otherupgrade.taxonomy.test152UpgradePathTaxonomyTestCase->testTaxonomyUpgrade()
Term term 4 of vocabulary 3 (j=0) (field-name-taxonomyextra) is displayed on node 5Otherupgrade.taxonomy.test152UpgradePathTaxonomyTestCase->testTaxonomyUpgrade()
Term term 6 of vocabulary 3 (j=2) (field-name-taxonomyextra) is displayed on node 5Otherupgrade.taxonomy.test152UpgradePathTaxonomyTestCase->testTaxonomyUpgrade()
Term term 7 of vocabulary 4 (j=0) (field-name-taxonomyextra) is displayed on node 5Otherupgrade.taxonomy.test152UpgradePathTaxonomyTestCase->testTaxonomyUpgrade()
Term term 8 of vocabulary 5 (j=0) (field-name-taxonomyextra) is displayed on node 5Otherupgrade.taxonomy.test152UpgradePathTaxonomyTestCase->testTaxonomyUpgrade()
Term term 9 of vocabulary 5 (j=1) (field-name-taxonomyextra) is displayed on node 5Otherupgrade.taxonomy.test152UpgradePathTaxonomyTestCase->testTaxonomyUpgrade()
Term term 10 of vocabulary 6 (j=0) (field-name-taxonomyextra) is displayed on node 5Otherupgrade.taxonomy.test152UpgradePathTaxonomyTestCase->testTaxonomyUpgrade()
Term term 11 of vocabulary 6 (j=1) (field-name-taxonomyextra) is displayed on node 5Otherupgrade.taxonomy.test152UpgradePathTaxonomyTestCase->testTaxonomyUpgrade()
Term term 12 of vocabulary 6 (j=2) (field-name-taxonomyextra) is displayed on node 5Otherupgrade.taxonomy.test152UpgradePathTaxonomyTestCase->testTaxonomyUpgrade()
Term term 13 of vocabulary 7 (j=0) (field-name-taxonomyextra) is displayed on node 5Otherupgrade.taxonomy.test152UpgradePathTaxonomyTestCase->testTaxonomyUpgrade()
Term term 14 of vocabulary 8 (j=0) (field-name-taxonomyextra) is displayed on node 5Otherupgrade.taxonomy.test152UpgradePathTaxonomyTestCase->testTaxonomyUpgrade()
Term term 15 of vocabulary 8 (j=1) (field-name-taxonomyextra) is displayed on node 5Otherupgrade.taxonomy.test152UpgradePathTaxonomyTestCase->testTaxonomyUpgrade()
Term term 16 of vocabulary 9 (j=0) (field-name-taxonomyextra) is displayed on node 5Otherupgrade.taxonomy.test152UpgradePathTaxonomyTestCase->testTaxonomyUpgrade()
Term term 17 of vocabulary 9 (j=1) (field-name-taxonomyextra) is displayed on node 5Otherupgrade.taxonomy.test152UpgradePathTaxonomyTestCase->testTaxonomyUpgrade()
Term term 18 of vocabulary 9 (j=2) (field-name-taxonomyextra) is displayed on node 5Otherupgrade.taxonomy.test152UpgradePathTaxonomyTestCase->testTaxonomyUpgrade()
Term term 19 of vocabulary 10 (j=0) (field-name-taxonomyextra) is displayed on node 5Otherupgrade.taxonomy.test152UpgradePathTaxonomyTestCase->testTaxonomyUpgrade()
Term term 20 of vocabulary 11 (j=0) (field-name-taxonomyextra) is displayed on node 5Otherupgrade.taxonomy.test152UpgradePathTaxonomyTestCase->testTaxonomyUpgrade()
Term term 21 of vocabulary 11 (j=1) (field-name-taxonomyextra) is displayed on node 5Otherupgrade.taxonomy.test152UpgradePathTaxonomyTestCase->testTaxonomyUpgrade()
Term term 22 of vocabulary 12 (j=0) (field-name-taxonomyextra) is displayed on node 5Otherupgrade.taxonomy.test152UpgradePathTaxonomyTestCase->testTaxonomyUpgrade()
Term term 23 of vocabulary 12 (j=1) (field-name-taxonomyextra) is displayed on node 5Otherupgrade.taxonomy.test152UpgradePathTaxonomyTestCase->testTaxonomyUpgrade()
Term term 24 of vocabulary 12 (j=2) (field-name-taxonomyextra) is displayed on node 5Otherupgrade.taxonomy.test152UpgradePathTaxonomyTestCase->testTaxonomyUpgrade()
Term term 25 of vocabulary 13 (j=0) (field-name-taxonomy-vocabulary-13) is displayed on node 5Otherupgrade.taxonomy.test152UpgradePathTaxonomyTestCase->testTaxonomyUpgrade()
Term term 26 of vocabulary 14 (j=0) (field-name-taxonomy-vocabulary-14) is displayed on node 5Otherupgrade.taxonomy.test152UpgradePathTaxonomyTestCase->testTaxonomyUpgrade()
Term term 27 of vocabulary 14 (j=1) (field-name-taxonomy-vocabulary-14) is displayed on node 5Otherupgrade.taxonomy.test152UpgradePathTaxonomyTestCase->testTaxonomyUpgrade()
Term term 28 of vocabulary 15 (j=0) (field-name-taxonomy-vocabulary-15) is displayed on node 5Otherupgrade.taxonomy.test152UpgradePathTaxonomyTestCase->testTaxonomyUpgrade()
Term term 29 of vocabulary 15 (j=1) (field-name-taxonomyextra) is displayed on node 5Otherupgrade.taxonomy.test152UpgradePathTaxonomyTestCase->testTaxonomyUpgrade()
Term term 30 of vocabulary 15 (j=2) (field-name-taxonomyextra) is displayed on node 5Otherupgrade.taxonomy.test152UpgradePathTaxonomyTestCase->testTaxonomyUpgrade()
Term term 31 of vocabulary 16 (j=0) (field-name-taxonomy-vocabulary-16) is displayed on node 5Otherupgrade.taxonomy.test152UpgradePathTaxonomyTestCase->testTaxonomyUpgrade()
Term term 32 of vocabulary 17 (j=0) (field-name-taxonomy-vocabulary-17) is displayed on node 5Otherupgrade.taxonomy.test152UpgradePathTaxonomyTestCase->testTaxonomyUpgrade()
Term term 33 of vocabulary 17 (j=1) (field-name-taxonomyextra) is displayed on node 5Otherupgrade.taxonomy.test152UpgradePathTaxonomyTestCase->testTaxonomyUpgrade()
Term term 34 of vocabulary 18 (j=0) (field-name-taxonomy-vocabulary-18) is displayed on node 5Otherupgrade.taxonomy.test152UpgradePathTaxonomyTestCase->testTaxonomyUpgrade()
Term term 35 of vocabulary 18 (j=1) (field-name-taxonomy-vocabulary-18) is displayed on node 5Otherupgrade.taxonomy.test152UpgradePathTaxonomyTestCase->testTaxonomyUpgrade()
Term term 36 of vocabulary 18 (j=2) (field-name-taxonomy-vocabulary-18) is displayed on node 5Otherupgrade.taxonomy.test152UpgradePathTaxonomyTestCase->testTaxonomyUpgrade()
Term term 37 of vocabulary 19 (j=0) (field-name-taxonomy-vocabulary-19) is displayed on node 5Otherupgrade.taxonomy.test152UpgradePathTaxonomyTestCase->testTaxonomyUpgrade()
Term term 38 of vocabulary 20 (j=0) (field-name-taxonomy-vocabulary-20) is displayed on node 5Otherupgrade.taxonomy.test152UpgradePathTaxonomyTestCase->testTaxonomyUpgrade()
Term term 39 of vocabulary 20 (j=1) (field-name-taxonomy-vocabulary-20) is displayed on node 5Otherupgrade.taxonomy.test152UpgradePathTaxonomyTestCase->testTaxonomyUpgrade()
Term term 40 of vocabulary 21 (j=0) (field-name-taxonomy-vocabulary-21) is displayed on node 5Otherupgrade.taxonomy.test152UpgradePathTaxonomyTestCase->testTaxonomyUpgrade()
Term term 41 of vocabulary 21 (j=1) (field-name-taxonomyextra) is displayed on node 5Otherupgrade.taxonomy.test152UpgradePathTaxonomyTestCase->testTaxonomyUpgrade()
Term term 42 of vocabulary 21 (j=2) (field-name-taxonomyextra) is displayed on node 5Otherupgrade.taxonomy.test152UpgradePathTaxonomyTestCase->testTaxonomyUpgrade()
Term term 43 of vocabulary 22 (j=0) (field-name-taxonomy-vocabulary-22) is displayed on node 5Otherupgrade.taxonomy.test152UpgradePathTaxonomyTestCase->testTaxonomyUpgrade()
Term term 45 of vocabulary 23 (j=1) (field-name-taxonomy-vocabulary-23) is displayed on node 5Otherupgrade.taxonomy.test152UpgradePathTaxonomyTestCase->testTaxonomyUpgrade()
Term term 46 of vocabulary 24 (j=0) (field-name-taxonomy-vocabulary-24) is displayed on node 5Otherupgrade.taxonomy.test152UpgradePathTaxonomyTestCase->testTaxonomyUpgrade()
Term term 47 of vocabulary 24 (j=1) (field-name-taxonomy-vocabulary-24) is displayed on node 5Otherupgrade.taxonomy.test152UpgradePathTaxonomyTestCase->testTaxonomyUpgrade()
Term term 48 of vocabulary 24 (j=2) (field-name-taxonomy-vocabulary-24) is displayed on node 5Otherupgrade.taxonomy.test152UpgradePathTaxonomyTestCase->testTaxonomyUpgrade()
strpos(): Empty delimiterWarningdrupal_web_test_case.php2585DrupalWebTestCase->assertRaw()
Term term 48 of vocabulary 24 (j=2) (field-name-taxonomy-vocabulary-24) is displayed on node 5 vid 9.Otherupgrade.taxonomy.test181UpgradePathTaxonomyTestCase->testTaxonomyUpgrade()
strpos(): Empty delimiterWarningdrupal_web_test_case.php2585DrupalWebTestCase->assertRaw()
Term term 48 of vocabulary 24 (j=2) (field-name-taxonomy-vocabulary-24) is displayed on node 5 9.Otherupgrade.taxonomy.test184UpgradePathTaxonomyTestCase->testTaxonomyUpgrade()
Term term 1 of vocabulary 1 (j=0) (field-name-taxonomyextra) is displayed on node 6Otherupgrade.taxonomy.test152UpgradePathTaxonomyTestCase->testTaxonomyUpgrade()
Term term 2 of vocabulary 2 (j=0) (field-name-taxonomyextra) is displayed on node 6Otherupgrade.taxonomy.test152UpgradePathTaxonomyTestCase->testTaxonomyUpgrade()
Term term 3 of vocabulary 2 (j=1) (field-name-taxonomyextra) is displayed on node 6Otherupgrade.taxonomy.test152UpgradePathTaxonomyTestCase->testTaxonomyUpgrade()
Term term 4 of vocabulary 3 (j=0) (field-name-taxonomyextra) is displayed on node 6Otherupgrade.taxonomy.test152UpgradePathTaxonomyTestCase->testTaxonomyUpgrade()
Term term 5 of vocabulary 3 (j=1) (field-name-taxonomyextra) is displayed on node 6Otherupgrade.taxonomy.test152UpgradePathTaxonomyTestCase->testTaxonomyUpgrade()
Term term 7 of vocabulary 4 (j=0) (field-name-taxonomyextra) is displayed on node 6Otherupgrade.taxonomy.test152UpgradePathTaxonomyTestCase->testTaxonomyUpgrade()
Term term 8 of vocabulary 5 (j=0) (field-name-taxonomyextra) is displayed on node 6Otherupgrade.taxonomy.test152UpgradePathTaxonomyTestCase->testTaxonomyUpgrade()
Term term 9 of vocabulary 5 (j=1) (field-name-taxonomyextra) is displayed on node 6Otherupgrade.taxonomy.test152UpgradePathTaxonomyTestCase->testTaxonomyUpgrade()
Term term 10 of vocabulary 6 (j=0) (field-name-taxonomyextra) is displayed on node 6Otherupgrade.taxonomy.test152UpgradePathTaxonomyTestCase->testTaxonomyUpgrade()
Term term 11 of vocabulary 6 (j=1) (field-name-taxonomyextra) is displayed on node 6Otherupgrade.taxonomy.test152UpgradePathTaxonomyTestCase->testTaxonomyUpgrade()
Term term 12 of vocabulary 6 (j=2) (field-name-taxonomyextra) is displayed on node 6Otherupgrade.taxonomy.test152UpgradePathTaxonomyTestCase->testTaxonomyUpgrade()
Term term 13 of vocabulary 7 (j=0) (field-name-taxonomyextra) is displayed on node 6Otherupgrade.taxonomy.test152UpgradePathTaxonomyTestCase->testTaxonomyUpgrade()
Term term 14 of vocabulary 8 (j=0) (field-name-taxonomyextra) is displayed on node 6Otherupgrade.taxonomy.test152UpgradePathTaxonomyTestCase->testTaxonomyUpgrade()
Term term 15 of vocabulary 8 (j=1) (field-name-taxonomyextra) is displayed on node 6Otherupgrade.taxonomy.test152UpgradePathTaxonomyTestCase->testTaxonomyUpgrade()
Term term 16 of vocabulary 9 (j=0) (field-name-taxonomyextra) is displayed on node 6Otherupgrade.taxonomy.test152UpgradePathTaxonomyTestCase->testTaxonomyUpgrade()
Term term 17 of vocabulary 9 (j=1) (field-name-taxonomyextra) is displayed on node 6Otherupgrade.taxonomy.test152UpgradePathTaxonomyTestCase->testTaxonomyUpgrade()
Term term 18 of vocabulary 9 (j=2) (field-name-taxonomyextra) is displayed on node 6Otherupgrade.taxonomy.test152UpgradePathTaxonomyTestCase->testTaxonomyUpgrade()
Term term 19 of vocabulary 10 (j=0) (field-name-taxonomyextra) is displayed on node 6Otherupgrade.taxonomy.test152UpgradePathTaxonomyTestCase->testTaxonomyUpgrade()
Term term 20 of vocabulary 11 (j=0) (field-name-taxonomyextra) is displayed on node 6Otherupgrade.taxonomy.test152UpgradePathTaxonomyTestCase->testTaxonomyUpgrade()
Term term 21 of vocabulary 11 (j=1) (field-name-taxonomyextra) is displayed on node 6Otherupgrade.taxonomy.test152UpgradePathTaxonomyTestCase->testTaxonomyUpgrade()
Term term 22 of vocabulary 12 (j=0) (field-name-taxonomyextra) is displayed on node 6Otherupgrade.taxonomy.test152UpgradePathTaxonomyTestCase->testTaxonomyUpgrade()
Term term 23 of vocabulary 12 (j=1) (field-name-taxonomyextra) is displayed on node 6Otherupgrade.taxonomy.test152UpgradePathTaxonomyTestCase->testTaxonomyUpgrade()
Term term 24 of vocabulary 12 (j=2) (field-name-taxonomyextra) is displayed on node 6Otherupgrade.taxonomy.test152UpgradePathTaxonomyTestCase->testTaxonomyUpgrade()
Term term 25 of vocabulary 13 (j=0) (field-name-taxonomy-vocabulary-13) is displayed on node 6Otherupgrade.taxonomy.test152UpgradePathTaxonomyTestCase->testTaxonomyUpgrade()
Term term 26 of vocabulary 14 (j=0) (field-name-taxonomy-vocabulary-14) is displayed on node 6Otherupgrade.taxonomy.test152UpgradePathTaxonomyTestCase->testTaxonomyUpgrade()
Term term 27 of vocabulary 14 (j=1) (field-name-taxonomy-vocabulary-14) is displayed on node 6Otherupgrade.taxonomy.test152UpgradePathTaxonomyTestCase->testTaxonomyUpgrade()
Term term 28 of vocabulary 15 (j=0) (field-name-taxonomy-vocabulary-15) is displayed on node 6Otherupgrade.taxonomy.test152UpgradePathTaxonomyTestCase->testTaxonomyUpgrade()
Term term 29 of vocabulary 15 (j=1) (field-name-taxonomyextra) is displayed on node 6Otherupgrade.taxonomy.test152UpgradePathTaxonomyTestCase->testTaxonomyUpgrade()
Term term 30 of vocabulary 15 (j=2) (field-name-taxonomyextra) is displayed on node 6Otherupgrade.taxonomy.test152UpgradePathTaxonomyTestCase->testTaxonomyUpgrade()
Term term 31 of vocabulary 16 (j=0) (field-name-taxonomy-vocabulary-16) is displayed on node 6Otherupgrade.taxonomy.test152UpgradePathTaxonomyTestCase->testTaxonomyUpgrade()
Term term 32 of vocabulary 17 (j=0) (field-name-taxonomy-vocabulary-17) is displayed on node 6Otherupgrade.taxonomy.test152UpgradePathTaxonomyTestCase->testTaxonomyUpgrade()
Term term 33 of vocabulary 17 (j=1) (field-name-taxonomyextra) is displayed on node 6Otherupgrade.taxonomy.test152UpgradePathTaxonomyTestCase->testTaxonomyUpgrade()
Term term 34 of vocabulary 18 (j=0) (field-name-taxonomy-vocabulary-18) is displayed on node 6Otherupgrade.taxonomy.test152UpgradePathTaxonomyTestCase->testTaxonomyUpgrade()
Term term 35 of vocabulary 18 (j=1) (field-name-taxonomy-vocabulary-18) is displayed on node 6Otherupgrade.taxonomy.test152UpgradePathTaxonomyTestCase->testTaxonomyUpgrade()
Term term 36 of vocabulary 18 (j=2) (field-name-taxonomy-vocabulary-18) is displayed on node 6Otherupgrade.taxonomy.test152UpgradePathTaxonomyTestCase->testTaxonomyUpgrade()
Term term 37 of vocabulary 19 (j=0) (field-name-taxonomy-vocabulary-19) is displayed on node 6Otherupgrade.taxonomy.test152UpgradePathTaxonomyTestCase->testTaxonomyUpgrade()
Term term 38 of vocabulary 20 (j=0) (field-name-taxonomy-vocabulary-20) is displayed on node 6Otherupgrade.taxonomy.test152UpgradePathTaxonomyTestCase->testTaxonomyUpgrade()
Term term 39 of vocabulary 20 (j=1) (field-name-taxonomy-vocabulary-20) is displayed on node 6Otherupgrade.taxonomy.test152UpgradePathTaxonomyTestCase->testTaxonomyUpgrade()
Term term 40 of vocabulary 21 (j=0) (field-name-taxonomy-vocabulary-21) is displayed on node 6Otherupgrade.taxonomy.test152UpgradePathTaxonomyTestCase->testTaxonomyUpgrade()
Term term 41 of vocabulary 21 (j=1) (field-name-taxonomyextra) is displayed on node 6Otherupgrade.taxonomy.test152UpgradePathTaxonomyTestCase->testTaxonomyUpgrade()
Term term 42 of vocabulary 21 (j=2) (field-name-taxonomyextra) is displayed on node 6Otherupgrade.taxonomy.test152UpgradePathTaxonomyTestCase->testTaxonomyUpgrade()
Term term 44 of vocabulary 23 (j=0) (field-name-taxonomy-vocabulary-23) is displayed on node 6Otherupgrade.taxonomy.test152UpgradePathTaxonomyTestCase->testTaxonomyUpgrade()
Term term 45 of vocabulary 23 (j=1) (field-name-taxonomyextra) is displayed on node 6Otherupgrade.taxonomy.test152UpgradePathTaxonomyTestCase->testTaxonomyUpgrade()
Term term 46 of vocabulary 24 (j=0) (field-name-taxonomy-vocabulary-24) is displayed on node 6Otherupgrade.taxonomy.test152UpgradePathTaxonomyTestCase->testTaxonomyUpgrade()
Term term 47 of vocabulary 24 (j=1) (field-name-taxonomy-vocabulary-24) is displayed on node 6Otherupgrade.taxonomy.test152UpgradePathTaxonomyTestCase->testTaxonomyUpgrade()
Term term 48 of vocabulary 24 (j=2) (field-name-taxonomy-vocabulary-24) is displayed on node 6Otherupgrade.taxonomy.test152UpgradePathTaxonomyTestCase->testTaxonomyUpgrade()
strpos(): Empty delimiterWarningdrupal_web_test_case.php2585DrupalWebTestCase->assertRaw()
Term term 48 of vocabulary 24 (j=2) (field-name-taxonomy-vocabulary-24) is displayed on node 6 vid 11.Otherupgrade.taxonomy.test181UpgradePathTaxonomyTestCase->testTaxonomyUpgrade()
strpos(): Empty delimiterWarningdrupal_web_test_case.php2585DrupalWebTestCase->assertRaw()
Term term 48 of vocabulary 24 (j=2) (field-name-taxonomy-vocabulary-24) is displayed on node 6 11.Otherupgrade.taxonomy.test184UpgradePathTaxonomyTestCase->testTaxonomyUpgrade()
Term term 1 of vocabulary 1 (j=0) (field-name-taxonomyextra) is displayed on node 7Otherupgrade.taxonomy.test152UpgradePathTaxonomyTestCase->testTaxonomyUpgrade()
Term term 2 of vocabulary 2 (j=0) (field-name-taxonomyextra) is displayed on node 7Otherupgrade.taxonomy.test152UpgradePathTaxonomyTestCase->testTaxonomyUpgrade()
Term term 3 of vocabulary 2 (j=1) (field-name-taxonomyextra) is displayed on node 7Otherupgrade.taxonomy.test152UpgradePathTaxonomyTestCase->testTaxonomyUpgrade()
Term term 4 of vocabulary 3 (j=0) (field-name-taxonomyextra) is displayed on node 7Otherupgrade.taxonomy.test152UpgradePathTaxonomyTestCase->testTaxonomyUpgrade()
Term term 5 of vocabulary 3 (j=1) (field-name-taxonomyextra) is displayed on node 7Otherupgrade.taxonomy.test152UpgradePathTaxonomyTestCase->testTaxonomyUpgrade()
Term term 6 of vocabulary 3 (j=2) (field-name-taxonomyextra) is displayed on node 7Otherupgrade.taxonomy.test152UpgradePathTaxonomyTestCase->testTaxonomyUpgrade()
Term term 8 of vocabulary 5 (j=0) (field-name-taxonomyextra) is displayed on node 7Otherupgrade.taxonomy.test152UpgradePathTaxonomyTestCase->testTaxonomyUpgrade()
Term term 9 of vocabulary 5 (j=1) (field-name-taxonomyextra) is displayed on node 7Otherupgrade.taxonomy.test152UpgradePathTaxonomyTestCase->testTaxonomyUpgrade()
LeafTaxonomy vocabularies (TaxonomyVocabularyUnitTest) [Taxonomy]6100
LeafTaxonomy vocabulary interface (TaxonomyVocabularyFunctionalTest) [Taxonomy]9700
LeafTemporary query test (DatabaseTemporaryQueryTestCase) [Database]500
LeafTest date field (ProfileTestDate) [Profile]4900
LeafTest field weights (ProfileTestWeights) [Profile]5300
LeafTest for legacy node bug. (TaxonomyLegacyTestCase) [Taxonomy]1300
LeafTest select field (ProfileTestSelect) [Profile]4500
LeafTest single fields (ProfileTestFields) [Profile]18000
LeafTest statistics admin. (StatisticsAdminTestCase) [Statistics]10400
LeafTest user actions (TriggerUserActionTestCase) [Trigger]6500
LeafTest user triggers (TriggerUserTokenTestCase) [Trigger]18500
LeafTesting SimpleTest setUp (SimpleTestFolderTestCase) [SimpleTest]100
LeafText field (TextFieldTestCase) [Field types]19700
LeafText summary (TextSummaryTestCase) [Field types]13800
LeafText translation (TextTranslationTestCase) [Field types]10400
LeafTheme API (ThemeUnitTest) [Theme]1600
LeafTheme fast initialization (ThemeFastTestCase) [Theme]1000
LeafTheme initialization in hook_init() (ThemeHookInitUnitTest) [Theme]400
LeafTheme interface functionality (SystemThemeFunctionalTest) [System]6600
LeafTheme item list (ThemeItemListUnitTest) [Theme]100
LeafTheme Table (ThemeTableUnitTest) [Theme]600
LeafTimer test (BootstrapTimerTestCase) [Bootstrap]500
LeafToken replacement (TokenReplaceTestCase) [System]2700
LeafTop visitor blocking (StatisticsBlockVisitorsTestCase) [Statistics]4500
LeafTracker (TrackerTest) [Tracker]21900
LeafTransaction tests (DatabaseTransactionTestCase) [Database]3100
LeafTranslation export (LocaleExportFunctionalTest) [Locale]2900
LeafTranslation functionality (TranslationTestCase) [Translation]42100
LeafTranslation import (LocaleImportFunctionalTest) [Locale]11600
LeafTrigger content (node) actions (TriggerContentTestCase) [Trigger]35300
LeafTrigger cron (system) actions (TriggerCronTestCase) [Trigger]3300
LeafTrigger orphaned actions (TriggerOrphanedActionsTestCase) [Trigger]3700
LeafTrigger other actions (TriggerOtherTestCase) [Trigger]11200
LeafUI language negotiation (LocaleUILanguageNegotiationTest) [Locale]7300
LeafUnassigned text format functionality (FilterNoFormatTestCase) [Filter]100
LeafUnicode handling (UnicodeUnitTest) [System]17600
LeafUnmanaged file copying (FileUnmanagedCopyTest) [File API]3100
LeafUnmanaged file delete (FileUnmanagedDeleteTest) [File API]800
LeafUnmanaged file moving (FileUnmanagedMoveTest) [File API]3000
LeafUnmanaged file save data (FileUnmanagedSaveDataTest) [File API]1400
LeafUnmanaged recursive file delete (FileUnmanagedDeleteRecursiveTest) [File API]1700
ExpandUpdate contrib functionality (UpdateTestContribCase) [Update]1681318
MessageGroupFilenameLineFunctionStatus
strpos(): Empty delimiterWarningdrupal_web_test_case.php2585DrupalWebTestCase->assertRaw()
Raw "" foundOtherupdate.test251UpdateTestContribCase->testNoReleasesAvailable()
strpos(): Empty delimiterWarningdrupal_web_test_case.php2605DrupalWebTestCase->assertNoRaw()
strpos(): Empty delimiterWarningdrupal_web_test_case.php2585DrupalWebTestCase->assertRaw()
Link to the Drupal project appears.Otherupdate.test48UpdateTestHelper->standardTests()
strpos(): Empty delimiterWarningdrupal_web_test_case.php2585DrupalWebTestCase->assertRaw()
Link to aaa_update_test project appears.Otherupdate.test284UpdateTestContribCase->testUpdateContribBasic()
strpos(): Empty delimiterWarningdrupal_web_test_case.php2585DrupalWebTestCase->assertRaw()
Link to the Drupal project appears.Otherupdate.test48UpdateTestHelper->standardTests()
strpos(): Empty delimiterWarningdrupal_web_test_case.php2605DrupalWebTestCase->assertNoRaw()
strpos(): Empty delimiterWarningdrupal_web_test_case.php2585DrupalWebTestCase->assertRaw()
Link to bbb_update_test project appears.Otherupdate.test347UpdateTestContribCase->testUpdateContribOrder()
strpos(): Empty delimiterWarningdrupal_web_test_case.php2585DrupalWebTestCase->assertRaw()
Link to bbb_update_test project appears.Otherupdate.test348UpdateTestContribCase->testUpdateContribOrder()
strpos(): Empty delimiterWarningdrupal_web_test_case.php2585DrupalWebTestCase->assertRaw()
Link to the Update test base theme project appears.Otherupdate.test397UpdateTestContribCase->testUpdateBaseThemeSecurityUpdate()
strpos(): Empty delimiterWarningdrupal_web_test_case.php2585DrupalWebTestCase->assertRaw()
Link to the Update test base theme project appears.Otherupdate.test445UpdateTestContribCase->testUpdateShowDisabledThemes()
strpos(): Empty delimiterWarningdrupal_web_test_case.php2585DrupalWebTestCase->assertRaw()
Link to the Update test subtheme project appears.Otherupdate.test446UpdateTestContribCase->testUpdateShowDisabledThemes()
strpos(): Empty delimiterWarningdrupal_web_test_case.php2605DrupalWebTestCase->assertNoRaw()
strpos(): Empty delimiterWarningdrupal_web_test_case.php2605DrupalWebTestCase->assertNoRaw()
strpos(): Empty delimiterWarningdrupal_web_test_case.php2585DrupalWebTestCase->assertRaw()
Link to aaa_update_test project appears.Otherupdate.test507UpdateTestContribCase->testUpdateBrokenFetchURL()
strpos(): Empty delimiterWarningdrupal_web_test_case.php2605DrupalWebTestCase->assertNoRaw()
strpos(): Empty delimiterWarningdrupal_web_test_case.php2585DrupalWebTestCase->assertRaw()
Link to bbb_update_test project appears.Otherupdate.test509UpdateTestContribCase->testUpdateBrokenFetchURL()
ExpandUpdate core functionality (UpdateCoreTestCase) [Update]15199
MessageGroupFilenameLineFunctionStatus
strpos(): Empty delimiterWarningdrupal_web_test_case.php2585DrupalWebTestCase->assertRaw()
Link to the Drupal project appears.Otherupdate.test48UpdateTestHelper->standardTests()
strpos(): Empty delimiterWarningdrupal_web_test_case.php2585DrupalWebTestCase->assertRaw()
Link to the Drupal project appears.Otherupdate.test48UpdateTestHelper->standardTests()
strpos(): Empty delimiterWarningdrupal_web_test_case.php2585DrupalWebTestCase->assertRaw()
Link to release appears.Otherupdate.test92UpdateCoreTestCase->testNormalUpdateAvailable()
strpos(): Empty delimiterWarningdrupal_web_test_case.php2585DrupalWebTestCase->assertRaw()
Link to download appears.Otherupdate.test93UpdateCoreTestCase->testNormalUpdateAvailable()
strpos(): Empty delimiterWarningdrupal_web_test_case.php2585DrupalWebTestCase->assertRaw()
Link to release notes appears.Otherupdate.test94UpdateCoreTestCase->testNormalUpdateAvailable()
strpos(): Empty delimiterWarningdrupal_web_test_case.php2585DrupalWebTestCase->assertRaw()
Link to the Drupal project appears.Otherupdate.test48UpdateTestHelper->standardTests()
strpos(): Empty delimiterWarningdrupal_web_test_case.php2585DrupalWebTestCase->assertRaw()
Link to release appears.Otherupdate.test107UpdateCoreTestCase->testSecurityUpdateAvailable()
strpos(): Empty delimiterWarningdrupal_web_test_case.php2585DrupalWebTestCase->assertRaw()
Link to download appears.Otherupdate.test108UpdateCoreTestCase->testSecurityUpdateAvailable()
strpos(): Empty delimiterWarningdrupal_web_test_case.php2585DrupalWebTestCase->assertRaw()
Link to release notes appears.Otherupdate.test109UpdateCoreTestCase->testSecurityUpdateAvailable()
LeafUpdate dependency hook invocation (UpdateDependencyHookInvocationTestCase) [Update API]300
LeafUpdate dependency ordering (UpdateDependencyOrderingTestCase) [Update API]300
LeafUpdate feed functionality (UpdateFeedTestCase) [Aggregator]7400
LeafUpdate feed item functionality (UpdateFeedItemTestCase) [Aggregator]6100
LeafUpdate functionality (UpdateScriptFunctionalTest) [System]5600
LeafUpdate on cron functionality (AggregatorCronTestCase) [Aggregator]5300
LeafUpdate tests (DatabaseUpdateTestCase) [Database]3500
LeafUpdate tests, Complex (DatabaseUpdateComplexTestCase) [Database]5200
LeafUpdate tests, LOB (DatabaseUpdateLOBTestCase) [Database]1300
LeafUpload and extract module functionality (UpdateTestUploadCase) [Update]6100
LeafUpload upgrade path (UploadUpgradePathTestCase) [Upgrade path]3300
LeafUpload user picture (UserPictureTestCase) [User]8900
LeafURL altering (UrlAlterFunctionalTest) [Path API]2800
ExpandURL generation tests (CommonURLUnitTest) [System]5240
MessageGroupFilenameLineFunctionStatus
XSS attack <SCRIPT>alert('XSS')</SCRIPT> was filteredOthercommon.test86CommonURLUnitTest->testLXSS()
Class active is present on link to the current pageOthercommon.test94CommonURLUnitTest->testLActiveClass()
Custom class y1SwlB7w is present on link when requestedOthercommon.test103CommonURLUnitTest->testLCustomClass()
Class active is present on link to the current pageOthercommon.test104CommonURLUnitTest->testLCustomClass()
LeafURL rewriting (LocaleUrlRewritingTest) [Locale]3200
LeafUser account links (UserAccountLinksUnitTests) [User]2100
LeafUser administration (UserAdminTestCase) [User]6411
LeafUser autocompletion (UserAutocompleteTestCase) [User]2800
LeafUser blocks (UserBlocksUnitTests) [User]4030
LeafUser create (UserCreateTestCase) [User]2700
LeafUser creation (LocaleUserCreationTest) [Locale]6800
LeafUser edit (UserEditTestCase) [User]6800
LeafUser edited own account (UserEditedOwnAccountTestCase) [User]2300
LeafUser language settings (LocaleUserLanguageFunctionalTest) [Locale]5100
LeafUser login (UserLoginTestCase) [User]13200
LeafUser poll vote capability. (PollVoteCheckHostname) [Poll]12400
LeafUser registration (UserRegistrationTestCase) [User]11900
LeafUser role administration (UserRoleAdminTestCase) [User]5300
LeafUser save test (UserSaveTestCase) [User]300
LeafUser search (UserUserSearchTestCase) [User]4300
LeafUser signatures (UserSignatureTestCase) [User]4500
LeafUser time zones (UserTimeZoneFunctionalTest) [User]3100
LeafUser token replacement (UserTokenReplaceTestCase) [User]4300
LeafUsername/e-mail validation (UserValidationTestCase) [User]2200
LeafValid Url (ValidUrlTestCase) [System]7900
LeafVariable test (BootstrapVariableTestCase) [Bootstrap]700
LeafXML-RPC basic (XMLRPCBasicTestCase) [XML-RPC]900
LeafXML-RPC message and alteration (XMLRPCMessagesTestCase) [XML-RPC]1000
LeafXML-RPC validator (XMLRPCValidator1IncTestCase) [XML-RPC]1800