2543294-3_TESTONLY.patch

Test status
StatusResult
Last receivedMon, 08/24/2015 - 07:07:00
Last requestedMon, 08/24/2015 - 07:07:01
Last testedMon, 08/24/2015 - 07:09:43
Test count2
Environment status
PHP 5.5 MySQLfail
File information
File2543294-3_TESTONLY.patch
BranchTranslation Management Tool - 8.x-1.x
LinkIssue Link
SummaryFAILED: [[SimpleTest]]: [PHP 5.5 MySQL] 2,578 pass(es), 3 fail(s), and 1 exception(s).
Details

PHP 5.5 MySQL

  1. Setup environment
  2. Detect an invalid patch URL
  3. Detect invalid repository information
  4. Detect invalid patch format
  5. Detect a non-applicable patch
  6. Detect invalid PHP syntax
  7. Detect a Drupal installation failure
  8. Detect a test run failure
  9. Detect a failing test
    Review the test failures below then if necessary run them locally until the problem has been fixed.
  10. Complete test suite with all tests passing
2,578 pass(es), 3 fail(s), and 1 exception(s)

Non-pass

Test namePassFailException
ExpandDrupal\tmgmt_config\Tests\ConfigSourceUiTest23920
MessageGroupFilenameLineFunctionStatus
"content of type view does not exist, the job can not be completed." foundOtherConfigSourceUiTest.php251Drupal\tmgmt_config\Tests\ConfigSourceUiTest->testViewTranslateTabSingleCheckout()
[24-Aug-2015 17:08:22 Australia/Sydney] Uncaught PHP Exception Drupal\tmgmt\TMGMTException: "Unable to load entity view with id content" at /var/lib/drupaltestbot/sites/default/files/checkout/sites/default/modules/tmgmt/sources/tmgmt_config/src/Plugin/tmgmt/Source/ConfigSource.php line 140 Fatal errorUnknown0Unknown
ExpandDrupal\tmgmt_content\Tests\ContentEntitySourceUiTest28411
MessageGroupFilenameLineFunctionStatus
Argument 1 passed to Drupal\tmgmt_content\Plugin\tmgmt\Source\ContentEntitySource::doSaveTranslations() must implement interface Drupal\Core\Entity\ContentEntityInterface, null given, called in /var/lib/drupaltestbot/sites/default/files/checkout/sites/default/modules/tmgmt/sources/content/src/Plugin/tmgmt/Source/ContentEntitySource.php on line 176 and definedRecoverable fatal errorContentEntitySource.php249Drupal\tmgmt_content\Plugin\tmgmt\Source\ContentEntitySource->doSaveTranslations()
"4 of type node does not exist, the job can not be completed." foundOtherContentEntitySourceUiTest.php187Drupal\tmgmt_content\Tests\ContentEntitySourceUiTest->testNodeTranslateTabSingleCheckout()

All

Test namePassFailException
LeafDrupal\tmgmt\Tests\CrudTest19900
LeafDrupal\tmgmt\Tests\HelperTest4300
LeafDrupal\tmgmt\Tests\LocalTasksTests3100
LeafDrupal\tmgmt\Tests\PluginsTest5000
LeafDrupal\tmgmt\Tests\TMGMTCartTest5200
LeafDrupal\tmgmt\Tests\TMGMTUiTest63200
LeafDrupal\tmgmt\Tests\TranslatorTest8500
LeafDrupal\tmgmt\Tests\TranslatorUITest3000
LeafDrupal\tmgmt_config\Tests\ConfigSourceListTest24400
ExpandDrupal\tmgmt_config\Tests\ConfigSourceUiTest23920
MessageGroupFilenameLineFunctionStatus
"content of type view does not exist, the job can not be completed." foundOtherConfigSourceUiTest.php251Drupal\tmgmt_config\Tests\ConfigSourceUiTest->testViewTranslateTabSingleCheckout()
[24-Aug-2015 17:08:22 Australia/Sydney] Uncaught PHP Exception Drupal\tmgmt\TMGMTException: "Unable to load entity view with id content" at /var/lib/drupaltestbot/sites/default/files/checkout/sites/default/modules/tmgmt/sources/tmgmt_config/src/Plugin/tmgmt/Source/ConfigSource.php line 140 Fatal errorUnknown0Unknown
LeafDrupal\tmgmt_config\Tests\ConfigSourceUnitTest3900
LeafDrupal\tmgmt_content\Tests\ContentEntitySourceListTest15900
ExpandDrupal\tmgmt_content\Tests\ContentEntitySourceUiTest28411
MessageGroupFilenameLineFunctionStatus
Argument 1 passed to Drupal\tmgmt_content\Plugin\tmgmt\Source\ContentEntitySource::doSaveTranslations() must implement interface Drupal\Core\Entity\ContentEntityInterface, null given, called in /var/lib/drupaltestbot/sites/default/files/checkout/sites/default/modules/tmgmt/sources/content/src/Plugin/tmgmt/Source/ContentEntitySource.php on line 176 and definedRecoverable fatal errorContentEntitySource.php249Drupal\tmgmt_content\Plugin\tmgmt\Source\ContentEntitySource->doSaveTranslations()
"4 of type node does not exist, the job can not be completed." foundOtherContentEntitySourceUiTest.php187Drupal\tmgmt_content\Tests\ContentEntitySourceUiTest->testNodeTranslateTabSingleCheckout()
LeafDrupal\tmgmt_content\Tests\ContentEntitySourceUnitTest14600
LeafDrupal\tmgmt_content\Tests\ContentEntitySuggestionsTest2400
LeafDrupal\tmgmt_demo\Tests\TMGMTDemoTest4800
LeafDrupal\tmgmt_file\Tests\FileTranslatorTest16000
LeafDrupal\tmgmt_locale\Tests\LocaleSourceTest6300
LeafDrupal\tmgmt_locale\Tests\LocaleSourceUiTest5000