redirect-adding-details-about-url-redirect-2540758-2-D7.diff

Test status
StatusResult
Last receivedThu, 08/20/2015 - 09:41:59
Last requestedThu, 08/20/2015 - 09:42:01
Last testedThu, 08/20/2015 - 09:43:04
Test count1
Environment status
MySQLfail
File information
Fileredirect-adding-details-about-url-redirect-2540758-2-D7.diff
BranchRedirect - 7.x-2.x
LinkIssue Link
SummaryFAILED: [[SimpleTest]]: [MySQL] 120 pass(es), 2 fail(s), and 5 exception(s).
Details

MySQL

  1. Setup environment
  2. Detect an invalid patch URL
  3. Detect invalid repository information
  4. Detect invalid patch format
  5. Detect a non-applicable patch
  6. Detect invalid PHP syntax
  7. Detect a Drupal installation failure
  8. Detect a test run failure
  9. Detect a failing test
    Review the test failures below then if necessary run them locally until the problem has been fixed.
  10. Complete test suite with all tests passing
120 pass(es), 2 fail(s), and 5 exception(s)

Non-pass

Test namePassFailException
ExpandRedirect functional tests (RedirectFunctionalTest) [Redirect]10925
MessageGroupFilenameLineFunctionStatus
PDOException: SQLSTATE[HY000]: General error: 1364 Field 'details' doesn't have a default value: INSERT INTO {redirect} (hash, type, uid, source, source_options, redirect, redirect_options, language, status_code, count, access, status) VALUES (:db_insert_placeholder_0, :db_insert_placeholder_1, :db_insert_placeholder_2, :db_insert_placeholder_3, :db_insert_placeholder_4, :db_insert_placeholder_5, :db_insert_placeholder_6, :db_insert_placeholder_7, :db_insert_placeholder_8, :db_insert_placeholder_9, :db_insert_placeholder_10, :db_insert_placeholder_11); Array ( [:db_insert_placeholder_0] => KBIkita9Pehkwi5pWnY7Q1MkIsXOly3bix42f68tw0g [:db_insert_placeholder_1] => redirect [:db_insert_placeholder_2] => 1 [:db_insert_placeholder_3] => redirect [:db_insert_placeholder_4] => a:0:{} [:db_insert_placeholder_5] => node [:db_insert_placeholder_6] => a:0:{} [:db_insert_placeholder_7] => und [:db_insert_placeholder_8] => 0 [:db_insert_placeholder_9] => 0 [:db_insert_placeholder_10] => 0 [:db_insert_placeholder_11] => 1 ) in drupal_write_record() (line 7316 of /var/lib/drupaltestbot/sites/default/files/checkout/includes/common.inc).Uncaught exceptiondatabase.inc2171PDOStatement->execute()
SQLSTATE[HY000]: General error: 1364 Field 'details' doesn't have a default value: INSERT INTO {redirect} (hash, type, uid, source, source_options, redirect, redirect_options, language, status_code, count, access, status) VALUES (:db_insert_placeholder_0, :db_insert_placeholder_1, :db_insert_placeholder_2, :db_insert_placeholder_3, :db_insert_placeholder_4, :db_insert_placeholder_5, :db_insert_placeholder_6, :db_insert_placeholder_7, :db_insert_placeholder_8, :db_insert_placeholder_9, :db_insert_placeholder_10, :db_insert_placeholder_11); Array ( [:db_insert_placeholder_0] => 2pQkRCXaoqDhjXNkiv8DrSW82SHCoajWzLWiDU0bSWo [:db_insert_placeholder_1] => redirect [:db_insert_placeholder_2] => 2 [:db_insert_placeholder_3] => first-alias [:db_insert_placeholder_4] => a:0:{} [:db_insert_placeholder_5] => node/1 [:db_insert_placeholder_6] => a:0:{} [:db_insert_placeholder_7] => und [:db_insert_placeholder_8] => 0 [:db_insert_placeholder_9] => 0 [:db_insert_placeholder_10] => 0 [:db_insert_placeholder_11] => 1 ) PDOExceptioncommon.inc7316drupal_write_record()
"a0c9yysL" foundOtherredirect.test240RedirectFunctionalTest->testPathChangeRedirects()
SQLSTATE[HY000]: General error: 1364 Field 'details' doesn't have a default value: INSERT INTO {redirect} (hash, type, uid, source, source_options, redirect, redirect_options, language, status_code, count, access, status) VALUES (:db_insert_placeholder_0, :db_insert_placeholder_1, :db_insert_placeholder_2, :db_insert_placeholder_3, :db_insert_placeholder_4, :db_insert_placeholder_5, :db_insert_placeholder_6, :db_insert_placeholder_7, :db_insert_placeholder_8, :db_insert_placeholder_9, :db_insert_placeholder_10, :db_insert_placeholder_11); Array ( [:db_insert_placeholder_0] => 2pQkRCXaoqDhjXNkiv8DrSW82SHCoajWzLWiDU0bSWo [:db_insert_placeholder_1] => redirect [:db_insert_placeholder_2] => 2 [:db_insert_placeholder_3] => first-alias [:db_insert_placeholder_4] => a:0:{} [:db_insert_placeholder_5] => node/1 [:db_insert_placeholder_6] => a:0:{} [:db_insert_placeholder_7] => und [:db_insert_placeholder_8] => 0 [:db_insert_placeholder_9] => 0 [:db_insert_placeholder_10] => 0 [:db_insert_placeholder_11] => 1 ) PDOExceptioncommon.inc7316drupal_write_record()
Changing node's alias back to 'second-alias' does not break page load with a circular redirect.Browserredirect.test243RedirectFunctionalTest->testPathChangeRedirects()
SQLSTATE[HY000]: General error: 1364 Field 'details' doesn't have a default value: INSERT INTO {redirect} (hash, type, uid, source, source_options, redirect, redirect_options, language, status_code, count, access, status) VALUES (:db_insert_placeholder_0, :db_insert_placeholder_1, :db_insert_placeholder_2, :db_insert_placeholder_3, :db_insert_placeholder_4, :db_insert_placeholder_5, :db_insert_placeholder_6, :db_insert_placeholder_7, :db_insert_placeholder_8, :db_insert_placeholder_9, :db_insert_placeholder_10, :db_insert_placeholder_11); Array ( [:db_insert_placeholder_0] => 2pQkRCXaoqDhjXNkiv8DrSW82SHCoajWzLWiDU0bSWo [:db_insert_placeholder_1] => redirect [:db_insert_placeholder_2] => 2 [:db_insert_placeholder_3] => first-alias [:db_insert_placeholder_4] => a:0:{} [:db_insert_placeholder_5] => node/1 [:db_insert_placeholder_6] => a:0:{} [:db_insert_placeholder_7] => und [:db_insert_placeholder_8] => 0 [:db_insert_placeholder_9] => 0 [:db_insert_placeholder_10] => 0 [:db_insert_placeholder_11] => 1 ) PDOExceptioncommon.inc7316drupal_write_record()
PDOException: SQLSTATE[HY000]: General error: 1364 Field 'details' doesn't have a default value: INSERT INTO {redirect} (hash, type, uid, source, source_options, redirect, redirect_options, language, status_code, count, access, status) VALUES (:db_insert_placeholder_0, :db_insert_placeholder_1, :db_insert_placeholder_2, :db_insert_placeholder_3, :db_insert_placeholder_4, :db_insert_placeholder_5, :db_insert_placeholder_6, :db_insert_placeholder_7, :db_insert_placeholder_8, :db_insert_placeholder_9, :db_insert_placeholder_10, :db_insert_placeholder_11); Array ( [:db_insert_placeholder_0] => KBIkita9Pehkwi5pWnY7Q1MkIsXOly3bix42f68tw0g [:db_insert_placeholder_1] => redirect [:db_insert_placeholder_2] => 1 [:db_insert_placeholder_3] => redirect [:db_insert_placeholder_4] => a:0:{} [:db_insert_placeholder_5] => node [:db_insert_placeholder_6] => a:0:{} [:db_insert_placeholder_7] => und [:db_insert_placeholder_8] => 0 [:db_insert_placeholder_9] => 0 [:db_insert_placeholder_10] => 0 [:db_insert_placeholder_11] => 1 ) in drupal_write_record() (line 7316 of /var/lib/drupaltestbot/sites/default/files/checkout/includes/common.inc).Uncaught exceptiondatabase.inc2171PDOStatement->execute()

All

Test namePassFailException
ExpandRedirect functional tests (RedirectFunctionalTest) [Redirect]10925
MessageGroupFilenameLineFunctionStatus
PDOException: SQLSTATE[HY000]: General error: 1364 Field 'details' doesn't have a default value: INSERT INTO {redirect} (hash, type, uid, source, source_options, redirect, redirect_options, language, status_code, count, access, status) VALUES (:db_insert_placeholder_0, :db_insert_placeholder_1, :db_insert_placeholder_2, :db_insert_placeholder_3, :db_insert_placeholder_4, :db_insert_placeholder_5, :db_insert_placeholder_6, :db_insert_placeholder_7, :db_insert_placeholder_8, :db_insert_placeholder_9, :db_insert_placeholder_10, :db_insert_placeholder_11); Array ( [:db_insert_placeholder_0] => KBIkita9Pehkwi5pWnY7Q1MkIsXOly3bix42f68tw0g [:db_insert_placeholder_1] => redirect [:db_insert_placeholder_2] => 1 [:db_insert_placeholder_3] => redirect [:db_insert_placeholder_4] => a:0:{} [:db_insert_placeholder_5] => node [:db_insert_placeholder_6] => a:0:{} [:db_insert_placeholder_7] => und [:db_insert_placeholder_8] => 0 [:db_insert_placeholder_9] => 0 [:db_insert_placeholder_10] => 0 [:db_insert_placeholder_11] => 1 ) in drupal_write_record() (line 7316 of /var/lib/drupaltestbot/sites/default/files/checkout/includes/common.inc).Uncaught exceptiondatabase.inc2171PDOStatement->execute()
SQLSTATE[HY000]: General error: 1364 Field 'details' doesn't have a default value: INSERT INTO {redirect} (hash, type, uid, source, source_options, redirect, redirect_options, language, status_code, count, access, status) VALUES (:db_insert_placeholder_0, :db_insert_placeholder_1, :db_insert_placeholder_2, :db_insert_placeholder_3, :db_insert_placeholder_4, :db_insert_placeholder_5, :db_insert_placeholder_6, :db_insert_placeholder_7, :db_insert_placeholder_8, :db_insert_placeholder_9, :db_insert_placeholder_10, :db_insert_placeholder_11); Array ( [:db_insert_placeholder_0] => 2pQkRCXaoqDhjXNkiv8DrSW82SHCoajWzLWiDU0bSWo [:db_insert_placeholder_1] => redirect [:db_insert_placeholder_2] => 2 [:db_insert_placeholder_3] => first-alias [:db_insert_placeholder_4] => a:0:{} [:db_insert_placeholder_5] => node/1 [:db_insert_placeholder_6] => a:0:{} [:db_insert_placeholder_7] => und [:db_insert_placeholder_8] => 0 [:db_insert_placeholder_9] => 0 [:db_insert_placeholder_10] => 0 [:db_insert_placeholder_11] => 1 ) PDOExceptioncommon.inc7316drupal_write_record()
"a0c9yysL" foundOtherredirect.test240RedirectFunctionalTest->testPathChangeRedirects()
SQLSTATE[HY000]: General error: 1364 Field 'details' doesn't have a default value: INSERT INTO {redirect} (hash, type, uid, source, source_options, redirect, redirect_options, language, status_code, count, access, status) VALUES (:db_insert_placeholder_0, :db_insert_placeholder_1, :db_insert_placeholder_2, :db_insert_placeholder_3, :db_insert_placeholder_4, :db_insert_placeholder_5, :db_insert_placeholder_6, :db_insert_placeholder_7, :db_insert_placeholder_8, :db_insert_placeholder_9, :db_insert_placeholder_10, :db_insert_placeholder_11); Array ( [:db_insert_placeholder_0] => 2pQkRCXaoqDhjXNkiv8DrSW82SHCoajWzLWiDU0bSWo [:db_insert_placeholder_1] => redirect [:db_insert_placeholder_2] => 2 [:db_insert_placeholder_3] => first-alias [:db_insert_placeholder_4] => a:0:{} [:db_insert_placeholder_5] => node/1 [:db_insert_placeholder_6] => a:0:{} [:db_insert_placeholder_7] => und [:db_insert_placeholder_8] => 0 [:db_insert_placeholder_9] => 0 [:db_insert_placeholder_10] => 0 [:db_insert_placeholder_11] => 1 ) PDOExceptioncommon.inc7316drupal_write_record()
Changing node's alias back to 'second-alias' does not break page load with a circular redirect.Browserredirect.test243RedirectFunctionalTest->testPathChangeRedirects()
SQLSTATE[HY000]: General error: 1364 Field 'details' doesn't have a default value: INSERT INTO {redirect} (hash, type, uid, source, source_options, redirect, redirect_options, language, status_code, count, access, status) VALUES (:db_insert_placeholder_0, :db_insert_placeholder_1, :db_insert_placeholder_2, :db_insert_placeholder_3, :db_insert_placeholder_4, :db_insert_placeholder_5, :db_insert_placeholder_6, :db_insert_placeholder_7, :db_insert_placeholder_8, :db_insert_placeholder_9, :db_insert_placeholder_10, :db_insert_placeholder_11); Array ( [:db_insert_placeholder_0] => 2pQkRCXaoqDhjXNkiv8DrSW82SHCoajWzLWiDU0bSWo [:db_insert_placeholder_1] => redirect [:db_insert_placeholder_2] => 2 [:db_insert_placeholder_3] => first-alias [:db_insert_placeholder_4] => a:0:{} [:db_insert_placeholder_5] => node/1 [:db_insert_placeholder_6] => a:0:{} [:db_insert_placeholder_7] => und [:db_insert_placeholder_8] => 0 [:db_insert_placeholder_9] => 0 [:db_insert_placeholder_10] => 0 [:db_insert_placeholder_11] => 1 ) PDOExceptioncommon.inc7316drupal_write_record()
PDOException: SQLSTATE[HY000]: General error: 1364 Field 'details' doesn't have a default value: INSERT INTO {redirect} (hash, type, uid, source, source_options, redirect, redirect_options, language, status_code, count, access, status) VALUES (:db_insert_placeholder_0, :db_insert_placeholder_1, :db_insert_placeholder_2, :db_insert_placeholder_3, :db_insert_placeholder_4, :db_insert_placeholder_5, :db_insert_placeholder_6, :db_insert_placeholder_7, :db_insert_placeholder_8, :db_insert_placeholder_9, :db_insert_placeholder_10, :db_insert_placeholder_11); Array ( [:db_insert_placeholder_0] => KBIkita9Pehkwi5pWnY7Q1MkIsXOly3bix42f68tw0g [:db_insert_placeholder_1] => redirect [:db_insert_placeholder_2] => 1 [:db_insert_placeholder_3] => redirect [:db_insert_placeholder_4] => a:0:{} [:db_insert_placeholder_5] => node [:db_insert_placeholder_6] => a:0:{} [:db_insert_placeholder_7] => und [:db_insert_placeholder_8] => 0 [:db_insert_placeholder_9] => 0 [:db_insert_placeholder_10] => 0 [:db_insert_placeholder_11] => 1 ) in drupal_write_record() (line 7316 of /var/lib/drupaltestbot/sites/default/files/checkout/includes/common.inc).Uncaught exceptiondatabase.inc2171PDOStatement->execute()
LeafRedirect unit tests (RedirectUnitTest) [Redirect]1100