payment_2134873_7.patch

Test status
StatusResult
Last receivedTue, 08/18/2015 - 08:25:00
Last requestedTue, 08/18/2015 - 08:25:01
Last testedTue, 08/18/2015 - 08:27:14
Test count1
Environment status
PHP 5.5 MySQLfail
File information
Filepayment_2134873_7.patch
BranchPayment - 8.x-2.x
LinkIssue Link
SummaryFAILED: [[SimpleTest]]: [PHP 5.5 MySQL] 1,280 pass(es), 11 fail(s), and 0 exception(s).
Details

PHP 5.5 MySQL

  1. Setup environment
  2. Detect an invalid patch URL
  3. Detect invalid repository information
  4. Detect invalid patch format
  5. Detect a non-applicable patch
  6. Detect invalid PHP syntax
  7. Detect a Drupal installation failure
  8. Detect a test run failure
  9. Detect a failing test
    Review the test failures below then if necessary run them locally until the problem has been fixed.
  10. Complete test suite with all tests passing
1,280 pass(es), 11 fail(s), and 0 exception(s)

Non-pass

Test namePassFailException
ExpandDrupal\Tests\payment\Kernel\Entity\PaymentTest0110
MessageGroupFilenameLineFunctionStatus
Drupal\Tests\payment\Kernel\Entity\PaymentTest::testLabel PHPUnit_Framework_Exception: Unavailable module: 'currency'. If this module needs to be downloaded separately, annotate the test class with '@requires module currency'. /var/lib/drupaltestbot/sites/default/files/checkout/core/tests/Drupal/KernelTests/KernelTestBase.php:503 /var/lib/drupaltestbot/sites/default/files/checkout/core/tests/Drupal/KernelTests/KernelTestBase.php:334 /var/lib/drupaltestbot/sites/default/files/checkout/core/tests/Drupal/KernelTests/KernelTestBase.php:215 /var/lib/drupaltestbot/sites/default/files/checkout/sites/default/modules/payment/tests/src/Kernel/Entity/PaymentTest.php:50 OtherPaymentTest.php60Drupal\Tests\payment\Kernel\Entity\PaymentTest->testLabel()
Drupal\Tests\payment\Kernel\Entity\PaymentTest::testBundle PHPUnit_Framework_Exception: Unavailable module: 'currency'. If this module needs to be downloaded separately, annotate the test class with '@requires module currency'. /var/lib/drupaltestbot/sites/default/files/checkout/core/tests/Drupal/KernelTests/KernelTestBase.php:503 /var/lib/drupaltestbot/sites/default/files/checkout/core/tests/Drupal/KernelTests/KernelTestBase.php:334 /var/lib/drupaltestbot/sites/default/files/checkout/core/tests/Drupal/KernelTests/KernelTestBase.php:215 /var/lib/drupaltestbot/sites/default/files/checkout/sites/default/modules/payment/tests/src/Kernel/Entity/PaymentTest.php:50 OtherPaymentTest.php67Drupal\Tests\payment\Kernel\Entity\PaymentTest->testBundle()
Drupal\Tests\payment\Kernel\Entity\PaymentTest::testGetPaymentType PHPUnit_Framework_Exception: Unavailable module: 'currency'. If this module needs to be downloaded separately, annotate the test class with '@requires module currency'. /var/lib/drupaltestbot/sites/default/files/checkout/core/tests/Drupal/KernelTests/KernelTestBase.php:503 /var/lib/drupaltestbot/sites/default/files/checkout/core/tests/Drupal/KernelTests/KernelTestBase.php:334 /var/lib/drupaltestbot/sites/default/files/checkout/core/tests/Drupal/KernelTests/KernelTestBase.php:215 /var/lib/drupaltestbot/sites/default/files/checkout/sites/default/modules/payment/tests/src/Kernel/Entity/PaymentTest.php:50 OtherPaymentTest.php74Drupal\Tests\payment\Kernel\Entity\PaymentTest->testGetPaymentType()
Drupal\Tests\payment\Kernel\Entity\PaymentTest::testGetCurrencyCode PHPUnit_Framework_Exception: Unavailable module: 'currency'. If this module needs to be downloaded separately, annotate the test class with '@requires module currency'. /var/lib/drupaltestbot/sites/default/files/checkout/core/tests/Drupal/KernelTests/KernelTestBase.php:503 /var/lib/drupaltestbot/sites/default/files/checkout/core/tests/Drupal/KernelTests/KernelTestBase.php:334 /var/lib/drupaltestbot/sites/default/files/checkout/core/tests/Drupal/KernelTests/KernelTestBase.php:215 /var/lib/drupaltestbot/sites/default/files/checkout/sites/default/modules/payment/tests/src/Kernel/Entity/PaymentTest.php:50 OtherPaymentTest.php83Drupal\Tests\payment\Kernel\Entity\PaymentTest->testGetCurrencyCode()
Drupal\Tests\payment\Kernel\Entity\PaymentTest::testGetLineItem PHPUnit_Framework_Exception: Unavailable module: 'currency'. If this module needs to be downloaded separately, annotate the test class with '@requires module currency'. /var/lib/drupaltestbot/sites/default/files/checkout/core/tests/Drupal/KernelTests/KernelTestBase.php:503 /var/lib/drupaltestbot/sites/default/files/checkout/core/tests/Drupal/KernelTests/KernelTestBase.php:334 /var/lib/drupaltestbot/sites/default/files/checkout/core/tests/Drupal/KernelTests/KernelTestBase.php:215 /var/lib/drupaltestbot/sites/default/files/checkout/sites/default/modules/payment/tests/src/Kernel/Entity/PaymentTest.php:50 OtherPaymentTest.php93Drupal\Tests\payment\Kernel\Entity\PaymentTest->testGetLineItem()
Drupal\Tests\payment\Kernel\Entity\PaymentTest::testGetLineItemsByType PHPUnit_Framework_Exception: Unavailable module: 'currency'. If this module needs to be downloaded separately, annotate the test class with '@requires module currency'. /var/lib/drupaltestbot/sites/default/files/checkout/core/tests/Drupal/KernelTests/KernelTestBase.php:503 /var/lib/drupaltestbot/sites/default/files/checkout/core/tests/Drupal/KernelTests/KernelTestBase.php:334 /var/lib/drupaltestbot/sites/default/files/checkout/core/tests/Drupal/KernelTests/KernelTestBase.php:215 /var/lib/drupaltestbot/sites/default/files/checkout/sites/default/modules/payment/tests/src/Kernel/Entity/PaymentTest.php:50 OtherPaymentTest.php147Drupal\Tests\payment\Kernel\Entity\PaymentTest->testGetLineItemsByType()
Drupal\Tests\payment\Kernel\Entity\PaymentTest::testGetPaymentStatus PHPUnit_Framework_Exception: Unavailable module: 'currency'. If this module needs to be downloaded separately, annotate the test class with '@requires module currency'. /var/lib/drupaltestbot/sites/default/files/checkout/core/tests/Drupal/KernelTests/KernelTestBase.php:503 /var/lib/drupaltestbot/sites/default/files/checkout/core/tests/Drupal/KernelTests/KernelTestBase.php:334 /var/lib/drupaltestbot/sites/default/files/checkout/core/tests/Drupal/KernelTests/KernelTestBase.php:215 /var/lib/drupaltestbot/sites/default/files/checkout/sites/default/modules/payment/tests/src/Kernel/Entity/PaymentTest.php:50 OtherPaymentTest.php163Drupal\Tests\payment\Kernel\Entity\PaymentTest->testGetPaymentStatus()
Drupal\Tests\payment\Kernel\Entity\PaymentTest::testGetPaymentStatuses PHPUnit_Framework_Exception: Unavailable module: 'currency'. If this module needs to be downloaded separately, annotate the test class with '@requires module currency'. /var/lib/drupaltestbot/sites/default/files/checkout/core/tests/Drupal/KernelTests/KernelTestBase.php:503 /var/lib/drupaltestbot/sites/default/files/checkout/core/tests/Drupal/KernelTests/KernelTestBase.php:334 /var/lib/drupaltestbot/sites/default/files/checkout/core/tests/Drupal/KernelTests/KernelTestBase.php:215 /var/lib/drupaltestbot/sites/default/files/checkout/sites/default/modules/payment/tests/src/Kernel/Entity/PaymentTest.php:50 OtherPaymentTest.php186Drupal\Tests\payment\Kernel\Entity\PaymentTest->testGetPaymentStatuses()
Drupal\Tests\payment\Kernel\Entity\PaymentTest::testGetPaymentMethod PHPUnit_Framework_Exception: Unavailable module: 'currency'. If this module needs to be downloaded separately, annotate the test class with '@requires module currency'. /var/lib/drupaltestbot/sites/default/files/checkout/core/tests/Drupal/KernelTests/KernelTestBase.php:503 /var/lib/drupaltestbot/sites/default/files/checkout/core/tests/Drupal/KernelTests/KernelTestBase.php:334 /var/lib/drupaltestbot/sites/default/files/checkout/core/tests/Drupal/KernelTests/KernelTestBase.php:215 /var/lib/drupaltestbot/sites/default/files/checkout/sites/default/modules/payment/tests/src/Kernel/Entity/PaymentTest.php:50 OtherPaymentTest.php200Drupal\Tests\payment\Kernel\Entity\PaymentTest->testGetPaymentMethod()
Drupal\Tests\payment\Kernel\Entity\PaymentTest::testGetOwnerId PHPUnit_Framework_Exception: Unavailable module: 'currency'. If this module needs to be downloaded separately, annotate the test class with '@requires module currency'. /var/lib/drupaltestbot/sites/default/files/checkout/core/tests/Drupal/KernelTests/KernelTestBase.php:503 /var/lib/drupaltestbot/sites/default/files/checkout/core/tests/Drupal/KernelTests/KernelTestBase.php:334 /var/lib/drupaltestbot/sites/default/files/checkout/core/tests/Drupal/KernelTests/KernelTestBase.php:215 /var/lib/drupaltestbot/sites/default/files/checkout/sites/default/modules/payment/tests/src/Kernel/Entity/PaymentTest.php:50 OtherPaymentTest.php210Drupal\Tests\payment\Kernel\Entity\PaymentTest->testGetOwnerId()
Drupal\Tests\payment\Kernel\Entity\PaymentTest::testGetAmount PHPUnit_Framework_Exception: Unavailable module: 'currency'. If this module needs to be downloaded separately, annotate the test class with '@requires module currency'. /var/lib/drupaltestbot/sites/default/files/checkout/core/tests/Drupal/KernelTests/KernelTestBase.php:503 /var/lib/drupaltestbot/sites/default/files/checkout/core/tests/Drupal/KernelTests/KernelTestBase.php:334 /var/lib/drupaltestbot/sites/default/files/checkout/core/tests/Drupal/KernelTests/KernelTestBase.php:215 /var/lib/drupaltestbot/sites/default/files/checkout/sites/default/modules/payment/tests/src/Kernel/Entity/PaymentTest.php:50 OtherPaymentTest.php219Drupal\Tests\payment\Kernel\Entity\PaymentTest->testGetAmount()

All

Test namePassFailException
LeafDrupal\payment\Tests\Controller\PaymentMethodWebTest22800
LeafDrupal\payment\Tests\Controller\PaymentStatusWebTest9000
LeafDrupal\payment\Tests\Controller\PaymentTypeWebTest14600
LeafDrupal\payment\Tests\Controller\PaymentWebTest9500
LeafDrupal\payment\Tests\DatabaseQueueWebTest1300
LeafDrupal\payment\Tests\Element\PaymentLineItemsInputWebTest5900
LeafDrupal\payment\Tests\Entity\Payment\PaymentStorageWebTest2000
LeafDrupal\payment\Tests\ModuleInstallUninstallWebTest500
LeafDrupal\payment\Tests\PaymentAdministrationCategoryWebTest2300
LeafDrupal\payment\Tests\Plugin\Payment\LineItem\BasicWebTest1600
LeafDrupal\payment_form\Tests\Plugin\Field\FieldFormatter\PaymentFormWebTest1900
LeafDrupal\payment_form\Tests\Plugin\Field\FieldType\PaymentFormWebTest1300
LeafDrupal\payment_form\Tests\Plugin\Field\FieldWidget\PaymentFormWebTest3200
LeafDrupal\payment_reference\Tests\Element\PaymentReferenceWebTest3500
LeafDrupal\payment_reference\Tests\Plugin\Field\FieldType\PaymentReferenceWebTest3100
LeafDrupal\payment_reference\Tests\Plugin\Field\FieldWidget\PaymentReferenceWebTest1700
ExpandDrupal\Tests\payment\Kernel\Entity\PaymentTest0110
MessageGroupFilenameLineFunctionStatus
Drupal\Tests\payment\Kernel\Entity\PaymentTest::testLabel PHPUnit_Framework_Exception: Unavailable module: 'currency'. If this module needs to be downloaded separately, annotate the test class with '@requires module currency'. /var/lib/drupaltestbot/sites/default/files/checkout/core/tests/Drupal/KernelTests/KernelTestBase.php:503 /var/lib/drupaltestbot/sites/default/files/checkout/core/tests/Drupal/KernelTests/KernelTestBase.php:334 /var/lib/drupaltestbot/sites/default/files/checkout/core/tests/Drupal/KernelTests/KernelTestBase.php:215 /var/lib/drupaltestbot/sites/default/files/checkout/sites/default/modules/payment/tests/src/Kernel/Entity/PaymentTest.php:50 OtherPaymentTest.php60Drupal\Tests\payment\Kernel\Entity\PaymentTest->testLabel()
Drupal\Tests\payment\Kernel\Entity\PaymentTest::testBundle PHPUnit_Framework_Exception: Unavailable module: 'currency'. If this module needs to be downloaded separately, annotate the test class with '@requires module currency'. /var/lib/drupaltestbot/sites/default/files/checkout/core/tests/Drupal/KernelTests/KernelTestBase.php:503 /var/lib/drupaltestbot/sites/default/files/checkout/core/tests/Drupal/KernelTests/KernelTestBase.php:334 /var/lib/drupaltestbot/sites/default/files/checkout/core/tests/Drupal/KernelTests/KernelTestBase.php:215 /var/lib/drupaltestbot/sites/default/files/checkout/sites/default/modules/payment/tests/src/Kernel/Entity/PaymentTest.php:50 OtherPaymentTest.php67Drupal\Tests\payment\Kernel\Entity\PaymentTest->testBundle()
Drupal\Tests\payment\Kernel\Entity\PaymentTest::testGetPaymentType PHPUnit_Framework_Exception: Unavailable module: 'currency'. If this module needs to be downloaded separately, annotate the test class with '@requires module currency'. /var/lib/drupaltestbot/sites/default/files/checkout/core/tests/Drupal/KernelTests/KernelTestBase.php:503 /var/lib/drupaltestbot/sites/default/files/checkout/core/tests/Drupal/KernelTests/KernelTestBase.php:334 /var/lib/drupaltestbot/sites/default/files/checkout/core/tests/Drupal/KernelTests/KernelTestBase.php:215 /var/lib/drupaltestbot/sites/default/files/checkout/sites/default/modules/payment/tests/src/Kernel/Entity/PaymentTest.php:50 OtherPaymentTest.php74Drupal\Tests\payment\Kernel\Entity\PaymentTest->testGetPaymentType()
Drupal\Tests\payment\Kernel\Entity\PaymentTest::testGetCurrencyCode PHPUnit_Framework_Exception: Unavailable module: 'currency'. If this module needs to be downloaded separately, annotate the test class with '@requires module currency'. /var/lib/drupaltestbot/sites/default/files/checkout/core/tests/Drupal/KernelTests/KernelTestBase.php:503 /var/lib/drupaltestbot/sites/default/files/checkout/core/tests/Drupal/KernelTests/KernelTestBase.php:334 /var/lib/drupaltestbot/sites/default/files/checkout/core/tests/Drupal/KernelTests/KernelTestBase.php:215 /var/lib/drupaltestbot/sites/default/files/checkout/sites/default/modules/payment/tests/src/Kernel/Entity/PaymentTest.php:50 OtherPaymentTest.php83Drupal\Tests\payment\Kernel\Entity\PaymentTest->testGetCurrencyCode()
Drupal\Tests\payment\Kernel\Entity\PaymentTest::testGetLineItem PHPUnit_Framework_Exception: Unavailable module: 'currency'. If this module needs to be downloaded separately, annotate the test class with '@requires module currency'. /var/lib/drupaltestbot/sites/default/files/checkout/core/tests/Drupal/KernelTests/KernelTestBase.php:503 /var/lib/drupaltestbot/sites/default/files/checkout/core/tests/Drupal/KernelTests/KernelTestBase.php:334 /var/lib/drupaltestbot/sites/default/files/checkout/core/tests/Drupal/KernelTests/KernelTestBase.php:215 /var/lib/drupaltestbot/sites/default/files/checkout/sites/default/modules/payment/tests/src/Kernel/Entity/PaymentTest.php:50 OtherPaymentTest.php93Drupal\Tests\payment\Kernel\Entity\PaymentTest->testGetLineItem()
Drupal\Tests\payment\Kernel\Entity\PaymentTest::testGetLineItemsByType PHPUnit_Framework_Exception: Unavailable module: 'currency'. If this module needs to be downloaded separately, annotate the test class with '@requires module currency'. /var/lib/drupaltestbot/sites/default/files/checkout/core/tests/Drupal/KernelTests/KernelTestBase.php:503 /var/lib/drupaltestbot/sites/default/files/checkout/core/tests/Drupal/KernelTests/KernelTestBase.php:334 /var/lib/drupaltestbot/sites/default/files/checkout/core/tests/Drupal/KernelTests/KernelTestBase.php:215 /var/lib/drupaltestbot/sites/default/files/checkout/sites/default/modules/payment/tests/src/Kernel/Entity/PaymentTest.php:50 OtherPaymentTest.php147Drupal\Tests\payment\Kernel\Entity\PaymentTest->testGetLineItemsByType()
Drupal\Tests\payment\Kernel\Entity\PaymentTest::testGetPaymentStatus PHPUnit_Framework_Exception: Unavailable module: 'currency'. If this module needs to be downloaded separately, annotate the test class with '@requires module currency'. /var/lib/drupaltestbot/sites/default/files/checkout/core/tests/Drupal/KernelTests/KernelTestBase.php:503 /var/lib/drupaltestbot/sites/default/files/checkout/core/tests/Drupal/KernelTests/KernelTestBase.php:334 /var/lib/drupaltestbot/sites/default/files/checkout/core/tests/Drupal/KernelTests/KernelTestBase.php:215 /var/lib/drupaltestbot/sites/default/files/checkout/sites/default/modules/payment/tests/src/Kernel/Entity/PaymentTest.php:50 OtherPaymentTest.php163Drupal\Tests\payment\Kernel\Entity\PaymentTest->testGetPaymentStatus()
Drupal\Tests\payment\Kernel\Entity\PaymentTest::testGetPaymentStatuses PHPUnit_Framework_Exception: Unavailable module: 'currency'. If this module needs to be downloaded separately, annotate the test class with '@requires module currency'. /var/lib/drupaltestbot/sites/default/files/checkout/core/tests/Drupal/KernelTests/KernelTestBase.php:503 /var/lib/drupaltestbot/sites/default/files/checkout/core/tests/Drupal/KernelTests/KernelTestBase.php:334 /var/lib/drupaltestbot/sites/default/files/checkout/core/tests/Drupal/KernelTests/KernelTestBase.php:215 /var/lib/drupaltestbot/sites/default/files/checkout/sites/default/modules/payment/tests/src/Kernel/Entity/PaymentTest.php:50 OtherPaymentTest.php186Drupal\Tests\payment\Kernel\Entity\PaymentTest->testGetPaymentStatuses()
Drupal\Tests\payment\Kernel\Entity\PaymentTest::testGetPaymentMethod PHPUnit_Framework_Exception: Unavailable module: 'currency'. If this module needs to be downloaded separately, annotate the test class with '@requires module currency'. /var/lib/drupaltestbot/sites/default/files/checkout/core/tests/Drupal/KernelTests/KernelTestBase.php:503 /var/lib/drupaltestbot/sites/default/files/checkout/core/tests/Drupal/KernelTests/KernelTestBase.php:334 /var/lib/drupaltestbot/sites/default/files/checkout/core/tests/Drupal/KernelTests/KernelTestBase.php:215 /var/lib/drupaltestbot/sites/default/files/checkout/sites/default/modules/payment/tests/src/Kernel/Entity/PaymentTest.php:50 OtherPaymentTest.php200Drupal\Tests\payment\Kernel\Entity\PaymentTest->testGetPaymentMethod()
Drupal\Tests\payment\Kernel\Entity\PaymentTest::testGetOwnerId PHPUnit_Framework_Exception: Unavailable module: 'currency'. If this module needs to be downloaded separately, annotate the test class with '@requires module currency'. /var/lib/drupaltestbot/sites/default/files/checkout/core/tests/Drupal/KernelTests/KernelTestBase.php:503 /var/lib/drupaltestbot/sites/default/files/checkout/core/tests/Drupal/KernelTests/KernelTestBase.php:334 /var/lib/drupaltestbot/sites/default/files/checkout/core/tests/Drupal/KernelTests/KernelTestBase.php:215 /var/lib/drupaltestbot/sites/default/files/checkout/sites/default/modules/payment/tests/src/Kernel/Entity/PaymentTest.php:50 OtherPaymentTest.php210Drupal\Tests\payment\Kernel\Entity\PaymentTest->testGetOwnerId()
Drupal\Tests\payment\Kernel\Entity\PaymentTest::testGetAmount PHPUnit_Framework_Exception: Unavailable module: 'currency'. If this module needs to be downloaded separately, annotate the test class with '@requires module currency'. /var/lib/drupaltestbot/sites/default/files/checkout/core/tests/Drupal/KernelTests/KernelTestBase.php:503 /var/lib/drupaltestbot/sites/default/files/checkout/core/tests/Drupal/KernelTests/KernelTestBase.php:334 /var/lib/drupaltestbot/sites/default/files/checkout/core/tests/Drupal/KernelTests/KernelTestBase.php:215 /var/lib/drupaltestbot/sites/default/files/checkout/sites/default/modules/payment/tests/src/Kernel/Entity/PaymentTest.php:50 OtherPaymentTest.php219Drupal\Tests\payment\Kernel\Entity\PaymentTest->testGetAmount()
LeafDrupal\Tests\payment\Unit\Controller\AddPaymentMethodConfigurationTest400
LeafDrupal\Tests\payment\Unit\Controller\AddPaymentStatusTest200
LeafDrupal\Tests\payment\Unit\Controller\CompletePaymentTest100
LeafDrupal\Tests\payment\Unit\Controller\ConfigurePaymentTypeTest300
LeafDrupal\Tests\payment\Unit\Controller\DisablePaymentMethodConfigurationTest100
LeafDrupal\Tests\payment\Unit\Controller\DuplicatePaymentMethodConfigurationTest300
LeafDrupal\Tests\payment\Unit\Controller\EditPaymentMethodConfigurationTest200
LeafDrupal\Tests\payment\Unit\Controller\EditPaymentStatusTest200
LeafDrupal\Tests\payment\Unit\Controller\EditPaymentTest200
LeafDrupal\Tests\payment\Unit\Controller\EnablePaymentMethodConfigurationTest100
LeafDrupal\Tests\payment\Unit\Controller\ListPaymentMethodsTest200
LeafDrupal\Tests\payment\Unit\Controller\ListPaymentStatusesTest200
LeafDrupal\Tests\payment\Unit\Controller\ListPaymentTypesTest200
LeafDrupal\Tests\payment\Unit\Controller\SelectPaymentMethodConfigurationTest300
LeafDrupal\Tests\payment\Unit\Controller\ViewPaymentTest200
LeafDrupal\Tests\payment\Unit\DatabaseQueueTest400
LeafDrupal\Tests\payment\Unit\Element\PaymentLineItemsDisplayTest400
LeafDrupal\Tests\payment\Unit\Element\PaymentStatusesDisplayTest400
LeafDrupal\Tests\payment\Unit\Entity\PaymentMethodConfigurationTest1200
LeafDrupal\Tests\payment\Unit\Entity\PaymentMethodConfiguration\PaymentMethodConfigurationAccessControlHandlerTest1600
LeafDrupal\Tests\payment\Unit\Entity\PaymentStatusTest600
LeafDrupal\Tests\payment\Unit\Entity\PaymentStatus\PaymentStatusListBuilderTest100
LeafDrupal\Tests\payment\Unit\Entity\Payment\PaymentAccessControlHandlerTest2100
LeafDrupal\Tests\payment\Unit\Entity\Payment\PaymentCaptureFormTest500
LeafDrupal\Tests\payment\Unit\Entity\Payment\PaymentRefundFormTest500
LeafDrupal\Tests\payment\Unit\Entity\Payment\PaymentStatusFormTest500
LeafDrupal\Tests\payment\Unit\Entity\Payment\PaymentStorageSchemaTest200
LeafDrupal\Tests\payment\Unit\Entity\Payment\PaymentStorageTest100
LeafDrupal\Tests\payment\Unit\EventDispatcherTest800
LeafDrupal\Tests\payment\Unit\Event\PaymentEventsTest100
LeafDrupal\Tests\payment\Unit\Event\PaymentExecuteAccessTest700
LeafDrupal\Tests\payment\Unit\Event\PaymentPreCaptureTest200
LeafDrupal\Tests\payment\Unit\Event\PaymentPreExecuteTest200
LeafDrupal\Tests\payment\Unit\Event\PaymentPreRefundTest200
LeafDrupal\Tests\payment\Unit\Event\PaymentQueuePaymentIdsAlterTest500
LeafDrupal\Tests\payment\Unit\Event\PaymentStatusSetTest300
LeafDrupal\Tests\payment\Unit\Event\PaymentTypePreResumeContextTest200
LeafDrupal\Tests\payment\Unit\Hook\EntityBundleInfoTest200
LeafDrupal\Tests\payment\Unit\Hook\EntityCrudTest200
LeafDrupal\Tests\payment\Unit\LineItemCollectionTest700
LeafDrupal\Tests\payment\Unit\PaymentExecutionResultTest200
LeafDrupal\Tests\payment\Unit\PaymentTest500
LeafDrupal\Tests\payment\Unit\PermissionsTest200
LeafDrupal\Tests\payment\Unit\Plugin\Action\SetStatusTest1000
LeafDrupal\Tests\payment\Unit\Plugin\Action\UnsetLineItemTest900
LeafDrupal\Tests\payment\Unit\Plugin\Payment\LineItem\BasicTest700
LeafDrupal\Tests\payment\Unit\Plugin\Payment\LineItem\PaymentLineItemBaseTest1000
LeafDrupal\Tests\payment\Unit\Plugin\Payment\LineItem\PaymentLineItemManagerTest200
LeafDrupal\Tests\payment\Unit\Plugin\Payment\MethodConfiguration\BasicTest1100
LeafDrupal\Tests\payment\Unit\Plugin\Payment\MethodConfiguration\PaymentMethodConfigurationBaseTest1100
LeafDrupal\Tests\payment\Unit\Plugin\Payment\MethodConfiguration\PaymentMethodConfigurationManagerTest200
LeafDrupal\Tests\payment\Unit\Plugin\Payment\Method\BasicDeriverTest200
LeafDrupal\Tests\payment\Unit\Plugin\Payment\Method\BasicOperationsProviderTest100
LeafDrupal\Tests\payment\Unit\Plugin\Payment\Method\BasicTest2000
LeafDrupal\Tests\payment\Unit\Plugin\Payment\Method\PaymentExecutionPaymentMethodManagerTest400
LeafDrupal\Tests\payment\Unit\Plugin\Payment\Method\PaymentMethodBaseTest3800
LeafDrupal\Tests\payment\Unit\Plugin\Payment\Method\PaymentMethodConfigurationOperationsProviderTest200
LeafDrupal\Tests\payment\Unit\Plugin\Payment\Method\PaymentMethodManagerTest300
LeafDrupal\Tests\payment\Unit\Plugin\Payment\Method\PaymentMethodOperationsProviderTest200
LeafDrupal\Tests\payment\Unit\Plugin\Payment\Method\SupportedCurrencyTest400
LeafDrupal\Tests\payment\Unit\Plugin\Payment\Method\UnavailableTest1200
LeafDrupal\Tests\payment\Unit\Plugin\Payment\Status\ConfigDeriverTest200
LeafDrupal\Tests\payment\Unit\Plugin\Payment\Status\ConfigOperationsProviderTest200
LeafDrupal\Tests\payment\Unit\Plugin\Payment\Status\PaymentStatusManagerTest800
LeafDrupal\Tests\payment\Unit\Plugin\Payment\Status\PaymentStatusOperationsProviderTest200
LeafDrupal\Tests\payment\Unit\Plugin\Payment\Type\PaymentTypeBaseTest600
LeafDrupal\Tests\payment\Unit\Plugin\Payment\Type\PaymentTypeManagerTest300
LeafDrupal\Tests\payment\Unit\Plugin\Payment\Type\PaymentTypeOperationsProviderTest200
LeafDrupal\Tests\payment\Unit\Plugin\Payment\Type\UnavailableTest400
LeafDrupal\Tests\payment\Unit\Plugin\views\argument_validator\ViewPaymentsByOwnerTest1100
LeafDrupal\Tests\payment\Unit\Plugin\views\field\PaymentAmountTest100
LeafDrupal\Tests\payment\Unit\Plugin\views\field\PaymentLineItemLabelTest200
LeafDrupal\Tests\payment\Unit\Plugin\views\field\PaymentMethodLabelTest200
LeafDrupal\Tests\payment\Unit\Plugin\views\field\PaymentStatusLabelTest200
LeafDrupal\Tests\payment\Unit\Plugin\views\field\PaymentTypeLabelTest200
LeafDrupal\Tests\payment\Unit\Plugin\views\filter\PaymentMethodTest200
LeafDrupal\Tests\payment\Unit\Plugin\views\filter\PaymentStatusTest200
LeafDrupal\Tests\payment\Unit\Response\ResponseTest400
LeafDrupal\Tests\payment_form\Unit\Entity\Payment\PaymentFormTest600
LeafDrupal\Tests\payment_form\Unit\Hook\EntityExtraFieldInfoTest200
LeafDrupal\Tests\payment_form\Unit\Plugin\Field\FieldFormatter\PaymentFormTest200
LeafDrupal\Tests\payment_form\Unit\Plugin\Field\FieldType\PaymentFormTest200
LeafDrupal\Tests\payment_form\Unit\Plugin\Field\FieldWidget\PaymentFormTest500
LeafDrupal\Tests\payment_form\Unit\Plugin\Payment\Type\PaymentFormTest1000
LeafDrupal\Tests\payment_reference\Unit\Controller\ResumeContextTest500
LeafDrupal\Tests\payment_reference\Unit\Element\PaymentReferenceTest200
LeafDrupal\Tests\payment_reference\Unit\Hook\EntityExtraFieldInfoTest200
LeafDrupal\Tests\payment_reference\Unit\PaymentFactoryTest200
LeafDrupal\Tests\payment_reference\Unit\PaymentReferenceTest200
LeafDrupal\Tests\payment_reference\Unit\Plugin\Field\FieldType\PaymentReferenceItemListTest300
LeafDrupal\Tests\payment_reference\Unit\Plugin\Field\FieldType\PaymentReferenceTest400
LeafDrupal\Tests\payment_reference\Unit\Plugin\Field\FieldWidget\PaymentReferenceTest300
LeafDrupal\Tests\payment_reference\Unit\Plugin\Payment\Type\PaymentReferenceTest1100