t_44.patch

Test status
StatusResult
Last receivedMon, 08/17/2015 - 20:20:01
Last requestedMon, 08/17/2015 - 20:26:57
Last testedMon, 08/17/2015 - 20:33:22
Test count1
Environment status
PHP 5.5 MySQLfail
File information
Filet_44.patch
BranchUbercart - 8.x-4.x
LinkIssue Link
SummaryFAILED: [[SimpleTest]]: [PHP 5.5 MySQL] 3,220 pass(es), 0 fail(s), and 11 exception(s).
Details

PHP 5.5 MySQL

  1. Setup environment
  2. Detect an invalid patch URL
  3. Detect invalid repository information
  4. Detect invalid patch format
  5. Detect a non-applicable patch
  6. Detect invalid PHP syntax
  7. Detect a Drupal installation failure
  8. Detect a test run failure
  9. Detect a failing test
    Review the test failures below then if necessary run them locally until the problem has been fixed.
  10. Complete test suite with all tests passing
3,220 pass(es), 0 fail(s), and 11 exception(s)

Non-pass

Test namePassFailException
ExpandDrupal\uc_attribute\Tests\AttributeTest42101
MessageGroupFilenameLineFunctionStatus
InvalidArgumentException: Placeholders must have a trailing [] if they are to be expanded with an array of values. in Drupal\Core\Database\Connection->expandArguments() (line 674 of /var/lib/drupaltestbot/sites/default/files/checkout/core/lib/Drupal/Core/Database/Connection.php). Drupal\Core\Database\Connection->expandArguments('INSERT INTO {simpletest} (test_id, test_class, status, message, message_group, function, line, file) VALUES (?, ?, ?, ?, ?, ?, ?, ?)', Array) Drupal\Core\Database\Connection->query('INSERT INTO {simpletest} (test_id, test_class, status, message, message_group, function, line, file) VALUES (?, ?, ?, ?, ?, ?, ?, ?)', Array, Array) Drupal\Core\Database\Query\Insert->execute() Drupal\Core\Database\Driver\sqlite\Insert->execute() Drupal\simpletest\TestBase->storeAssertion(Array) Drupal\simpletest\TestBase->assert(1, 'Order %order_id has been created', Array) Drupal\simpletest\TestBase->pass('Order %order_id has been created', Array) Drupal\uc_store\Tests\UbercartTestBase->checkout() Drupal\uc_attribute\Tests\AttributeTest->testProductAttribute() Drupal\simpletest\TestBase->run(Array) simpletest_script_run_one_test('5', 'Drupal\uc_attribute\Tests\AttributeTest') Uncaught exceptionConnection.php674Drupal\Core\Database\Connection->expandArguments()
ExpandDrupal\uc_cart\Tests\CartCheckoutTest44106
MessageGroupFilenameLineFunctionStatus
InvalidArgumentException: Placeholders must have a trailing [] if they are to be expanded with an array of values. in Drupal\Core\Database\Connection->expandArguments() (line 674 of /var/lib/drupaltestbot/sites/default/files/checkout/core/lib/Drupal/Core/Database/Connection.php). Drupal\Core\Database\Connection->expandArguments('INSERT INTO {simpletest} (test_id, test_class, status, message, message_group, function, line, file) VALUES (?, ?, ?, ?, ?, ?, ?, ?)', Array) Drupal\Core\Database\Connection->query('INSERT INTO {simpletest} (test_id, test_class, status, message, message_group, function, line, file) VALUES (?, ?, ?, ?, ?, ?, ?, ?)', Array, Array) Drupal\Core\Database\Query\Insert->execute() Drupal\Core\Database\Driver\sqlite\Insert->execute() Drupal\simpletest\TestBase->storeAssertion(Array) Drupal\simpletest\TestBase->assert(1, 'Order %order_id has been created', Array) Drupal\simpletest\TestBase->pass('Order %order_id has been created', Array) Drupal\uc_store\Tests\UbercartTestBase->checkout() Drupal\uc_cart\Tests\CartCheckoutTest->testAuthenticatedCheckout() Drupal\simpletest\TestBase->run(Array) simpletest_script_run_one_test('8', 'Drupal\uc_cart\Tests\CartCheckoutTest') Uncaught exceptionConnection.php674Drupal\Core\Database\Connection->expandArguments()
InvalidArgumentException: Placeholders must have a trailing [] if they are to be expanded with an array of values. in Drupal\Core\Database\Connection->expandArguments() (line 674 of /var/lib/drupaltestbot/sites/default/files/checkout/core/lib/Drupal/Core/Database/Connection.php). Drupal\Core\Database\Connection->expandArguments('INSERT INTO {simpletest} (test_id, test_class, status, message, message_group, function, line, file) VALUES (?, ?, ?, ?, ?, ?, ?, ?)', Array) Drupal\Core\Database\Connection->query('INSERT INTO {simpletest} (test_id, test_class, status, message, message_group, function, line, file) VALUES (?, ?, ?, ?, ?, ?, ?, ?)', Array, Array) Drupal\Core\Database\Query\Insert->execute() Drupal\Core\Database\Driver\sqlite\Insert->execute() Drupal\simpletest\TestBase->storeAssertion(Array) Drupal\simpletest\TestBase->assert(1, 'Order %order_id has been created', Array) Drupal\simpletest\TestBase->pass('Order %order_id has been created', Array) Drupal\uc_store\Tests\UbercartTestBase->checkout() Drupal\uc_cart\Tests\CartCheckoutTest->testAnonymousCheckoutAccountGenerated() Drupal\simpletest\TestBase->run(Array) simpletest_script_run_one_test('8', 'Drupal\uc_cart\Tests\CartCheckoutTest') Uncaught exceptionConnection.php674Drupal\Core\Database\Connection->expandArguments()
InvalidArgumentException: Placeholders must have a trailing [] if they are to be expanded with an array of values. in Drupal\Core\Database\Connection->expandArguments() (line 674 of /var/lib/drupaltestbot/sites/default/files/checkout/core/lib/Drupal/Core/Database/Connection.php). Drupal\Core\Database\Connection->expandArguments('INSERT INTO {simpletest} (test_id, test_class, status, message, message_group, function, line, file) VALUES (?, ?, ?, ?, ?, ?, ?, ?)', Array) Drupal\Core\Database\Connection->query('INSERT INTO {simpletest} (test_id, test_class, status, message, message_group, function, line, file) VALUES (?, ?, ?, ?, ?, ?, ?, ?)', Array, Array) Drupal\Core\Database\Query\Insert->execute() Drupal\Core\Database\Driver\sqlite\Insert->execute() Drupal\simpletest\TestBase->storeAssertion(Array) Drupal\simpletest\TestBase->assert(1, 'Order %order_id has been created', Array) Drupal\simpletest\TestBase->pass('Order %order_id has been created', Array) Drupal\uc_store\Tests\UbercartTestBase->checkout(Array) Drupal\uc_cart\Tests\CartCheckoutTest->testAnonymousCheckoutAccountProvided() Drupal\simpletest\TestBase->run(Array) simpletest_script_run_one_test('8', 'Drupal\uc_cart\Tests\CartCheckoutTest') Uncaught exceptionConnection.php674Drupal\Core\Database\Connection->expandArguments()
InvalidArgumentException: Placeholders must have a trailing [] if they are to be expanded with an array of values. in Drupal\Core\Database\Connection->expandArguments() (line 674 of /var/lib/drupaltestbot/sites/default/files/checkout/core/lib/Drupal/Core/Database/Connection.php). Drupal\Core\Database\Connection->expandArguments('INSERT INTO {simpletest} (test_id, test_class, status, message, message_group, function, line, file) VALUES (?, ?, ?, ?, ?, ?, ?, ?)', Array) Drupal\Core\Database\Connection->query('INSERT INTO {simpletest} (test_id, test_class, status, message, message_group, function, line, file) VALUES (?, ?, ?, ?, ?, ?, ?, ?)', Array, Array) Drupal\Core\Database\Query\Insert->execute() Drupal\Core\Database\Driver\sqlite\Insert->execute() Drupal\simpletest\TestBase->storeAssertion(Array) Drupal\simpletest\TestBase->assert(1, 'Order %order_id has been created', Array) Drupal\simpletest\TestBase->pass('Order %order_id has been created', Array) Drupal\uc_store\Tests\UbercartTestBase->checkout(Array) Drupal\uc_cart\Tests\CartCheckoutTest->testAnonymousCheckoutAccountExists() Drupal\simpletest\TestBase->run(Array) simpletest_script_run_one_test('8', 'Drupal\uc_cart\Tests\CartCheckoutTest') Uncaught exceptionConnection.php674Drupal\Core\Database\Connection->expandArguments()
InvalidArgumentException: Placeholders must have a trailing [] if they are to be expanded with an array of values. in Drupal\Core\Database\Connection->expandArguments() (line 674 of /var/lib/drupaltestbot/sites/default/files/checkout/core/lib/Drupal/Core/Database/Connection.php). Drupal\Core\Database\Connection->expandArguments('INSERT INTO {simpletest} (test_id, test_class, status, message, message_group, function, line, file) VALUES (?, ?, ?, ?, ?, ?, ?, ?)', Array) Drupal\Core\Database\Connection->query('INSERT INTO {simpletest} (test_id, test_class, status, message, message_group, function, line, file) VALUES (?, ?, ?, ?, ?, ?, ?, ?)', Array, Array) Drupal\Core\Database\Query\Insert->execute() Drupal\Core\Database\Driver\sqlite\Insert->execute() Drupal\simpletest\TestBase->storeAssertion(Array) Drupal\simpletest\TestBase->assert(1, 'Order %order_id has been created', Array) Drupal\simpletest\TestBase->pass('Order %order_id has been created', Array) Drupal\uc_store\Tests\UbercartTestBase->checkout() Drupal\uc_cart\Tests\CartCheckoutTest->testCheckoutBlockedUser() Drupal\simpletest\TestBase->run(Array) simpletest_script_run_one_test('8', 'Drupal\uc_cart\Tests\CartCheckoutTest') Uncaught exceptionConnection.php674Drupal\Core\Database\Connection->expandArguments()
InvalidArgumentException: Placeholders must have a trailing [] if they are to be expanded with an array of values. in Drupal\Core\Database\Connection->expandArguments() (line 674 of /var/lib/drupaltestbot/sites/default/files/checkout/core/lib/Drupal/Core/Database/Connection.php). Drupal\Core\Database\Connection->expandArguments('INSERT INTO {simpletest} (test_id, test_class, status, message, message_group, function, line, file) VALUES (?, ?, ?, ?, ?, ?, ?, ?)', Array) Drupal\Core\Database\Connection->query('INSERT INTO {simpletest} (test_id, test_class, status, message, message_group, function, line, file) VALUES (?, ?, ?, ?, ?, ?, ?, ?)', Array, Array) Drupal\Core\Database\Query\Insert->execute() Drupal\Core\Database\Driver\sqlite\Insert->execute() Drupal\simpletest\TestBase->storeAssertion(Array) Drupal\simpletest\TestBase->assert(1, 'Order %order_id has been created', Array) Drupal\simpletest\TestBase->pass('Order %order_id has been created', Array) Drupal\uc_store\Tests\UbercartTestBase->checkout() Drupal\uc_cart\Tests\CartCheckoutTest->testCheckoutLogin() Drupal\simpletest\TestBase->run(Array) simpletest_script_run_one_test('8', 'Drupal\uc_cart\Tests\CartCheckoutTest') Uncaught exceptionConnection.php674Drupal\Core\Database\Connection->expandArguments()
ExpandDrupal\uc_credit\Tests\CreditCardTest31201
MessageGroupFilenameLineFunctionStatus
InvalidArgumentException: Placeholders must have a trailing [] if they are to be expanded with an array of values. in Drupal\Core\Database\Connection->expandArguments() (line 674 of /var/lib/drupaltestbot/sites/default/files/checkout/core/lib/Drupal/Core/Database/Connection.php). Drupal\Core\Database\Connection->expandArguments('INSERT INTO {simpletest} (test_id, test_class, status, message, message_group, function, line, file) VALUES (?, ?, ?, ?, ?, ?, ?, ?)', Array) Drupal\Core\Database\Connection->query('INSERT INTO {simpletest} (test_id, test_class, status, message, message_group, function, line, file) VALUES (?, ?, ?, ?, ?, ?, ?, ?)', Array, Array) Drupal\Core\Database\Query\Insert->execute() Drupal\Core\Database\Driver\sqlite\Insert->execute() Drupal\simpletest\TestBase->storeAssertion(Array) Drupal\simpletest\TestBase->assert(1, 'Order %order_id has been created', Array) Drupal\simpletest\TestBase->pass('Order %order_id has been created', Array) Drupal\uc_store\Tests\UbercartTestBase->checkout(Array) Drupal\uc_credit\Tests\CreditCardTest->testCheckout() Drupal\simpletest\TestBase->run(Array) simpletest_script_run_one_test('1', 'Drupal\uc_credit\Tests\CreditCardTest') Uncaught exceptionConnection.php674Drupal\Core\Database\Connection->expandArguments()
ExpandDrupal\uc_role\Tests\RoleTest3301
MessageGroupFilenameLineFunctionStatus
InvalidArgumentException: Placeholders must have a trailing [] if they are to be expanded with an array of values. in Drupal\Core\Database\Connection->expandArguments() (line 674 of /var/lib/drupaltestbot/sites/default/files/checkout/core/lib/Drupal/Core/Database/Connection.php). Drupal\Core\Database\Connection->expandArguments('INSERT INTO {simpletest} (test_id, test_class, status, message, message_group, function, line, file) VALUES (?, ?, ?, ?, ?, ?, ?, ?)', Array) Drupal\Core\Database\Connection->query('INSERT INTO {simpletest} (test_id, test_class, status, message, message_group, function, line, file) VALUES (?, ?, ?, ?, ?, ?, ?, ?)', Array, Array) Drupal\Core\Database\Query\Insert->execute() Drupal\Core\Database\Driver\sqlite\Insert->execute() Drupal\simpletest\TestBase->storeAssertion(Array) Drupal\simpletest\TestBase->assert(1, 'Order %order_id has been created', Array) Drupal\simpletest\TestBase->pass('Order %order_id has been created', Array) Drupal\uc_store\Tests\UbercartTestBase->checkout() Drupal\uc_role\Tests\RoleTest->testRolePurchaseCheckout() Drupal\simpletest\TestBase->run(Array) simpletest_script_run_one_test('21', 'Drupal\uc_role\Tests\RoleTest') Uncaught exceptionConnection.php674Drupal\Core\Database\Connection->expandArguments()
ExpandDrupal\uc_stock\Tests\StockTest9202
MessageGroupFilenameLineFunctionStatus
InvalidArgumentException: Placeholders must have a trailing [] if they are to be expanded with an array of values. in Drupal\Core\Database\Connection->expandArguments() (line 674 of /var/lib/drupaltestbot/sites/default/files/checkout/core/lib/Drupal/Core/Database/Connection.php). Drupal\Core\Database\Connection->expandArguments('INSERT INTO {simpletest} (test_id, test_class, status, message, message_group, function, line, file) VALUES (?, ?, ?, ?, ?, ?, ?, ?)', Array) Drupal\Core\Database\Connection->query('INSERT INTO {simpletest} (test_id, test_class, status, message, message_group, function, line, file) VALUES (?, ?, ?, ?, ?, ?, ?, ?)', Array, Array) Drupal\Core\Database\Query\Insert->execute() Drupal\Core\Database\Driver\sqlite\Insert->execute() Drupal\simpletest\TestBase->storeAssertion(Array) Drupal\simpletest\TestBase->assert(1, 'Order %order_id has been created', Array) Drupal\simpletest\TestBase->pass('Order %order_id has been created', Array) Drupal\uc_store\Tests\UbercartTestBase->checkout() Drupal\uc_stock\Tests\StockTest->testStockDecrement() Drupal\simpletest\TestBase->run(Array) simpletest_script_run_one_test('15', 'Drupal\uc_stock\Tests\StockTest') Uncaught exceptionConnection.php674Drupal\Core\Database\Connection->expandArguments()
InvalidArgumentException: Placeholders must have a trailing [] if they are to be expanded with an array of values. in Drupal\Core\Database\Connection->expandArguments() (line 674 of /var/lib/drupaltestbot/sites/default/files/checkout/core/lib/Drupal/Core/Database/Connection.php). Drupal\Core\Database\Connection->expandArguments('INSERT INTO {simpletest} (test_id, test_class, status, message, message_group, function, line, file) VALUES (?, ?, ?, ?, ?, ?, ?, ?)', Array) Drupal\Core\Database\Connection->query('INSERT INTO {simpletest} (test_id, test_class, status, message, message_group, function, line, file) VALUES (?, ?, ?, ?, ?, ?, ?, ?)', Array, Array) Drupal\Core\Database\Query\Insert->execute() Drupal\Core\Database\Driver\sqlite\Insert->execute() Drupal\simpletest\TestBase->storeAssertion(Array) Drupal\simpletest\TestBase->assert(1, 'Order %order_id has been created', Array) Drupal\simpletest\TestBase->pass('Order %order_id has been created', Array) Drupal\uc_store\Tests\UbercartTestBase->checkout() Drupal\uc_stock\Tests\StockTest->testStockThresholdMail() Drupal\simpletest\TestBase->run(Array) simpletest_script_run_one_test('15', 'Drupal\uc_stock\Tests\StockTest') Uncaught exceptionConnection.php674Drupal\Core\Database\Connection->expandArguments()

All

Test namePassFailException
ExpandDrupal\uc_attribute\Tests\AttributeTest42101
MessageGroupFilenameLineFunctionStatus
InvalidArgumentException: Placeholders must have a trailing [] if they are to be expanded with an array of values. in Drupal\Core\Database\Connection->expandArguments() (line 674 of /var/lib/drupaltestbot/sites/default/files/checkout/core/lib/Drupal/Core/Database/Connection.php). Drupal\Core\Database\Connection->expandArguments('INSERT INTO {simpletest} (test_id, test_class, status, message, message_group, function, line, file) VALUES (?, ?, ?, ?, ?, ?, ?, ?)', Array) Drupal\Core\Database\Connection->query('INSERT INTO {simpletest} (test_id, test_class, status, message, message_group, function, line, file) VALUES (?, ?, ?, ?, ?, ?, ?, ?)', Array, Array) Drupal\Core\Database\Query\Insert->execute() Drupal\Core\Database\Driver\sqlite\Insert->execute() Drupal\simpletest\TestBase->storeAssertion(Array) Drupal\simpletest\TestBase->assert(1, 'Order %order_id has been created', Array) Drupal\simpletest\TestBase->pass('Order %order_id has been created', Array) Drupal\uc_store\Tests\UbercartTestBase->checkout() Drupal\uc_attribute\Tests\AttributeTest->testProductAttribute() Drupal\simpletest\TestBase->run(Array) simpletest_script_run_one_test('5', 'Drupal\uc_attribute\Tests\AttributeTest') Uncaught exceptionConnection.php674Drupal\Core\Database\Connection->expandArguments()
LeafDrupal\uc_cart\Tests\CartBlockTest6500
ExpandDrupal\uc_cart\Tests\CartCheckoutTest44106
MessageGroupFilenameLineFunctionStatus
InvalidArgumentException: Placeholders must have a trailing [] if they are to be expanded with an array of values. in Drupal\Core\Database\Connection->expandArguments() (line 674 of /var/lib/drupaltestbot/sites/default/files/checkout/core/lib/Drupal/Core/Database/Connection.php). Drupal\Core\Database\Connection->expandArguments('INSERT INTO {simpletest} (test_id, test_class, status, message, message_group, function, line, file) VALUES (?, ?, ?, ?, ?, ?, ?, ?)', Array) Drupal\Core\Database\Connection->query('INSERT INTO {simpletest} (test_id, test_class, status, message, message_group, function, line, file) VALUES (?, ?, ?, ?, ?, ?, ?, ?)', Array, Array) Drupal\Core\Database\Query\Insert->execute() Drupal\Core\Database\Driver\sqlite\Insert->execute() Drupal\simpletest\TestBase->storeAssertion(Array) Drupal\simpletest\TestBase->assert(1, 'Order %order_id has been created', Array) Drupal\simpletest\TestBase->pass('Order %order_id has been created', Array) Drupal\uc_store\Tests\UbercartTestBase->checkout() Drupal\uc_cart\Tests\CartCheckoutTest->testAuthenticatedCheckout() Drupal\simpletest\TestBase->run(Array) simpletest_script_run_one_test('8', 'Drupal\uc_cart\Tests\CartCheckoutTest') Uncaught exceptionConnection.php674Drupal\Core\Database\Connection->expandArguments()
InvalidArgumentException: Placeholders must have a trailing [] if they are to be expanded with an array of values. in Drupal\Core\Database\Connection->expandArguments() (line 674 of /var/lib/drupaltestbot/sites/default/files/checkout/core/lib/Drupal/Core/Database/Connection.php). Drupal\Core\Database\Connection->expandArguments('INSERT INTO {simpletest} (test_id, test_class, status, message, message_group, function, line, file) VALUES (?, ?, ?, ?, ?, ?, ?, ?)', Array) Drupal\Core\Database\Connection->query('INSERT INTO {simpletest} (test_id, test_class, status, message, message_group, function, line, file) VALUES (?, ?, ?, ?, ?, ?, ?, ?)', Array, Array) Drupal\Core\Database\Query\Insert->execute() Drupal\Core\Database\Driver\sqlite\Insert->execute() Drupal\simpletest\TestBase->storeAssertion(Array) Drupal\simpletest\TestBase->assert(1, 'Order %order_id has been created', Array) Drupal\simpletest\TestBase->pass('Order %order_id has been created', Array) Drupal\uc_store\Tests\UbercartTestBase->checkout() Drupal\uc_cart\Tests\CartCheckoutTest->testAnonymousCheckoutAccountGenerated() Drupal\simpletest\TestBase->run(Array) simpletest_script_run_one_test('8', 'Drupal\uc_cart\Tests\CartCheckoutTest') Uncaught exceptionConnection.php674Drupal\Core\Database\Connection->expandArguments()
InvalidArgumentException: Placeholders must have a trailing [] if they are to be expanded with an array of values. in Drupal\Core\Database\Connection->expandArguments() (line 674 of /var/lib/drupaltestbot/sites/default/files/checkout/core/lib/Drupal/Core/Database/Connection.php). Drupal\Core\Database\Connection->expandArguments('INSERT INTO {simpletest} (test_id, test_class, status, message, message_group, function, line, file) VALUES (?, ?, ?, ?, ?, ?, ?, ?)', Array) Drupal\Core\Database\Connection->query('INSERT INTO {simpletest} (test_id, test_class, status, message, message_group, function, line, file) VALUES (?, ?, ?, ?, ?, ?, ?, ?)', Array, Array) Drupal\Core\Database\Query\Insert->execute() Drupal\Core\Database\Driver\sqlite\Insert->execute() Drupal\simpletest\TestBase->storeAssertion(Array) Drupal\simpletest\TestBase->assert(1, 'Order %order_id has been created', Array) Drupal\simpletest\TestBase->pass('Order %order_id has been created', Array) Drupal\uc_store\Tests\UbercartTestBase->checkout(Array) Drupal\uc_cart\Tests\CartCheckoutTest->testAnonymousCheckoutAccountProvided() Drupal\simpletest\TestBase->run(Array) simpletest_script_run_one_test('8', 'Drupal\uc_cart\Tests\CartCheckoutTest') Uncaught exceptionConnection.php674Drupal\Core\Database\Connection->expandArguments()
InvalidArgumentException: Placeholders must have a trailing [] if they are to be expanded with an array of values. in Drupal\Core\Database\Connection->expandArguments() (line 674 of /var/lib/drupaltestbot/sites/default/files/checkout/core/lib/Drupal/Core/Database/Connection.php). Drupal\Core\Database\Connection->expandArguments('INSERT INTO {simpletest} (test_id, test_class, status, message, message_group, function, line, file) VALUES (?, ?, ?, ?, ?, ?, ?, ?)', Array) Drupal\Core\Database\Connection->query('INSERT INTO {simpletest} (test_id, test_class, status, message, message_group, function, line, file) VALUES (?, ?, ?, ?, ?, ?, ?, ?)', Array, Array) Drupal\Core\Database\Query\Insert->execute() Drupal\Core\Database\Driver\sqlite\Insert->execute() Drupal\simpletest\TestBase->storeAssertion(Array) Drupal\simpletest\TestBase->assert(1, 'Order %order_id has been created', Array) Drupal\simpletest\TestBase->pass('Order %order_id has been created', Array) Drupal\uc_store\Tests\UbercartTestBase->checkout(Array) Drupal\uc_cart\Tests\CartCheckoutTest->testAnonymousCheckoutAccountExists() Drupal\simpletest\TestBase->run(Array) simpletest_script_run_one_test('8', 'Drupal\uc_cart\Tests\CartCheckoutTest') Uncaught exceptionConnection.php674Drupal\Core\Database\Connection->expandArguments()
InvalidArgumentException: Placeholders must have a trailing [] if they are to be expanded with an array of values. in Drupal\Core\Database\Connection->expandArguments() (line 674 of /var/lib/drupaltestbot/sites/default/files/checkout/core/lib/Drupal/Core/Database/Connection.php). Drupal\Core\Database\Connection->expandArguments('INSERT INTO {simpletest} (test_id, test_class, status, message, message_group, function, line, file) VALUES (?, ?, ?, ?, ?, ?, ?, ?)', Array) Drupal\Core\Database\Connection->query('INSERT INTO {simpletest} (test_id, test_class, status, message, message_group, function, line, file) VALUES (?, ?, ?, ?, ?, ?, ?, ?)', Array, Array) Drupal\Core\Database\Query\Insert->execute() Drupal\Core\Database\Driver\sqlite\Insert->execute() Drupal\simpletest\TestBase->storeAssertion(Array) Drupal\simpletest\TestBase->assert(1, 'Order %order_id has been created', Array) Drupal\simpletest\TestBase->pass('Order %order_id has been created', Array) Drupal\uc_store\Tests\UbercartTestBase->checkout() Drupal\uc_cart\Tests\CartCheckoutTest->testCheckoutBlockedUser() Drupal\simpletest\TestBase->run(Array) simpletest_script_run_one_test('8', 'Drupal\uc_cart\Tests\CartCheckoutTest') Uncaught exceptionConnection.php674Drupal\Core\Database\Connection->expandArguments()
InvalidArgumentException: Placeholders must have a trailing [] if they are to be expanded with an array of values. in Drupal\Core\Database\Connection->expandArguments() (line 674 of /var/lib/drupaltestbot/sites/default/files/checkout/core/lib/Drupal/Core/Database/Connection.php). Drupal\Core\Database\Connection->expandArguments('INSERT INTO {simpletest} (test_id, test_class, status, message, message_group, function, line, file) VALUES (?, ?, ?, ?, ?, ?, ?, ?)', Array) Drupal\Core\Database\Connection->query('INSERT INTO {simpletest} (test_id, test_class, status, message, message_group, function, line, file) VALUES (?, ?, ?, ?, ?, ?, ?, ?)', Array, Array) Drupal\Core\Database\Query\Insert->execute() Drupal\Core\Database\Driver\sqlite\Insert->execute() Drupal\simpletest\TestBase->storeAssertion(Array) Drupal\simpletest\TestBase->assert(1, 'Order %order_id has been created', Array) Drupal\simpletest\TestBase->pass('Order %order_id has been created', Array) Drupal\uc_store\Tests\UbercartTestBase->checkout() Drupal\uc_cart\Tests\CartCheckoutTest->testCheckoutLogin() Drupal\simpletest\TestBase->run(Array) simpletest_script_run_one_test('8', 'Drupal\uc_cart\Tests\CartCheckoutTest') Uncaught exceptionConnection.php674Drupal\Core\Database\Connection->expandArguments()
LeafDrupal\uc_cart\Tests\CartSettingsTest15000
LeafDrupal\uc_cart\Tests\CheckoutSettingsTest5200
LeafDrupal\uc_cart_links\Tests\CartLinksTest38800
LeafDrupal\uc_catalog\Tests\CatalogTest8500
ExpandDrupal\uc_country\Tests\CountryManagerTest500
MessageGroupFilenameLineFunctionStatus
Array ( ) DebugCountryManagerTest.php44Drupal\uc_country\Tests\CountryManagerTest->testServiceOverride()
Count = 0DebugCountryManagerTest.php45Drupal\uc_country\Tests\CountryManagerTest->testServiceOverride()
LeafDrupal\uc_country\Tests\CountryTest9100
ExpandDrupal\uc_credit\Tests\CreditCardTest31201
MessageGroupFilenameLineFunctionStatus
InvalidArgumentException: Placeholders must have a trailing [] if they are to be expanded with an array of values. in Drupal\Core\Database\Connection->expandArguments() (line 674 of /var/lib/drupaltestbot/sites/default/files/checkout/core/lib/Drupal/Core/Database/Connection.php). Drupal\Core\Database\Connection->expandArguments('INSERT INTO {simpletest} (test_id, test_class, status, message, message_group, function, line, file) VALUES (?, ?, ?, ?, ?, ?, ?, ?)', Array) Drupal\Core\Database\Connection->query('INSERT INTO {simpletest} (test_id, test_class, status, message, message_group, function, line, file) VALUES (?, ?, ?, ?, ?, ?, ?, ?)', Array, Array) Drupal\Core\Database\Query\Insert->execute() Drupal\Core\Database\Driver\sqlite\Insert->execute() Drupal\simpletest\TestBase->storeAssertion(Array) Drupal\simpletest\TestBase->assert(1, 'Order %order_id has been created', Array) Drupal\simpletest\TestBase->pass('Order %order_id has been created', Array) Drupal\uc_store\Tests\UbercartTestBase->checkout(Array) Drupal\uc_credit\Tests\CreditCardTest->testCheckout() Drupal\simpletest\TestBase->run(Array) simpletest_script_run_one_test('1', 'Drupal\uc_credit\Tests\CreditCardTest') Uncaught exceptionConnection.php674Drupal\Core\Database\Connection->expandArguments()
LeafDrupal\uc_order\Tests\OrderTest22400
LeafDrupal\uc_payment\Tests\PaymentPaneTest11400
LeafDrupal\uc_payment_pack\Tests\PaymentPackTest14900
LeafDrupal\uc_product\Tests\ProductTest15300
LeafDrupal\uc_product_kit\Tests\ProductKitTest15200
LeafDrupal\uc_quote\Tests\QuoteTest7600
LeafDrupal\uc_role\Tests\RoleCheckoutTest2700
ExpandDrupal\uc_role\Tests\RoleTest3301
MessageGroupFilenameLineFunctionStatus
InvalidArgumentException: Placeholders must have a trailing [] if they are to be expanded with an array of values. in Drupal\Core\Database\Connection->expandArguments() (line 674 of /var/lib/drupaltestbot/sites/default/files/checkout/core/lib/Drupal/Core/Database/Connection.php). Drupal\Core\Database\Connection->expandArguments('INSERT INTO {simpletest} (test_id, test_class, status, message, message_group, function, line, file) VALUES (?, ?, ?, ?, ?, ?, ?, ?)', Array) Drupal\Core\Database\Connection->query('INSERT INTO {simpletest} (test_id, test_class, status, message, message_group, function, line, file) VALUES (?, ?, ?, ?, ?, ?, ?, ?)', Array, Array) Drupal\Core\Database\Query\Insert->execute() Drupal\Core\Database\Driver\sqlite\Insert->execute() Drupal\simpletest\TestBase->storeAssertion(Array) Drupal\simpletest\TestBase->assert(1, 'Order %order_id has been created', Array) Drupal\simpletest\TestBase->pass('Order %order_id has been created', Array) Drupal\uc_store\Tests\UbercartTestBase->checkout() Drupal\uc_role\Tests\RoleTest->testRolePurchaseCheckout() Drupal\simpletest\TestBase->run(Array) simpletest_script_run_one_test('21', 'Drupal\uc_role\Tests\RoleTest') Uncaught exceptionConnection.php674Drupal\Core\Database\Connection->expandArguments()
ExpandDrupal\uc_stock\Tests\StockTest9202
MessageGroupFilenameLineFunctionStatus
InvalidArgumentException: Placeholders must have a trailing [] if they are to be expanded with an array of values. in Drupal\Core\Database\Connection->expandArguments() (line 674 of /var/lib/drupaltestbot/sites/default/files/checkout/core/lib/Drupal/Core/Database/Connection.php). Drupal\Core\Database\Connection->expandArguments('INSERT INTO {simpletest} (test_id, test_class, status, message, message_group, function, line, file) VALUES (?, ?, ?, ?, ?, ?, ?, ?)', Array) Drupal\Core\Database\Connection->query('INSERT INTO {simpletest} (test_id, test_class, status, message, message_group, function, line, file) VALUES (?, ?, ?, ?, ?, ?, ?, ?)', Array, Array) Drupal\Core\Database\Query\Insert->execute() Drupal\Core\Database\Driver\sqlite\Insert->execute() Drupal\simpletest\TestBase->storeAssertion(Array) Drupal\simpletest\TestBase->assert(1, 'Order %order_id has been created', Array) Drupal\simpletest\TestBase->pass('Order %order_id has been created', Array) Drupal\uc_store\Tests\UbercartTestBase->checkout() Drupal\uc_stock\Tests\StockTest->testStockDecrement() Drupal\simpletest\TestBase->run(Array) simpletest_script_run_one_test('15', 'Drupal\uc_stock\Tests\StockTest') Uncaught exceptionConnection.php674Drupal\Core\Database\Connection->expandArguments()
InvalidArgumentException: Placeholders must have a trailing [] if they are to be expanded with an array of values. in Drupal\Core\Database\Connection->expandArguments() (line 674 of /var/lib/drupaltestbot/sites/default/files/checkout/core/lib/Drupal/Core/Database/Connection.php). Drupal\Core\Database\Connection->expandArguments('INSERT INTO {simpletest} (test_id, test_class, status, message, message_group, function, line, file) VALUES (?, ?, ?, ?, ?, ?, ?, ?)', Array) Drupal\Core\Database\Connection->query('INSERT INTO {simpletest} (test_id, test_class, status, message, message_group, function, line, file) VALUES (?, ?, ?, ?, ?, ?, ?, ?)', Array, Array) Drupal\Core\Database\Query\Insert->execute() Drupal\Core\Database\Driver\sqlite\Insert->execute() Drupal\simpletest\TestBase->storeAssertion(Array) Drupal\simpletest\TestBase->assert(1, 'Order %order_id has been created', Array) Drupal\simpletest\TestBase->pass('Order %order_id has been created', Array) Drupal\uc_store\Tests\UbercartTestBase->checkout() Drupal\uc_stock\Tests\StockTest->testStockThresholdMail() Drupal\simpletest\TestBase->run(Array) simpletest_script_run_one_test('15', 'Drupal\uc_stock\Tests\StockTest') Uncaught exceptionConnection.php674Drupal\Core\Database\Connection->expandArguments()
LeafDrupal\uc_store\Tests\AddressTest1500
LeafDrupal\uc_store\Tests\AjaxTest2500
LeafDrupal\uc_store\Tests\StoreTest3500
LeafDrupal\uc_tax\Tests\InclusiveTaxTest2100
LeafDrupal\uc_tax\Tests\StoredTaxTest9400