format.patch

Test status
StatusResult
Last receivedSun, 08/16/2015 - 05:33:01
Last requestedSun, 08/16/2015 - 05:33:01
Last testedSun, 08/16/2015 - 05:40:44
Test count1
Environment status
PHP 5.5 MySQLfail
File information
Fileformat.patch
BranchUbercart - 8.x-4.x
LinkIssue Link
SummaryFAILED: [[SimpleTest]]: [PHP 5.5 MySQL] 3,290 pass(es), 4 fail(s), and 0 exception(s).
Details

PHP 5.5 MySQL

  1. Setup environment
  2. Detect an invalid patch URL
  3. Detect invalid repository information
  4. Detect invalid patch format
  5. Detect a non-applicable patch
  6. Detect invalid PHP syntax
  7. Detect a Drupal installation failure
  8. Detect a test run failure
  9. Detect a failing test
    Review the test failures below then if necessary run them locally until the problem has been fixed.
  10. Complete test suite with all tests passing
3,290 pass(es), 4 fail(s), and 0 exception(s)

Non-pass

Test namePassFailException
ExpandDrupal\uc_cart\Tests\CartSettingsTest14830
MessageGroupFilenameLineFunctionStatus
The breadcrumb link text is set correctly.OtherCartSettingsTest.php213Drupal\uc_cart\Tests\CartSettingsTest->testCartBreadcrumb()
The breadcrumb link is set correctly.OtherCartSettingsTest.php218Drupal\uc_cart\Tests\CartSettingsTest->testCartBreadcrumb()
[16-Aug-2015 15:36:58 Australia/Sydney] Uncaught PHP Exception UnexpectedValueException: "Invalid breadcrumb returned by Drupal\uc_cart\CartBreadcrumbBuilder::build()." at /var/lib/drupaltestbot/sites/default/files/checkout/core/lib/Drupal/Core/Breadcrumb/BreadcrumbManager.php line 95 Fatal errorUnknown0Unknown
ExpandDrupal\uc_country\Tests\CountryTest9010
MessageGroupFilenameLineFunctionStatus
"The country Korea, Democratic People's Republic of has been enabled." foundOtherCountryTest.php46Drupal\uc_country\Tests\CountryTest->testCountryUI()

All

Test namePassFailException
LeafDrupal\uc_attribute\Tests\AttributeTest43300
LeafDrupal\uc_cart\Tests\CartBlockTest6500
LeafDrupal\uc_cart\Tests\CartCheckoutTest49600
ExpandDrupal\uc_cart\Tests\CartSettingsTest14830
MessageGroupFilenameLineFunctionStatus
The breadcrumb link text is set correctly.OtherCartSettingsTest.php213Drupal\uc_cart\Tests\CartSettingsTest->testCartBreadcrumb()
The breadcrumb link is set correctly.OtherCartSettingsTest.php218Drupal\uc_cart\Tests\CartSettingsTest->testCartBreadcrumb()
[16-Aug-2015 15:36:58 Australia/Sydney] Uncaught PHP Exception UnexpectedValueException: "Invalid breadcrumb returned by Drupal\uc_cart\CartBreadcrumbBuilder::build()." at /var/lib/drupaltestbot/sites/default/files/checkout/core/lib/Drupal/Core/Breadcrumb/BreadcrumbManager.php line 95 Fatal errorUnknown0Unknown
LeafDrupal\uc_cart\Tests\CheckoutSettingsTest5200
LeafDrupal\uc_cart_links\Tests\CartLinksTest38200
LeafDrupal\uc_catalog\Tests\CatalogTest8500
ExpandDrupal\uc_country\Tests\CountryManagerTest500
MessageGroupFilenameLineFunctionStatus
Array ( ) DebugCountryManagerTest.php44Drupal\uc_country\Tests\CountryManagerTest->testServiceOverride()
Count = 0DebugCountryManagerTest.php45Drupal\uc_country\Tests\CountryManagerTest->testServiceOverride()
ExpandDrupal\uc_country\Tests\CountryTest9010
MessageGroupFilenameLineFunctionStatus
"The country Korea, Democratic People's Republic of has been enabled." foundOtherCountryTest.php46Drupal\uc_country\Tests\CountryTest->testCountryUI()
LeafDrupal\uc_credit\Tests\CreditCardTest31400
LeafDrupal\uc_order\Tests\OrderTest22400
LeafDrupal\uc_payment\Tests\PaymentPaneTest11400
LeafDrupal\uc_payment_pack\Tests\PaymentPackTest14900
LeafDrupal\uc_product\Tests\ProductTest15300
LeafDrupal\uc_product_kit\Tests\ProductKitTest15200
LeafDrupal\uc_quote\Tests\QuoteTest7600
LeafDrupal\uc_role\Tests\RoleCheckoutTest2700
LeafDrupal\uc_role\Tests\RoleTest3500
LeafDrupal\uc_stock\Tests\StockTest10000
LeafDrupal\uc_store\Tests\AddressTest1500
LeafDrupal\uc_store\Tests\AjaxTest2500
LeafDrupal\uc_store\Tests\StoreTest3500
LeafDrupal\uc_tax\Tests\InclusiveTaxTest2100
LeafDrupal\uc_tax\Tests\StoredTaxTest9400