page_manager-variant-entity-2551633-3.patch

Test status
StatusResult
Last receivedSat, 08/15/2015 - 14:36:00
Last requestedMon, 08/17/2015 - 18:15:37
Last testedMon, 08/17/2015 - 18:16:22
Test count1
Environment status
PHP 5.5 MySQLfail
File information
Filepage_manager-variant-entity-2551633-3.patch
BranchPage Manager - 8.x-1.x
LinkIssue Link
SummaryFAILED: [[SimpleTest]]: [PHP 5.5 MySQL] 289 pass(es), 102 fail(s), and 0 exception(s).
Details

PHP 5.5 MySQL

  1. Setup environment
  2. Detect an invalid patch URL
  3. Detect invalid repository information
  4. Detect invalid patch format
  5. Detect a non-applicable patch
  6. Detect invalid PHP syntax
  7. Detect a Drupal installation failure
  8. Detect a test run failure
  9. Detect a failing test
    Review the test failures below then if necessary run them locally until the problem has been fixed.
  10. Complete test suite with all tests passing
289 pass(es), 102 fail(s), and 0 exception(s)

Non-pass

Test namePassFailException
ExpandDrupal\page_manager\Tests\PageConfigSchemaTest110
MessageGroupFilenameLineFunctionStatus
The test did not complete due to a fatal error.Completion checkPageConfigSchemaTest.php31Drupal\page_manager\Tests\PageConfigSchemaTest->testValidPageConfigSchema()
ExpandDrupal\page_manager\Tests\PageManagerAdminTest78360
MessageGroupFilenameLineFunctionStatus
The test did not complete due to a fatal error.Completion checkPageManagerAdminTest.php47Drupal\page_manager\Tests\PageManagerAdminTest->testAdmin()
HTTP response expected 404, actual 200BrowserPageManagerAdminTest.php89Drupal\page_manager\Tests\PageManagerAdminTest->doTestAddPage()
Link Edit does not exist on http://ec2-54-191-148-85.us-west-2.compute.amazonaws.com/checkout/admin/structure/page_manager/manage/fooBrowserPageManagerAdminTest.php91Drupal\page_manager\Tests\PageManagerAdminTest->doTestAddPage()
Failed to set field display_variant[status_code] to 200OtherPageManagerAdminTest.php92Drupal\page_manager\Tests\PageManagerAdminTest->doTestAddPage()
Found the Update display variant buttonOtherPageManagerAdminTest.php92Drupal\page_manager\Tests\PageManagerAdminTest->doTestAddPage()
Found the requested form fields at OtherPageManagerAdminTest.php92Drupal\page_manager\Tests\PageManagerAdminTest->doTestAddPage()
Link Edit does not exist on http://ec2-54-191-148-85.us-west-2.compute.amazonaws.com/checkout/admin/structure/page_manager/manage/fooBrowserPageManagerAdminTest.php97Drupal\page_manager\Tests\PageManagerAdminTest->doTestAddPage()
Failed to set field display_variant[status_code] to 403OtherPageManagerAdminTest.php98Drupal\page_manager\Tests\PageManagerAdminTest->doTestAddPage()
Found the Update display variant buttonOtherPageManagerAdminTest.php98Drupal\page_manager\Tests\PageManagerAdminTest->doTestAddPage()
Found the requested form fields at OtherPageManagerAdminTest.php98Drupal\page_manager\Tests\PageManagerAdminTest->doTestAddPage()
"There are no display variants." not foundOtherPageManagerAdminTest.php102Drupal\page_manager\Tests\PageManagerAdminTest->doTestAddPage()
HTTP response expected 403, actual 200BrowserPageManagerAdminTest.php110Drupal\page_manager\Tests\PageManagerAdminTest->doTestDisablePage()
HTTP response expected 403, actual 200BrowserPageManagerAdminTest.php122Drupal\page_manager\Tests\PageManagerAdminTest->doTestDisablePage()
Default page title "Foo" was taken from page label.BrowserPageManagerAdminTest.php134Drupal\page_manager\Tests\PageManagerAdminTest->doTestAddDisplayVariant()
Failed to set field display_variant[label] to FirstOtherPageManagerAdminTest.php139Drupal\page_manager\Tests\PageManagerAdminTest->doTestAddDisplayVariant()
Failed to set field display_variant[page_title] to Example titleOtherPageManagerAdminTest.php139Drupal\page_manager\Tests\PageManagerAdminTest->doTestAddDisplayVariant()
Found the Add display variant buttonOtherPageManagerAdminTest.php139Drupal\page_manager\Tests\PageManagerAdminTest->doTestAddDisplayVariant()
Found the requested form fields at OtherPageManagerAdminTest.php139Drupal\page_manager\Tests\PageManagerAdminTest->doTestAddDisplayVariant()
Raw "The First display variant has been added." foundOtherPageManagerAdminTest.php140Drupal\page_manager\Tests\PageManagerAdminTest->doTestAddDisplayVariant()
Link Edit does not exist on http://ec2-54-191-148-85.us-west-2.compute.amazonaws.com/checkout/admin/structure/page_manager/manage/fooBrowserPageManagerAdminTest.php155Drupal\page_manager\Tests\PageManagerAdminTest->doTestAddBlock()
Link Add new block does not exist on http://ec2-54-191-148-85.us-west-2.compute.amazonaws.com/checkout/admin/structure/page_manager/manage/fooBrowserPageManagerAdminTest.php157Drupal\page_manager\Tests\PageManagerAdminTest->doTestAddBlock()
Link User account menu does not exist on http://ec2-54-191-148-85.us-west-2.compute.amazonaws.com/checkout/admin/structure/page_manager/manage/fooBrowserPageManagerAdminTest.php158Drupal\page_manager\Tests\PageManagerAdminTest->doTestAddBlock()
Failed to set field region to topOtherPageManagerAdminTest.php162Drupal\page_manager\Tests\PageManagerAdminTest->doTestAddBlock()
Found the Add block buttonOtherPageManagerAdminTest.php162Drupal\page_manager\Tests\PageManagerAdminTest->doTestAddBlock()
Found the requested form fields at OtherPageManagerAdminTest.php162Drupal\page_manager\Tests\PageManagerAdminTest->doTestAddBlock()
Page title 'Foo | Drupal' is equal to 'Example title | Drupal'.OtherPageManagerAdminTest.php168Drupal\page_manager\Tests\PageManagerAdminTest->doTestAddBlock()
Value array ( 0 => 'My account', 1 => 'Log out', ) is equal to value array ( ).OtherPageManagerAdminTest.php174Drupal\page_manager\Tests\PageManagerAdminTest->doTestAddBlock()
Raw "User account menu" foundOtherPageManagerAdminTest.php179Drupal\page_manager\Tests\PageManagerAdminTest->doTestAddBlock()
Link Edit does not exist on http://ec2-54-191-148-85.us-west-2.compute.amazonaws.com/checkout/admin/structure/page_manager/manage/fooBrowserPageManagerAdminTest.php187Drupal\page_manager\Tests\PageManagerAdminTest->doTestEditBlock()
Link Edit does not exist on http://ec2-54-191-148-85.us-west-2.compute.amazonaws.com/checkout/admin/structure/page_manager/manage/fooBrowserPageManagerAdminTest.php188Drupal\page_manager\Tests\PageManagerAdminTest->doTestEditBlock()
Failed to set field settings[label] to Updated block labelOtherPageManagerAdminTest.php192Drupal\page_manager\Tests\PageManagerAdminTest->doTestEditBlock()
Found the Update block buttonOtherPageManagerAdminTest.php192Drupal\page_manager\Tests\PageManagerAdminTest->doTestEditBlock()
Found the requested form fields at OtherPageManagerAdminTest.php192Drupal\page_manager\Tests\PageManagerAdminTest->doTestEditBlock()
Raw "Updated block label" foundOtherPageManagerAdminTest.php200Drupal\page_manager\Tests\PageManagerAdminTest->doTestEditBlock()
Block not foundOtherPageManagerAdminTest.php208Drupal\page_manager\Tests\PageManagerAdminTest->doTestEditDisplayVariant()
Value array ( 0 => 'My account', 1 => 'Log out', ) is equal to value array ( ).OtherPageManagerAdminTest.php244Drupal\page_manager\Tests\PageManagerAdminTest->doTestReorderDisplayVariants()
ExpandDrupal\page_manager\Tests\PageManagerTranslationIntegrationTest3340
MessageGroupFilenameLineFunctionStatus
Link Edit does not exist on http://ec2-54-191-148-85.us-west-2.compute.amazonaws.com/checkout/admin/structure/page_manager/manage/node_viewBrowserPageManagerTranslationIntegrationTest.php67Drupal\page_manager\Tests\PageManagerTranslationIntegrationTest->testNode()
Failed to set field display_variant[status_code] to 200OtherPageManagerTranslationIntegrationTest.php68Drupal\page_manager\Tests\PageManagerTranslationIntegrationTest->testNode()
Found the Update display variant buttonOtherPageManagerTranslationIntegrationTest.php68Drupal\page_manager\Tests\PageManagerTranslationIntegrationTest->testNode()
Found the requested form fields at OtherPageManagerTranslationIntegrationTest.php68Drupal\page_manager\Tests\PageManagerTranslationIntegrationTest->testNode()
ExpandDrupal\page_manager\Tests\PageNodeSelectionTest48220
MessageGroupFilenameLineFunctionStatus
HTTP response expected 404, actual 200BrowserPageNodeSelectionTest.php61Drupal\page_manager\Tests\PageNodeSelectionTest->testAdmin()
HTTP response expected 404, actual 200BrowserPageNodeSelectionTest.php64Drupal\page_manager\Tests\PageNodeSelectionTest->testAdmin()
Failed to set field display_variant[label] to FirstOtherPageNodeSelectionTest.php74Drupal\page_manager\Tests\PageNodeSelectionTest->testAdmin()
Found the Add display variant buttonOtherPageNodeSelectionTest.php74Drupal\page_manager\Tests\PageNodeSelectionTest->testAdmin()
Found the requested form fields at OtherPageNodeSelectionTest.php74Drupal\page_manager\Tests\PageNodeSelectionTest->testAdmin()
Link Add new block does not exist on http://ec2-54-191-148-85.us-west-2.compute.amazonaws.com/checkout/admin/structure/page_manager/manage/node_view/add/block_displayBrowserPageNodeSelectionTest.php77Drupal\page_manager\Tests\PageNodeSelectionTest->testAdmin()
Link Entity view (Content) does not exist on http://ec2-54-191-148-85.us-west-2.compute.amazonaws.com/checkout/admin/structure/page_manager/manage/node_view/add/block_displayBrowserPageNodeSelectionTest.php78Drupal\page_manager\Tests\PageNodeSelectionTest->testAdmin()
Failed to set field region to topOtherPageNodeSelectionTest.php83Drupal\page_manager\Tests\PageNodeSelectionTest->testAdmin()
Failed to set field settings[label_display] to OtherPageNodeSelectionTest.php83Drupal\page_manager\Tests\PageNodeSelectionTest->testAdmin()
Found the Add block buttonOtherPageNodeSelectionTest.php83Drupal\page_manager\Tests\PageNodeSelectionTest->testAdmin()
Found the requested form fields at OtherPageNodeSelectionTest.php83Drupal\page_manager\Tests\PageNodeSelectionTest->testAdmin()
Link Add new selection condition does not exist on http://ec2-54-191-148-85.us-west-2.compute.amazonaws.com/checkout/admin/structure/page_manager/manage/node_view/add/block_displayBrowserPageNodeSelectionTest.php86Drupal\page_manager\Tests\PageNodeSelectionTest->testAdmin()
Link Node Bundle does not exist on http://ec2-54-191-148-85.us-west-2.compute.amazonaws.com/checkout/admin/structure/page_manager/manage/node_view/add/block_displayBrowserPageNodeSelectionTest.php87Drupal\page_manager\Tests\PageNodeSelectionTest->testAdmin()
Failed to set field condition[bundles][article] to 1OtherPageNodeSelectionTest.php91Drupal\page_manager\Tests\PageNodeSelectionTest->testAdmin()
Found the Add selection condition buttonOtherPageNodeSelectionTest.php91Drupal\page_manager\Tests\PageNodeSelectionTest->testAdmin()
Found the requested form fields at OtherPageNodeSelectionTest.php91Drupal\page_manager\Tests\PageNodeSelectionTest->testAdmin()
Failed to set field display_variant[page_title] to [node:title]OtherPageNodeSelectionTest.php97Drupal\page_manager\Tests\PageNodeSelectionTest->testAdmin()
Found the Update display variant buttonOtherPageNodeSelectionTest.php97Drupal\page_manager\Tests\PageNodeSelectionTest->testAdmin()
Found the requested form fields at OtherPageNodeSelectionTest.php97Drupal\page_manager\Tests\PageNodeSelectionTest->testAdmin()
HTTP response expected 404, actual 200BrowserPageNodeSelectionTest.php101Drupal\page_manager\Tests\PageNodeSelectionTest->testAdmin()
Page title 'Node View | Drupal' is equal to 'pPli8PI7 | Drupal'.OtherPageNodeSelectionTest.php106Drupal\page_manager\Tests\PageNodeSelectionTest->testAdmin()
"xXwHyOsBg1ieSI2NMc62GYyzYkoF7XkF" foundOtherPageNodeSelectionTest.php107Drupal\page_manager\Tests\PageNodeSelectionTest->testAdmin()
ExpandDrupal\page_manager\Tests\PagePlaceholderTest2140
MessageGroupFilenameLineFunctionStatus
Link Edit does not exist on http://ec2-54-191-148-85.us-west-2.compute.amazonaws.com/checkout/admin/structure/page_manager/manage/placeholderBrowserPagePlaceholderTest.php49Drupal\page_manager\Tests\PagePlaceholderTest->testPagePlaceHolder()
Failed to set field display_variant[status_code] to 200OtherPagePlaceholderTest.php50Drupal\page_manager\Tests\PagePlaceholderTest->testPagePlaceHolder()
Found the Update display variant buttonOtherPagePlaceholderTest.php50Drupal\page_manager\Tests\PagePlaceholderTest->testPagePlaceHolder()
Found the requested form fields at OtherPagePlaceholderTest.php50Drupal\page_manager\Tests\PagePlaceholderTest->testPagePlaceHolder()
ExpandDrupal\page_manager\Tests\StaticContextTest81320
MessageGroupFilenameLineFunctionStatus
Failed to set field display_variant[label] to Static context blocksOtherStaticContextTest.php87Drupal\page_manager\Tests\StaticContextTest->testStaticContext()
Failed to set field display_variant[page_title] to Static context test pageOtherStaticContextTest.php87Drupal\page_manager\Tests\StaticContextTest->testStaticContext()
Found the Add display variant buttonOtherStaticContextTest.php87Drupal\page_manager\Tests\StaticContextTest->testStaticContext()
Found the requested form fields at OtherStaticContextTest.php87Drupal\page_manager\Tests\StaticContextTest->testStaticContext()
Link Add new block does not exist on http://ec2-54-191-148-85.us-west-2.compute.amazonaws.com/checkout/admin/structure/page_manager/manage/static_node_context/add/block_displayBrowserStaticContextTest.php90Drupal\page_manager\Tests\StaticContextTest->testStaticContext()
Link Entity view (Content) does not exist on http://ec2-54-191-148-85.us-west-2.compute.amazonaws.com/checkout/admin/structure/page_manager/manage/static_node_context/add/block_displayBrowserStaticContextTest.php91Drupal\page_manager\Tests\StaticContextTest->testStaticContext()
Failed to set field settings[label] to Static node viewOtherStaticContextTest.php98Drupal\page_manager\Tests\StaticContextTest->testStaticContext()
Failed to set field settings[label_display] to 1OtherStaticContextTest.php98Drupal\page_manager\Tests\StaticContextTest->testStaticContext()
Failed to set field settings[view_mode] to defaultOtherStaticContextTest.php98Drupal\page_manager\Tests\StaticContextTest->testStaticContext()
Failed to set field region to topOtherStaticContextTest.php98Drupal\page_manager\Tests\StaticContextTest->testStaticContext()
Found the Add block buttonOtherStaticContextTest.php98Drupal\page_manager\Tests\StaticContextTest->testStaticContext()
Found the requested form fields at OtherStaticContextTest.php98Drupal\page_manager\Tests\StaticContextTest->testStaticContext()
"Static node view" foundOtherStaticContextTest.php99Drupal\page_manager\Tests\StaticContextTest->testStaticContext()
Link Add new block does not exist on http://ec2-54-191-148-85.us-west-2.compute.amazonaws.com/checkout/admin/structure/page_manager/manage/static_node_context/add/block_displayBrowserStaticContextTest.php102Drupal\page_manager\Tests\StaticContextTest->testStaticContext()
Link Entity view (Content) does not exist on http://ec2-54-191-148-85.us-west-2.compute.amazonaws.com/checkout/admin/structure/page_manager/manage/static_node_context/add/block_displayBrowserStaticContextTest.php103Drupal\page_manager\Tests\StaticContextTest->testStaticContext()
Failed to set field settings[label] to Static node 2 viewOtherStaticContextTest.php111Drupal\page_manager\Tests\StaticContextTest->testStaticContext()
Failed to set field settings[label_display] to 1OtherStaticContextTest.php111Drupal\page_manager\Tests\StaticContextTest->testStaticContext()
Failed to set field settings[view_mode] to defaultOtherStaticContextTest.php111Drupal\page_manager\Tests\StaticContextTest->testStaticContext()
Failed to set field region to bottomOtherStaticContextTest.php111Drupal\page_manager\Tests\StaticContextTest->testStaticContext()
Failed to set field context_mapping[entity] to static_node_2OtherStaticContextTest.php111Drupal\page_manager\Tests\StaticContextTest->testStaticContext()
Found the Add block buttonOtherStaticContextTest.php111Drupal\page_manager\Tests\StaticContextTest->testStaticContext()
Found the requested form fields at OtherStaticContextTest.php111Drupal\page_manager\Tests\StaticContextTest->testStaticContext()
"Static node 2 view" foundOtherStaticContextTest.php112Drupal\page_manager\Tests\StaticContextTest->testStaticContext()
"mmDI53DI" foundOtherStaticContextTest.php116Drupal\page_manager\Tests\StaticContextTest->testStaticContext()
"eNyUpX7mEt8NhlpalBKtp6STXvq1cYAV" foundOtherStaticContextTest.php117Drupal\page_manager\Tests\StaticContextTest->testStaticContext()
"txHe10rf" foundOtherStaticContextTest.php118Drupal\page_manager\Tests\StaticContextTest->testStaticContext()
"fjJvv1FzGTm8kGYhRLQa9TprysJ9iDUs" foundOtherStaticContextTest.php119Drupal\page_manager\Tests\StaticContextTest->testStaticContext()
"mmDI53DI" foundOtherStaticContextTest.php134Drupal\page_manager\Tests\StaticContextTest->testStaticContext()
"eNyUpX7mEt8NhlpalBKtp6STXvq1cYAV" foundOtherStaticContextTest.php135Drupal\page_manager\Tests\StaticContextTest->testStaticContext()
Link Edit does not exist on http://ec2-54-191-148-85.us-west-2.compute.amazonaws.com/checkout/admin/structure/page_manager/manage/static_node_contextBrowserStaticContextTest.php152Drupal\page_manager\Tests\StaticContextTest->testStaticContext()
"txHe10rf" foundOtherStaticContextTest.php161Drupal\page_manager\Tests\StaticContextTest->testStaticContext()
"fjJvv1FzGTm8kGYhRLQa9TprysJ9iDUs" foundOtherStaticContextTest.php162Drupal\page_manager\Tests\StaticContextTest->testStaticContext()
ExpandDrupal\Tests\page_manager\Unit\PageExecutableTest310
MessageGroupFilenameLineFunctionStatus
Drupal\Tests\page_manager\Unit\PageExecutableTest::testSelectDisplayVariant Prophecy\Exception\Doubler\MethodNotFoundException: Method `Double\VariantInterface\P3::getVariant()` not found. /var/lib/drupaltestbot/sites/default/files/checkout/sites/default/modules/page_manager/src/PageExecutable.php:65 /var/lib/drupaltestbot/sites/default/files/checkout/sites/default/modules/page_manager/src/PageExecutable.php:65 /var/lib/drupaltestbot/sites/default/files/checkout/sites/default/modules/page_manager/tests/src/Unit/PageExecutableTest.php:77 OtherPageExecutableTest.php63Drupal\Tests\page_manager\Unit\PageExecutableTest->testSelectDisplayVariant()
ExpandDrupal\Tests\page_manager\Unit\VariantAwareTraitTest020
MessageGroupFilenameLineFunctionStatus
Drupal\Tests\page_manager\Unit\VariantAwareTraitTest::testGetVariantsEmpty Undefined property: Drupal\Tests\page_manager\Unit\TestVariantAwareTrait::$variantCollection /var/lib/drupaltestbot/sites/default/files/checkout/sites/default/modules/page_manager/src/Plugin/VariantAwareTrait.php:49 /var/lib/drupaltestbot/sites/default/files/checkout/sites/default/modules/page_manager/tests/src/Unit/VariantAwareTraitTest.php:51 OtherVariantAwareTraitTest.php47Drupal\Tests\page_manager\Unit\VariantAwareTraitTest->testGetVariantsEmpty()
Drupal\Tests\page_manager\Unit\VariantAwareTraitTest::testGetVariants Undefined property: Drupal\Tests\page_manager\Unit\TestVariantAwareTrait::$variantCollection /var/lib/drupaltestbot/sites/default/files/checkout/sites/default/modules/page_manager/src/Plugin/VariantAwareTrait.php:49 /var/lib/drupaltestbot/sites/default/files/checkout/sites/default/modules/page_manager/tests/src/Unit/VariantAwareTraitTest.php:71 OtherVariantAwareTraitTest.php59Drupal\Tests\page_manager\Unit\VariantAwareTraitTest->testGetVariants()

All

Test namePassFailException
ExpandDrupal\page_manager\Tests\PageConfigSchemaTest110
MessageGroupFilenameLineFunctionStatus
The test did not complete due to a fatal error.Completion checkPageConfigSchemaTest.php31Drupal\page_manager\Tests\PageConfigSchemaTest->testValidPageConfigSchema()
ExpandDrupal\page_manager\Tests\PageManagerAdminTest78360
MessageGroupFilenameLineFunctionStatus
The test did not complete due to a fatal error.Completion checkPageManagerAdminTest.php47Drupal\page_manager\Tests\PageManagerAdminTest->testAdmin()
HTTP response expected 404, actual 200BrowserPageManagerAdminTest.php89Drupal\page_manager\Tests\PageManagerAdminTest->doTestAddPage()
Link Edit does not exist on http://ec2-54-191-148-85.us-west-2.compute.amazonaws.com/checkout/admin/structure/page_manager/manage/fooBrowserPageManagerAdminTest.php91Drupal\page_manager\Tests\PageManagerAdminTest->doTestAddPage()
Failed to set field display_variant[status_code] to 200OtherPageManagerAdminTest.php92Drupal\page_manager\Tests\PageManagerAdminTest->doTestAddPage()
Found the Update display variant buttonOtherPageManagerAdminTest.php92Drupal\page_manager\Tests\PageManagerAdminTest->doTestAddPage()
Found the requested form fields at OtherPageManagerAdminTest.php92Drupal\page_manager\Tests\PageManagerAdminTest->doTestAddPage()
Link Edit does not exist on http://ec2-54-191-148-85.us-west-2.compute.amazonaws.com/checkout/admin/structure/page_manager/manage/fooBrowserPageManagerAdminTest.php97Drupal\page_manager\Tests\PageManagerAdminTest->doTestAddPage()
Failed to set field display_variant[status_code] to 403OtherPageManagerAdminTest.php98Drupal\page_manager\Tests\PageManagerAdminTest->doTestAddPage()
Found the Update display variant buttonOtherPageManagerAdminTest.php98Drupal\page_manager\Tests\PageManagerAdminTest->doTestAddPage()
Found the requested form fields at OtherPageManagerAdminTest.php98Drupal\page_manager\Tests\PageManagerAdminTest->doTestAddPage()
"There are no display variants." not foundOtherPageManagerAdminTest.php102Drupal\page_manager\Tests\PageManagerAdminTest->doTestAddPage()
HTTP response expected 403, actual 200BrowserPageManagerAdminTest.php110Drupal\page_manager\Tests\PageManagerAdminTest->doTestDisablePage()
HTTP response expected 403, actual 200BrowserPageManagerAdminTest.php122Drupal\page_manager\Tests\PageManagerAdminTest->doTestDisablePage()
Default page title "Foo" was taken from page label.BrowserPageManagerAdminTest.php134Drupal\page_manager\Tests\PageManagerAdminTest->doTestAddDisplayVariant()
Failed to set field display_variant[label] to FirstOtherPageManagerAdminTest.php139Drupal\page_manager\Tests\PageManagerAdminTest->doTestAddDisplayVariant()
Failed to set field display_variant[page_title] to Example titleOtherPageManagerAdminTest.php139Drupal\page_manager\Tests\PageManagerAdminTest->doTestAddDisplayVariant()
Found the Add display variant buttonOtherPageManagerAdminTest.php139Drupal\page_manager\Tests\PageManagerAdminTest->doTestAddDisplayVariant()
Found the requested form fields at OtherPageManagerAdminTest.php139Drupal\page_manager\Tests\PageManagerAdminTest->doTestAddDisplayVariant()
Raw "The First display variant has been added." foundOtherPageManagerAdminTest.php140Drupal\page_manager\Tests\PageManagerAdminTest->doTestAddDisplayVariant()
Link Edit does not exist on http://ec2-54-191-148-85.us-west-2.compute.amazonaws.com/checkout/admin/structure/page_manager/manage/fooBrowserPageManagerAdminTest.php155Drupal\page_manager\Tests\PageManagerAdminTest->doTestAddBlock()
Link Add new block does not exist on http://ec2-54-191-148-85.us-west-2.compute.amazonaws.com/checkout/admin/structure/page_manager/manage/fooBrowserPageManagerAdminTest.php157Drupal\page_manager\Tests\PageManagerAdminTest->doTestAddBlock()
Link User account menu does not exist on http://ec2-54-191-148-85.us-west-2.compute.amazonaws.com/checkout/admin/structure/page_manager/manage/fooBrowserPageManagerAdminTest.php158Drupal\page_manager\Tests\PageManagerAdminTest->doTestAddBlock()
Failed to set field region to topOtherPageManagerAdminTest.php162Drupal\page_manager\Tests\PageManagerAdminTest->doTestAddBlock()
Found the Add block buttonOtherPageManagerAdminTest.php162Drupal\page_manager\Tests\PageManagerAdminTest->doTestAddBlock()
Found the requested form fields at OtherPageManagerAdminTest.php162Drupal\page_manager\Tests\PageManagerAdminTest->doTestAddBlock()
Page title 'Foo | Drupal' is equal to 'Example title | Drupal'.OtherPageManagerAdminTest.php168Drupal\page_manager\Tests\PageManagerAdminTest->doTestAddBlock()
Value array ( 0 => 'My account', 1 => 'Log out', ) is equal to value array ( ).OtherPageManagerAdminTest.php174Drupal\page_manager\Tests\PageManagerAdminTest->doTestAddBlock()
Raw "User account menu" foundOtherPageManagerAdminTest.php179Drupal\page_manager\Tests\PageManagerAdminTest->doTestAddBlock()
Link Edit does not exist on http://ec2-54-191-148-85.us-west-2.compute.amazonaws.com/checkout/admin/structure/page_manager/manage/fooBrowserPageManagerAdminTest.php187Drupal\page_manager\Tests\PageManagerAdminTest->doTestEditBlock()
Link Edit does not exist on http://ec2-54-191-148-85.us-west-2.compute.amazonaws.com/checkout/admin/structure/page_manager/manage/fooBrowserPageManagerAdminTest.php188Drupal\page_manager\Tests\PageManagerAdminTest->doTestEditBlock()
Failed to set field settings[label] to Updated block labelOtherPageManagerAdminTest.php192Drupal\page_manager\Tests\PageManagerAdminTest->doTestEditBlock()
Found the Update block buttonOtherPageManagerAdminTest.php192Drupal\page_manager\Tests\PageManagerAdminTest->doTestEditBlock()
Found the requested form fields at OtherPageManagerAdminTest.php192Drupal\page_manager\Tests\PageManagerAdminTest->doTestEditBlock()
Raw "Updated block label" foundOtherPageManagerAdminTest.php200Drupal\page_manager\Tests\PageManagerAdminTest->doTestEditBlock()
Block not foundOtherPageManagerAdminTest.php208Drupal\page_manager\Tests\PageManagerAdminTest->doTestEditDisplayVariant()
Value array ( 0 => 'My account', 1 => 'Log out', ) is equal to value array ( ).OtherPageManagerAdminTest.php244Drupal\page_manager\Tests\PageManagerAdminTest->doTestReorderDisplayVariants()
ExpandDrupal\page_manager\Tests\PageManagerTranslationIntegrationTest3340
MessageGroupFilenameLineFunctionStatus
Link Edit does not exist on http://ec2-54-191-148-85.us-west-2.compute.amazonaws.com/checkout/admin/structure/page_manager/manage/node_viewBrowserPageManagerTranslationIntegrationTest.php67Drupal\page_manager\Tests\PageManagerTranslationIntegrationTest->testNode()
Failed to set field display_variant[status_code] to 200OtherPageManagerTranslationIntegrationTest.php68Drupal\page_manager\Tests\PageManagerTranslationIntegrationTest->testNode()
Found the Update display variant buttonOtherPageManagerTranslationIntegrationTest.php68Drupal\page_manager\Tests\PageManagerTranslationIntegrationTest->testNode()
Found the requested form fields at OtherPageManagerTranslationIntegrationTest.php68Drupal\page_manager\Tests\PageManagerTranslationIntegrationTest->testNode()
ExpandDrupal\page_manager\Tests\PageNodeSelectionTest48220
MessageGroupFilenameLineFunctionStatus
HTTP response expected 404, actual 200BrowserPageNodeSelectionTest.php61Drupal\page_manager\Tests\PageNodeSelectionTest->testAdmin()
HTTP response expected 404, actual 200BrowserPageNodeSelectionTest.php64Drupal\page_manager\Tests\PageNodeSelectionTest->testAdmin()
Failed to set field display_variant[label] to FirstOtherPageNodeSelectionTest.php74Drupal\page_manager\Tests\PageNodeSelectionTest->testAdmin()
Found the Add display variant buttonOtherPageNodeSelectionTest.php74Drupal\page_manager\Tests\PageNodeSelectionTest->testAdmin()
Found the requested form fields at OtherPageNodeSelectionTest.php74Drupal\page_manager\Tests\PageNodeSelectionTest->testAdmin()
Link Add new block does not exist on http://ec2-54-191-148-85.us-west-2.compute.amazonaws.com/checkout/admin/structure/page_manager/manage/node_view/add/block_displayBrowserPageNodeSelectionTest.php77Drupal\page_manager\Tests\PageNodeSelectionTest->testAdmin()
Link Entity view (Content) does not exist on http://ec2-54-191-148-85.us-west-2.compute.amazonaws.com/checkout/admin/structure/page_manager/manage/node_view/add/block_displayBrowserPageNodeSelectionTest.php78Drupal\page_manager\Tests\PageNodeSelectionTest->testAdmin()
Failed to set field region to topOtherPageNodeSelectionTest.php83Drupal\page_manager\Tests\PageNodeSelectionTest->testAdmin()
Failed to set field settings[label_display] to OtherPageNodeSelectionTest.php83Drupal\page_manager\Tests\PageNodeSelectionTest->testAdmin()
Found the Add block buttonOtherPageNodeSelectionTest.php83Drupal\page_manager\Tests\PageNodeSelectionTest->testAdmin()
Found the requested form fields at OtherPageNodeSelectionTest.php83Drupal\page_manager\Tests\PageNodeSelectionTest->testAdmin()
Link Add new selection condition does not exist on http://ec2-54-191-148-85.us-west-2.compute.amazonaws.com/checkout/admin/structure/page_manager/manage/node_view/add/block_displayBrowserPageNodeSelectionTest.php86Drupal\page_manager\Tests\PageNodeSelectionTest->testAdmin()
Link Node Bundle does not exist on http://ec2-54-191-148-85.us-west-2.compute.amazonaws.com/checkout/admin/structure/page_manager/manage/node_view/add/block_displayBrowserPageNodeSelectionTest.php87Drupal\page_manager\Tests\PageNodeSelectionTest->testAdmin()
Failed to set field condition[bundles][article] to 1OtherPageNodeSelectionTest.php91Drupal\page_manager\Tests\PageNodeSelectionTest->testAdmin()
Found the Add selection condition buttonOtherPageNodeSelectionTest.php91Drupal\page_manager\Tests\PageNodeSelectionTest->testAdmin()
Found the requested form fields at OtherPageNodeSelectionTest.php91Drupal\page_manager\Tests\PageNodeSelectionTest->testAdmin()
Failed to set field display_variant[page_title] to [node:title]OtherPageNodeSelectionTest.php97Drupal\page_manager\Tests\PageNodeSelectionTest->testAdmin()
Found the Update display variant buttonOtherPageNodeSelectionTest.php97Drupal\page_manager\Tests\PageNodeSelectionTest->testAdmin()
Found the requested form fields at OtherPageNodeSelectionTest.php97Drupal\page_manager\Tests\PageNodeSelectionTest->testAdmin()
HTTP response expected 404, actual 200BrowserPageNodeSelectionTest.php101Drupal\page_manager\Tests\PageNodeSelectionTest->testAdmin()
Page title 'Node View | Drupal' is equal to 'pPli8PI7 | Drupal'.OtherPageNodeSelectionTest.php106Drupal\page_manager\Tests\PageNodeSelectionTest->testAdmin()
"xXwHyOsBg1ieSI2NMc62GYyzYkoF7XkF" foundOtherPageNodeSelectionTest.php107Drupal\page_manager\Tests\PageNodeSelectionTest->testAdmin()
ExpandDrupal\page_manager\Tests\PagePlaceholderTest2140
MessageGroupFilenameLineFunctionStatus
Link Edit does not exist on http://ec2-54-191-148-85.us-west-2.compute.amazonaws.com/checkout/admin/structure/page_manager/manage/placeholderBrowserPagePlaceholderTest.php49Drupal\page_manager\Tests\PagePlaceholderTest->testPagePlaceHolder()
Failed to set field display_variant[status_code] to 200OtherPagePlaceholderTest.php50Drupal\page_manager\Tests\PagePlaceholderTest->testPagePlaceHolder()
Found the Update display variant buttonOtherPagePlaceholderTest.php50Drupal\page_manager\Tests\PagePlaceholderTest->testPagePlaceHolder()
Found the requested form fields at OtherPagePlaceholderTest.php50Drupal\page_manager\Tests\PagePlaceholderTest->testPagePlaceHolder()
ExpandDrupal\page_manager\Tests\StaticContextTest81320
MessageGroupFilenameLineFunctionStatus
Failed to set field display_variant[label] to Static context blocksOtherStaticContextTest.php87Drupal\page_manager\Tests\StaticContextTest->testStaticContext()
Failed to set field display_variant[page_title] to Static context test pageOtherStaticContextTest.php87Drupal\page_manager\Tests\StaticContextTest->testStaticContext()
Found the Add display variant buttonOtherStaticContextTest.php87Drupal\page_manager\Tests\StaticContextTest->testStaticContext()
Found the requested form fields at OtherStaticContextTest.php87Drupal\page_manager\Tests\StaticContextTest->testStaticContext()
Link Add new block does not exist on http://ec2-54-191-148-85.us-west-2.compute.amazonaws.com/checkout/admin/structure/page_manager/manage/static_node_context/add/block_displayBrowserStaticContextTest.php90Drupal\page_manager\Tests\StaticContextTest->testStaticContext()
Link Entity view (Content) does not exist on http://ec2-54-191-148-85.us-west-2.compute.amazonaws.com/checkout/admin/structure/page_manager/manage/static_node_context/add/block_displayBrowserStaticContextTest.php91Drupal\page_manager\Tests\StaticContextTest->testStaticContext()
Failed to set field settings[label] to Static node viewOtherStaticContextTest.php98Drupal\page_manager\Tests\StaticContextTest->testStaticContext()
Failed to set field settings[label_display] to 1OtherStaticContextTest.php98Drupal\page_manager\Tests\StaticContextTest->testStaticContext()
Failed to set field settings[view_mode] to defaultOtherStaticContextTest.php98Drupal\page_manager\Tests\StaticContextTest->testStaticContext()
Failed to set field region to topOtherStaticContextTest.php98Drupal\page_manager\Tests\StaticContextTest->testStaticContext()
Found the Add block buttonOtherStaticContextTest.php98Drupal\page_manager\Tests\StaticContextTest->testStaticContext()
Found the requested form fields at OtherStaticContextTest.php98Drupal\page_manager\Tests\StaticContextTest->testStaticContext()
"Static node view" foundOtherStaticContextTest.php99Drupal\page_manager\Tests\StaticContextTest->testStaticContext()
Link Add new block does not exist on http://ec2-54-191-148-85.us-west-2.compute.amazonaws.com/checkout/admin/structure/page_manager/manage/static_node_context/add/block_displayBrowserStaticContextTest.php102Drupal\page_manager\Tests\StaticContextTest->testStaticContext()
Link Entity view (Content) does not exist on http://ec2-54-191-148-85.us-west-2.compute.amazonaws.com/checkout/admin/structure/page_manager/manage/static_node_context/add/block_displayBrowserStaticContextTest.php103Drupal\page_manager\Tests\StaticContextTest->testStaticContext()
Failed to set field settings[label] to Static node 2 viewOtherStaticContextTest.php111Drupal\page_manager\Tests\StaticContextTest->testStaticContext()
Failed to set field settings[label_display] to 1OtherStaticContextTest.php111Drupal\page_manager\Tests\StaticContextTest->testStaticContext()
Failed to set field settings[view_mode] to defaultOtherStaticContextTest.php111Drupal\page_manager\Tests\StaticContextTest->testStaticContext()
Failed to set field region to bottomOtherStaticContextTest.php111Drupal\page_manager\Tests\StaticContextTest->testStaticContext()
Failed to set field context_mapping[entity] to static_node_2OtherStaticContextTest.php111Drupal\page_manager\Tests\StaticContextTest->testStaticContext()
Found the Add block buttonOtherStaticContextTest.php111Drupal\page_manager\Tests\StaticContextTest->testStaticContext()
Found the requested form fields at OtherStaticContextTest.php111Drupal\page_manager\Tests\StaticContextTest->testStaticContext()
"Static node 2 view" foundOtherStaticContextTest.php112Drupal\page_manager\Tests\StaticContextTest->testStaticContext()
"mmDI53DI" foundOtherStaticContextTest.php116Drupal\page_manager\Tests\StaticContextTest->testStaticContext()
"eNyUpX7mEt8NhlpalBKtp6STXvq1cYAV" foundOtherStaticContextTest.php117Drupal\page_manager\Tests\StaticContextTest->testStaticContext()
"txHe10rf" foundOtherStaticContextTest.php118Drupal\page_manager\Tests\StaticContextTest->testStaticContext()
"fjJvv1FzGTm8kGYhRLQa9TprysJ9iDUs" foundOtherStaticContextTest.php119Drupal\page_manager\Tests\StaticContextTest->testStaticContext()
"mmDI53DI" foundOtherStaticContextTest.php134Drupal\page_manager\Tests\StaticContextTest->testStaticContext()
"eNyUpX7mEt8NhlpalBKtp6STXvq1cYAV" foundOtherStaticContextTest.php135Drupal\page_manager\Tests\StaticContextTest->testStaticContext()
Link Edit does not exist on http://ec2-54-191-148-85.us-west-2.compute.amazonaws.com/checkout/admin/structure/page_manager/manage/static_node_contextBrowserStaticContextTest.php152Drupal\page_manager\Tests\StaticContextTest->testStaticContext()
"txHe10rf" foundOtherStaticContextTest.php161Drupal\page_manager\Tests\StaticContextTest->testStaticContext()
"fjJvv1FzGTm8kGYhRLQa9TprysJ9iDUs" foundOtherStaticContextTest.php162Drupal\page_manager\Tests\StaticContextTest->testStaticContext()
LeafDrupal\Tests\page_manager\Unit\BlockDisplayVariantTest600
LeafDrupal\Tests\page_manager\Unit\BlockPluginCollectionTest100
LeafDrupal\Tests\page_manager\Unit\BlockVariantTraitTest400
LeafDrupal\Tests\page_manager\Unit\CurrentUserContextTest100
LeafDrupal\Tests\page_manager\Unit\PageAccessTest600
ExpandDrupal\Tests\page_manager\Unit\PageExecutableTest310
MessageGroupFilenameLineFunctionStatus
Drupal\Tests\page_manager\Unit\PageExecutableTest::testSelectDisplayVariant Prophecy\Exception\Doubler\MethodNotFoundException: Method `Double\VariantInterface\P3::getVariant()` not found. /var/lib/drupaltestbot/sites/default/files/checkout/sites/default/modules/page_manager/src/PageExecutable.php:65 /var/lib/drupaltestbot/sites/default/files/checkout/sites/default/modules/page_manager/src/PageExecutable.php:65 /var/lib/drupaltestbot/sites/default/files/checkout/sites/default/modules/page_manager/tests/src/Unit/PageExecutableTest.php:77 OtherPageExecutableTest.php63Drupal\Tests\page_manager\Unit\PageExecutableTest->testSelectDisplayVariant()
LeafDrupal\Tests\page_manager\Unit\PageManagerRoutesTest300
LeafDrupal\Tests\page_manager\Unit\PageTest200
LeafDrupal\Tests\page_manager\Unit\RouteParamContextTest100
ExpandDrupal\Tests\page_manager\Unit\VariantAwareTraitTest020
MessageGroupFilenameLineFunctionStatus
Drupal\Tests\page_manager\Unit\VariantAwareTraitTest::testGetVariantsEmpty Undefined property: Drupal\Tests\page_manager\Unit\TestVariantAwareTrait::$variantCollection /var/lib/drupaltestbot/sites/default/files/checkout/sites/default/modules/page_manager/src/Plugin/VariantAwareTrait.php:49 /var/lib/drupaltestbot/sites/default/files/checkout/sites/default/modules/page_manager/tests/src/Unit/VariantAwareTraitTest.php:51 OtherVariantAwareTraitTest.php47Drupal\Tests\page_manager\Unit\VariantAwareTraitTest->testGetVariantsEmpty()
Drupal\Tests\page_manager\Unit\VariantAwareTraitTest::testGetVariants Undefined property: Drupal\Tests\page_manager\Unit\TestVariantAwareTrait::$variantCollection /var/lib/drupaltestbot/sites/default/files/checkout/sites/default/modules/page_manager/src/Plugin/VariantAwareTrait.php:49 /var/lib/drupaltestbot/sites/default/files/checkout/sites/default/modules/page_manager/tests/src/Unit/VariantAwareTraitTest.php:71 OtherVariantAwareTraitTest.php59Drupal\Tests\page_manager\Unit\VariantAwareTraitTest->testGetVariants()