features-export_role_using_name-1860826-3.patch

Test status
StatusResult
Last receivedFri, 08/14/2015 - 18:02:00
Last requestedFri, 08/14/2015 - 18:02:02
Last testedFri, 08/14/2015 - 18:04:08
Test count1
Environment status
MySQLfail
File information
Filefeatures-export_role_using_name-1860826-3.patch
BranchFeatures - 7.x-1.0
LinkIssue Link
SummaryFAILED: [[SimpleTest]]: [MySQL] 13 pass(es), 4 fail(s), and 3 exception(s).
Details

MySQL

  1. Setup environment
  2. Detect an invalid patch URL
  3. Detect invalid repository information
  4. Detect invalid patch format
  5. Detect a non-applicable patch
  6. Detect invalid PHP syntax
  7. Detect a Drupal installation failure
  8. Detect a test run failure
  9. Detect a failing test
    Review the test failures below then if necessary run them locally until the problem has been fixed.
  10. Complete test suite with all tests passing
13 pass(es), 4 fail(s), and 3 exception(s)

Non-pass

Test namePassFailException
ExpandComponent tests (FeaturesUserTestCase) [Features]1013
MessageGroupFilenameLineFunctionStatus
field present.Otherfeatures.test61FeaturesUserTestCase->test()
Undefined index: field_nameNoticefield.crud.inc555field_update_instance()
Undefined index: field_nameNoticefield.crud.inc557field_update_instance()
FieldException: Attempt to update an instance of a nonexistent field . in field_update_instance() (line 557 of /var/lib/drupaltestbot/sites/default/files/checkout/modules/field/field.crud.inc).Uncaught exceptionfield.crud.inc557field_update_instance()
ExpandFeatures Chaos Tools integration (FeaturesCtoolsIntegrationTest) [Features]320
MessageGroupFilenameLineFunctionStatus
Chaos tools functions for strongarm exist when it is enabled.Otherfeatures.test278FeaturesCtoolsIntegrationTest->testModuleEnable()
Chaos tools functions for views exist when it is enabled.Otherfeatures.test278FeaturesCtoolsIntegrationTest->testModuleEnable()
ExpandFeatures enable tests (FeaturesEnableTestCase) [Features]010
MessageGroupFilenameLineFunctionStatus
The test did not complete due to a fatal error.Completion checkfeatures.test192FeaturesEnableTestCase->testFeaturesGetComponents()

All

Test namePassFailException
ExpandComponent tests (FeaturesUserTestCase) [Features]1013
MessageGroupFilenameLineFunctionStatus
field present.Otherfeatures.test61FeaturesUserTestCase->test()
Undefined index: field_nameNoticefield.crud.inc555field_update_instance()
Undefined index: field_nameNoticefield.crud.inc557field_update_instance()
FieldException: Attempt to update an instance of a nonexistent field . in field_update_instance() (line 557 of /var/lib/drupaltestbot/sites/default/files/checkout/modules/field/field.crud.inc).Uncaught exceptionfield.crud.inc557field_update_instance()
ExpandFeatures Chaos Tools integration (FeaturesCtoolsIntegrationTest) [Features]320
MessageGroupFilenameLineFunctionStatus
Chaos tools functions for strongarm exist when it is enabled.Otherfeatures.test278FeaturesCtoolsIntegrationTest->testModuleEnable()
Chaos tools functions for views exist when it is enabled.Otherfeatures.test278FeaturesCtoolsIntegrationTest->testModuleEnable()
ExpandFeatures enable tests (FeaturesEnableTestCase) [Features]010
MessageGroupFilenameLineFunctionStatus
The test did not complete due to a fatal error.Completion checkfeatures.test192FeaturesEnableTestCase->testFeaturesGetComponents()