safe_delete_jobs-2549917-5-TEST-ONLY.patch

Test status
StatusResult
Last receivedFri, 08/14/2015 - 07:47:00
Last requestedFri, 08/14/2015 - 07:47:01
Last testedFri, 08/14/2015 - 07:50:17
Test count1
Environment status
PHP 5.5 MySQLfail
File information
Filesafe_delete_jobs-2549917-5-TEST-ONLY.patch
BranchTranslation Management Tool - 8.x-1.x
LinkIssue Link
SummaryFAILED: [[SimpleTest]]: [PHP 5.5 MySQL] 2,534 pass(es), 3 fail(s), and 0 exception(s).
Details

PHP 5.5 MySQL

  1. Setup environment
  2. Detect an invalid patch URL
  3. Detect invalid repository information
  4. Detect invalid patch format
  5. Detect a non-applicable patch
  6. Detect invalid PHP syntax
  7. Detect a Drupal installation failure
  8. Detect a test run failure
  9. Detect a failing test
    Review the test failures below then if necessary run them locally until the problem has been fixed.
  10. Complete test suite with all tests passing
2,534 pass(es), 3 fail(s), and 0 exception(s)

Non-pass

Test namePassFailException
ExpandDrupal\tmgmt\Tests\TranslatorUITest5830
MessageGroupFilenameLineFunctionStatus
HTTP response expected 200, actual 500BrowserTranslatorUITest.php77Drupal\tmgmt\Tests\TranslatorUITest->testDeleteJob()
"The translation job From English to ? has been deleted." foundOtherTranslatorUITest.php78Drupal\tmgmt\Tests\TranslatorUITest->testDeleteJob()
[14-Aug-2015 17:47:59 Australia/Sydney] Uncaught PHP Exception Drupal\Core\Entity\EntityStorageException: "The job has no translator assigned." at /var/lib/drupaltestbot/sites/default/files/checkout/core/lib/Drupal/Core/Entity/Sql/SqlContentEntityStorage.php line 703 Fatal errorUnknown0Unknown

All

Test namePassFailException
LeafDrupal\tmgmt\Tests\CrudTest19900
LeafDrupal\tmgmt\Tests\HelperTest4300
LeafDrupal\tmgmt\Tests\LocalTasksTests3100
LeafDrupal\tmgmt\Tests\PluginsTest5000
LeafDrupal\tmgmt\Tests\TMGMTCartTest5200
LeafDrupal\tmgmt\Tests\TMGMTUiTest58300
LeafDrupal\tmgmt\Tests\TranslatorTest7900
ExpandDrupal\tmgmt\Tests\TranslatorUITest5830
MessageGroupFilenameLineFunctionStatus
HTTP response expected 200, actual 500BrowserTranslatorUITest.php77Drupal\tmgmt\Tests\TranslatorUITest->testDeleteJob()
"The translation job From English to ? has been deleted." foundOtherTranslatorUITest.php78Drupal\tmgmt\Tests\TranslatorUITest->testDeleteJob()
[14-Aug-2015 17:47:59 Australia/Sydney] Uncaught PHP Exception Drupal\Core\Entity\EntityStorageException: "The job has no translator assigned." at /var/lib/drupaltestbot/sites/default/files/checkout/core/lib/Drupal/Core/Entity/Sql/SqlContentEntityStorage.php line 703 Fatal errorUnknown0Unknown
LeafDrupal\tmgmt_config\Tests\ConfigSourceListTest24400
LeafDrupal\tmgmt_config\Tests\ConfigSourceUiTest23500
LeafDrupal\tmgmt_config\Tests\ConfigSourceUnitTest3900
LeafDrupal\tmgmt_content\Tests\ContentEntitySourceListTest15900
LeafDrupal\tmgmt_content\Tests\ContentEntitySourceUiTest27100
LeafDrupal\tmgmt_content\Tests\ContentEntitySourceUnitTest14600
LeafDrupal\tmgmt_content\Tests\ContentEntitySuggestionsTest2400
LeafDrupal\tmgmt_demo\Tests\TMGMTDemoTest4800
LeafDrupal\tmgmt_file\Tests\FileTranslatorTest16000
LeafDrupal\tmgmt_locale\Tests\LocaleSourceTest6300
LeafDrupal\tmgmt_locale\Tests\LocaleSourceUiTest5000