personalize-skip_inactive_campaigns-2533164-1.patch

Test status
StatusResult
Last receivedThu, 08/13/2015 - 20:13:00
Last requestedThu, 08/13/2015 - 20:13:02
Last testedThu, 08/13/2015 - 20:13:42
Test count1
Environment status
MySQLfail
File information
Filepersonalize-skip_inactive_campaigns-2533164-1.patch
BranchPersonalize - 7.x-1.0-rc14
LinkIssue Link
SummaryFAILED: [[SimpleTest]]: [MySQL] 85 pass(es), 163 fail(s), and 58 exception(s).
Details

MySQL

  1. Setup environment
  2. Detect an invalid patch URL
  3. Detect invalid repository information
  4. Detect invalid patch format
  5. Detect a non-applicable patch
  6. Detect invalid PHP syntax
  7. Detect a Drupal installation failure
  8. Detect a test run failure
  9. Detect a failing test
    Review the test failures below then if necessary run them locally until the problem has been fixed.
  10. Complete test suite with all tests passing
85 pass(es), 163 fail(s), and 58 exception(s)

Non-pass

Test namePassFailException
ExpandPersonalize Admin Settings Tests (PersonalizeAdminSettingsTest) [Personalize]212911
MessageGroupFilenameLineFunctionStatus
Enabled modules: ctools, personalize, personalize_testOtherpersonalize.test2942PersonalizeAdminSettingsTest->setUp()
Invalid permission administer personalize configuration.Rolepersonalize.test2949PersonalizeAdminSettingsTest->testConfigurationSettings()
Argument 1 passed to DrupalWebTestCase::drupalLogin() must be an instance of stdClass, boolean given, called in /var/lib/drupaltestbot/sites/default/files/checkout/sites/default/modules/personalize/tests/personalize.test on line 2950 and definedRecoverable errordrupal_web_test_case.php1252DrupalWebTestCase->drupalLogin()
Trying to get property of non-objectNoticedrupal_web_test_case.php1258DrupalWebTestCase->drupalLogin()
Trying to get property of non-objectNoticedrupal_web_test_case.php1259DrupalWebTestCase->drupalLogin()
Failed to set field name to Otherpersonalize.test2950PersonalizeAdminSettingsTest->testConfigurationSettings()
Failed to set field pass to Otherpersonalize.test2950PersonalizeAdminSettingsTest->testConfigurationSettings()
Found the requested form fields at userOtherpersonalize.test2950PersonalizeAdminSettingsTest->testConfigurationSettings()
Trying to get property of non-objectNoticedrupal_web_test_case.php1265DrupalWebTestCase->drupalLogin()
User successfully logged in.User loginpersonalize.test2950PersonalizeAdminSettingsTest->testConfigurationSettings()
Failed to set field personalize_local_caching_expiration to 60Otherpersonalize.test2956PersonalizeAdminSettingsTest->testConfigurationSettings()
Failed to set field personalize_local_caching_storage to localOtherpersonalize.test2956PersonalizeAdminSettingsTest->testConfigurationSettings()
Found the Save configuration buttonOtherpersonalize.test2956PersonalizeAdminSettingsTest->testConfigurationSettings()
Found the requested form fields at admin/config/content/personalizeOtherpersonalize.test2956PersonalizeAdminSettingsTest->testConfigurationSettings()
Undefined index: personalizeNoticepersonalize.test2960PersonalizeAdminSettingsTest->testConfigurationSettings()
Value 60 is equal to value NULL.Otherpersonalize.test2960PersonalizeAdminSettingsTest->testConfigurationSettings()
Failed to set field personalize_local_caching_expiration to 60Otherpersonalize.test2965PersonalizeAdminSettingsTest->testConfigurationSettings()
Failed to set field personalize_local_caching_storage to sessionOtherpersonalize.test2965PersonalizeAdminSettingsTest->testConfigurationSettings()
Found the Save configuration buttonOtherpersonalize.test2965PersonalizeAdminSettingsTest->testConfigurationSettings()
Found the requested form fields at admin/config/content/personalizeOtherpersonalize.test2965PersonalizeAdminSettingsTest->testConfigurationSettings()
Undefined index: personalizeNoticepersonalize.test2969PersonalizeAdminSettingsTest->testConfigurationSettings()
Value 'session' is equal to value NULL.Otherpersonalize.test2969PersonalizeAdminSettingsTest->testConfigurationSettings()
Failed to set field personalize_local_caching_expiration to 60Otherpersonalize.test2977PersonalizeAdminSettingsTest->testConfigurationSettings()
Failed to set field personalize_local_caching_storage to sessionOtherpersonalize.test2977PersonalizeAdminSettingsTest->testConfigurationSettings()
Failed to set field personalize_enable_debug_mode to 1Otherpersonalize.test2977PersonalizeAdminSettingsTest->testConfigurationSettings()
Found the Save configuration buttonOtherpersonalize.test2977PersonalizeAdminSettingsTest->testConfigurationSettings()
Found the requested form fields at admin/config/content/personalizeOtherpersonalize.test2977PersonalizeAdminSettingsTest->testConfigurationSettings()
Undefined index: personalizeNoticepersonalize.test2980PersonalizeAdminSettingsTest->testConfigurationSettings()
Value NULL is TRUE.Otherpersonalize.test2980PersonalizeAdminSettingsTest->testConfigurationSettings()
The test did not complete due to a fatal error.Completion checkpersonalize.test2986PersonalizeAdminSettingsTest->testCampaignContextAjaxCallbacks()
Enabled modules: ctools, personalize, personalize_testOtherpersonalize.test2942PersonalizeAdminSettingsTest->setUp()
Invalid permission manage personalized content.Rolepersonalize.test2987PersonalizeAdminSettingsTest->testCampaignContextAjaxCallbacks()
Argument 1 passed to DrupalWebTestCase::drupalLogin() must be an instance of stdClass, boolean given, called in /var/lib/drupaltestbot/sites/default/files/checkout/sites/default/modules/personalize/tests/personalize.test on line 2988 and definedRecoverable errordrupal_web_test_case.php1252DrupalWebTestCase->drupalLogin()
Trying to get property of non-objectNoticedrupal_web_test_case.php1258DrupalWebTestCase->drupalLogin()
Trying to get property of non-objectNoticedrupal_web_test_case.php1259DrupalWebTestCase->drupalLogin()
Failed to set field name to Otherpersonalize.test2988PersonalizeAdminSettingsTest->testCampaignContextAjaxCallbacks()
Failed to set field pass to Otherpersonalize.test2988PersonalizeAdminSettingsTest->testCampaignContextAjaxCallbacks()
Found the requested form fields at userOtherpersonalize.test2988PersonalizeAdminSettingsTest->testCampaignContextAjaxCallbacks()
Trying to get property of non-objectNoticedrupal_web_test_case.php1265DrupalWebTestCase->drupalLogin()
User successfully logged in.User loginpersonalize.test2988PersonalizeAdminSettingsTest->testCampaignContextAjaxCallbacks()
ExpandPersonalize Agent Admin Tests (PersonalizeAgentAdminTest) [Personalize]684
MessageGroupFilenameLineFunctionStatus
The test did not complete due to a fatal error.Completion checkpersonalize.test1905PersonalizeAgentAdminTest->testAgentCreate()
Enabled modules: ctools, personalize, personalize_testOtherpersonalize.test1899PersonalizeAgentAdminTest->setUp()
Invalid permission manage personalized content.Rolepersonalize.test1908PersonalizeAgentAdminTest->testAgentCreate()
Argument 1 passed to DrupalWebTestCase::drupalLogin() must be an instance of stdClass, boolean given, called in /var/lib/drupaltestbot/sites/default/files/checkout/sites/default/modules/personalize/tests/personalize.test on line 1909 and definedRecoverable errordrupal_web_test_case.php1252DrupalWebTestCase->drupalLogin()
Trying to get property of non-objectNoticedrupal_web_test_case.php1258DrupalWebTestCase->drupalLogin()
Trying to get property of non-objectNoticedrupal_web_test_case.php1259DrupalWebTestCase->drupalLogin()
Failed to set field name to Otherpersonalize.test1909PersonalizeAgentAdminTest->testAgentCreate()
Failed to set field pass to Otherpersonalize.test1909PersonalizeAgentAdminTest->testAgentCreate()
Found the requested form fields at userOtherpersonalize.test1909PersonalizeAgentAdminTest->testAgentCreate()
Trying to get property of non-objectNoticedrupal_web_test_case.php1265DrupalWebTestCase->drupalLogin()
User successfully logged in.User loginpersonalize.test1909PersonalizeAgentAdminTest->testAgentCreate()
"You don't have any agent types enabled." foundOtherpersonalize.test1913PersonalizeAgentAdminTest->testAgentCreate()
ExpandPersonalize Blocks tests (PersonalizeBlocksTest) [Personalize]5164
MessageGroupFilenameLineFunctionStatus
The test did not complete due to a fatal error.Completion checkpersonalize_blocks.test28PersonalizeBlocksTest->testCreatePersonalizeBlocks()
Enabled modules: personalize_test, personalize_blocks, contextual, personalize_blocks_testOtherpersonalize_blocks.test15PersonalizeBlocksTest->setUp()
Invalid permission manage personalized content.Rolepersonalize_blocks.test23PersonalizeBlocksTest->setUp()
Invalid permission personalize block test.Rolepersonalize_blocks.test23PersonalizeBlocksTest->setUp()
Argument 1 passed to DrupalWebTestCase::drupalLogin() must be an instance of stdClass, boolean given, called in /var/lib/drupaltestbot/sites/default/files/checkout/sites/default/modules/personalize/modules/personalize_blocks/test/personalize_blocks.test on line 25 and definedRecoverable errordrupal_web_test_case.php1252DrupalWebTestCase->drupalLogin()
Trying to get property of non-objectNoticedrupal_web_test_case.php1258DrupalWebTestCase->drupalLogin()
Trying to get property of non-objectNoticedrupal_web_test_case.php1259DrupalWebTestCase->drupalLogin()
Failed to set field name to Otherpersonalize_blocks.test25PersonalizeBlocksTest->setUp()
Failed to set field pass to Otherpersonalize_blocks.test25PersonalizeBlocksTest->setUp()
Found the requested form fields at userOtherpersonalize_blocks.test25PersonalizeBlocksTest->setUp()
Trying to get property of non-objectNoticedrupal_web_test_case.php1265DrupalWebTestCase->drupalLogin()
User successfully logged in.User loginpersonalize_blocks.test25PersonalizeBlocksTest->setUp()
Failed to set field title to Otherpersonalize_blocks.test345PersonalizeBlocksTest->createPersonalizeBlock()
Failed to set field blocks[0][option_label] to Otherpersonalize_blocks.test345PersonalizeBlocksTest->createPersonalizeBlock()
Failed to set field blocks[1][option_label] to Otherpersonalize_blocks.test345PersonalizeBlocksTest->createPersonalizeBlock()
Failed to set field blocks[0][block][bid] to Otherpersonalize_blocks.test345PersonalizeBlocksTest->createPersonalizeBlock()
Failed to set field blocks[1][block][bid] to Otherpersonalize_blocks.test345PersonalizeBlocksTest->createPersonalizeBlock()
Failed to set field agent_select to test-agentOtherpersonalize_blocks.test345PersonalizeBlocksTest->createPersonalizeBlock()
Found the Save buttonOtherpersonalize_blocks.test345PersonalizeBlocksTest->createPersonalizeBlock()
Found the requested form fields at admin/structure/personalize/variations/personalize-blocks/addOtherpersonalize_blocks.test345PersonalizeBlocksTest->createPersonalizeBlock()
ExpandPersonalize Elements Tests (PersonalizeElementsTest) [Personalize]314713
MessageGroupFilenameLineFunctionStatus
Enabled modules: personalize_elements, personalize_testOtherpersonalize_elements.test19PersonalizeElementsTest->setUp()
Invalid permission manage personalized content.Rolepersonalize_elements.test25PersonalizeElementsTest->testPersonalizeElementsPermissions()
Argument 1 passed to DrupalWebTestCase::drupalLogin() must be an instance of stdClass, boolean given, called in /var/lib/drupaltestbot/sites/default/files/checkout/sites/default/modules/personalize/modules/personalize_elements/tests/personalize_elements.test on line 26 and definedRecoverable errordrupal_web_test_case.php1252DrupalWebTestCase->drupalLogin()
Trying to get property of non-objectNoticedrupal_web_test_case.php1258DrupalWebTestCase->drupalLogin()
Trying to get property of non-objectNoticedrupal_web_test_case.php1259DrupalWebTestCase->drupalLogin()
Failed to set field name to Otherpersonalize_elements.test26PersonalizeElementsTest->testPersonalizeElementsPermissions()
Failed to set field pass to Otherpersonalize_elements.test26PersonalizeElementsTest->testPersonalizeElementsPermissions()
Found the requested form fields at userOtherpersonalize_elements.test26PersonalizeElementsTest->testPersonalizeElementsPermissions()
Trying to get property of non-objectNoticedrupal_web_test_case.php1265DrupalWebTestCase->drupalLogin()
User successfully logged in.User loginpersonalize_elements.test26PersonalizeElementsTest->testPersonalizeElementsPermissions()
Invalid permission manage personalized content.Rolepersonalize_elements.test45PersonalizeElementsTest->testPersonalizeElementsPermissions()
Invalid permission use advanced personalize elements features.Rolepersonalize_elements.test45PersonalizeElementsTest->testPersonalizeElementsPermissions()
Argument 1 passed to DrupalWebTestCase::drupalLogin() must be an instance of stdClass, boolean given, called in /var/lib/drupaltestbot/sites/default/files/checkout/sites/default/modules/personalize/modules/personalize_elements/tests/personalize_elements.test on line 46 and definedRecoverable errordrupal_web_test_case.php1252DrupalWebTestCase->drupalLogin()
Trying to get property of non-objectNoticedrupal_web_test_case.php1258DrupalWebTestCase->drupalLogin()
Trying to get property of non-objectNoticedrupal_web_test_case.php1259DrupalWebTestCase->drupalLogin()
Failed to set field name to Otherpersonalize_elements.test46PersonalizeElementsTest->testPersonalizeElementsPermissions()
Failed to set field pass to Otherpersonalize_elements.test46PersonalizeElementsTest->testPersonalizeElementsPermissions()
Found the requested form fields at userOtherpersonalize_elements.test46PersonalizeElementsTest->testPersonalizeElementsPermissions()
Trying to get property of non-objectNoticedrupal_web_test_case.php1265DrupalWebTestCase->drupalLogin()
User successfully logged in.User loginpersonalize_elements.test46PersonalizeElementsTest->testPersonalizeElementsPermissions()
HTTP response expected 200, actual 403Browserpersonalize_elements.test48PersonalizeElementsTest->testPersonalizeElementsPermissions()
Value false is TRUE.Otherpersonalize_elements.test59PersonalizeElementsTest->testPersonalizeElementsPermissions()
The test did not complete due to a fatal error.Completion checkpersonalize_elements.test65PersonalizeElementsTest->testPersonalizeElementsAdmin()
Enabled modules: personalize_elements, personalize_testOtherpersonalize_elements.test19PersonalizeElementsTest->setUp()
Invalid permission manage personalized content.Rolepersonalize_elements.test69PersonalizeElementsTest->testPersonalizeElementsAdmin()
Argument 1 passed to DrupalWebTestCase::drupalLogin() must be an instance of stdClass, boolean given, called in /var/lib/drupaltestbot/sites/default/files/checkout/sites/default/modules/personalize/modules/personalize_elements/tests/personalize_elements.test on line 70 and definedRecoverable errordrupal_web_test_case.php1252DrupalWebTestCase->drupalLogin()
Trying to get property of non-objectNoticedrupal_web_test_case.php1258DrupalWebTestCase->drupalLogin()
Trying to get property of non-objectNoticedrupal_web_test_case.php1259DrupalWebTestCase->drupalLogin()
Failed to set field name to Otherpersonalize_elements.test70PersonalizeElementsTest->testPersonalizeElementsAdmin()
Failed to set field pass to Otherpersonalize_elements.test70PersonalizeElementsTest->testPersonalizeElementsAdmin()
Found the requested form fields at userOtherpersonalize_elements.test70PersonalizeElementsTest->testPersonalizeElementsAdmin()
Trying to get property of non-objectNoticedrupal_web_test_case.php1265DrupalWebTestCase->drupalLogin()
User successfully logged in.User loginpersonalize_elements.test70PersonalizeElementsTest->testPersonalizeElementsAdmin()
Failed to set field agent_select to test-agentOtherpersonalize_elements.test77PersonalizeElementsTest->testPersonalizeElementsAdmin()
Failed to set field title to z4OOGlXBOtherpersonalize_elements.test77PersonalizeElementsTest->testPersonalizeElementsAdmin()
Failed to set field selector to #some-idOtherpersonalize_elements.test77PersonalizeElementsTest->testPersonalizeElementsAdmin()
Failed to set field add_control_option to Otherpersonalize_elements.test77PersonalizeElementsTest->testPersonalizeElementsAdmin()
Found the Save buttonOtherpersonalize_elements.test77PersonalizeElementsTest->testPersonalizeElementsAdmin()
Found the requested form fields at admin/structure/personalize/variations/personalize-elements/addOtherpersonalize_elements.test77PersonalizeElementsTest->testPersonalizeElementsAdmin()
"You must choose an operation" foundOtherpersonalize_elements.test78PersonalizeElementsTest->testPersonalizeElementsAdmin()
Use of undefined constant PERSONALIZE_CONTROL_OPTION_LABEL - assumed 'PERSONALIZE_CONTROL_OPTION_LABEL'Noticepersonalize_elements.test81PersonalizeElementsTest->testPersonalizeElementsAdmin()
Found field with name 'options[0][option_label]' and value 'PERSONALIZE_CONTROL_OPTION_LABEL'Browserpersonalize_elements.test81PersonalizeElementsTest->testPersonalizeElementsAdmin()
Failed to set field agent_select to test-agentOtherpersonalize_elements.test82PersonalizeElementsTest->testPersonalizeElementsAdmin()
Failed to set field title to z4OOGlXBOtherpersonalize_elements.test82PersonalizeElementsTest->testPersonalizeElementsAdmin()
Failed to set field selector to #some-idOtherpersonalize_elements.test82PersonalizeElementsTest->testPersonalizeElementsAdmin()
Failed to set field add_control_option to Otherpersonalize_elements.test82PersonalizeElementsTest->testPersonalizeElementsAdmin()
Failed to set field variation_type to editTextOtherpersonalize_elements.test82PersonalizeElementsTest->testPersonalizeElementsAdmin()
Found the Save buttonOtherpersonalize_elements.test82PersonalizeElementsTest->testPersonalizeElementsAdmin()
Found the requested form fields at admin/structure/personalize/variations/personalize-elements/addOtherpersonalize_elements.test82PersonalizeElementsTest->testPersonalizeElementsAdmin()
"You must have at least 2 variations for a content variation set." foundOtherpersonalize_elements.test83PersonalizeElementsTest->testPersonalizeElementsAdmin()
Failed to set field agent_select to test-agentOtherpersonalize_elements.test88PersonalizeElementsTest->testPersonalizeElementsAdmin()
Failed to set field title to z4OOGlXBOtherpersonalize_elements.test88PersonalizeElementsTest->testPersonalizeElementsAdmin()
Failed to set field selector to #some-idOtherpersonalize_elements.test88PersonalizeElementsTest->testPersonalizeElementsAdmin()
Failed to set field add_control_option to 1Otherpersonalize_elements.test88PersonalizeElementsTest->testPersonalizeElementsAdmin()
Failed to set field variation_type to editTextOtherpersonalize_elements.test88PersonalizeElementsTest->testPersonalizeElementsAdmin()
Failed to set field options[1][option_label] to first-optionOtherpersonalize_elements.test88PersonalizeElementsTest->testPersonalizeElementsAdmin()
Failed to set field options[1][personalize_elements_content] to text changesOtherpersonalize_elements.test88PersonalizeElementsTest->testPersonalizeElementsAdmin()
Found the Save buttonOtherpersonalize_elements.test88PersonalizeElementsTest->testPersonalizeElementsAdmin()
Found the requested form fields at Otherpersonalize_elements.test88PersonalizeElementsTest->testPersonalizeElementsAdmin()
"The variation set was saved." foundOtherpersonalize_elements.test90PersonalizeElementsTest->testPersonalizeElementsAdmin()
ExpandPersonalize Fields Field Collection Tests (PersonalizeFieldsCollectionTest) [Personalize]61210
MessageGroupFilenameLineFunctionStatus
Enabled modules: personalize, personalize_fields, personalize_test, field_collectionOtherpersonalize_collection_fields.test19PersonalizeFieldsCollectionTest->setUp()
Invalid permission manage personalized content.Rolepersonalize_collection_fields.test28PersonalizeFieldsCollectionTest->setUp()
Argument 1 passed to DrupalWebTestCase::drupalLogin() must be an instance of stdClass, boolean given, called in /var/lib/drupaltestbot/sites/default/files/checkout/sites/default/modules/personalize/modules/personalize_fields/tests/personalize_collection_fields.test on line 32 and definedRecoverable errordrupal_web_test_case.php1252DrupalWebTestCase->drupalLogin()
Trying to get property of non-objectNoticedrupal_web_test_case.php1258DrupalWebTestCase->drupalLogin()
Trying to get property of non-objectNoticedrupal_web_test_case.php1259DrupalWebTestCase->drupalLogin()
Failed to set field name to Otherpersonalize_collection_fields.test32PersonalizeFieldsCollectionTest->testFieldCollection()
Failed to set field pass to Otherpersonalize_collection_fields.test32PersonalizeFieldsCollectionTest->testFieldCollection()
Found the requested form fields at userOtherpersonalize_collection_fields.test32PersonalizeFieldsCollectionTest->testFieldCollection()
Trying to get property of non-objectNoticedrupal_web_test_case.php1265DrupalWebTestCase->drupalLogin()
User successfully logged in.User loginpersonalize_collection_fields.test32PersonalizeFieldsCollectionTest->testFieldCollection()
FieldException: Attempt to create a field of unknown type <em class="placeholder">field_collection</em>. in field_create_field() (line 110 of /var/lib/drupaltestbot/sites/default/files/checkout/modules/field/field.crud.inc).Uncaught exceptionfield.crud.inc110field_create_field()
Enabled modules: personalize, personalize_fields, personalize_test, field_collectionOtherpersonalize_collection_fields.test19PersonalizeFieldsCollectionTest->setUp()
Invalid permission manage personalized content.Rolepersonalize_collection_fields.test28PersonalizeFieldsCollectionTest->setUp()
Argument 1 passed to DrupalWebTestCase::drupalLogin() must be an instance of stdClass, boolean given, called in /var/lib/drupaltestbot/sites/default/files/checkout/sites/default/modules/personalize/modules/personalize_fields/tests/personalize_collection_fields.test on line 142 and definedRecoverable errordrupal_web_test_case.php1252DrupalWebTestCase->drupalLogin()
Trying to get property of non-objectNoticedrupal_web_test_case.php1258DrupalWebTestCase->drupalLogin()
Trying to get property of non-objectNoticedrupal_web_test_case.php1259DrupalWebTestCase->drupalLogin()
Failed to set field name to Otherpersonalize_collection_fields.test142PersonalizeFieldsCollectionTest->testMultiValueFieldCollection()
Failed to set field pass to Otherpersonalize_collection_fields.test142PersonalizeFieldsCollectionTest->testMultiValueFieldCollection()
Found the requested form fields at userOtherpersonalize_collection_fields.test142PersonalizeFieldsCollectionTest->testMultiValueFieldCollection()
Trying to get property of non-objectNoticedrupal_web_test_case.php1265DrupalWebTestCase->drupalLogin()
User successfully logged in.User loginpersonalize_collection_fields.test142PersonalizeFieldsCollectionTest->testMultiValueFieldCollection()
FieldException: Attempt to create a field of unknown type <em class="placeholder">field_collection</em>. in field_create_field() (line 110 of /var/lib/drupaltestbot/sites/default/files/checkout/modules/field/field.crud.inc).Uncaught exceptionfield.crud.inc110field_create_field()
ExpandPersonalize Fields Tests (PersonalizeFieldsTest) [Personalize]020
MessageGroupFilenameLineFunctionStatus
The test did not complete due to a fatal error.Completion checkpersonalize_fields.test25PersonalizeFieldsTest->testPersonalizeFieldsConfig()
Enabled modules: personalize_fields, personalize_testOtherpersonalize_fields.test19PersonalizeFieldsTest->setUp()
ExpandPersonalize Fundamentals (PersonalizeFundamentalsTest) [Personalize]020
MessageGroupFilenameLineFunctionStatus
The test did not complete due to a fatal error.Completion checkpersonalize.test1104PersonalizeFundamentalsTest->testAgentMachineNameGeneration()
Enabled modules: ctools, personalizeOtherpersonalize.test1098PersonalizeFundamentalsTest->setUp()
ExpandPersonalize Goal Administration (PersonalizeGoalAdminTest) [Personalize]374
MessageGroupFilenameLineFunctionStatus
The test did not complete due to a fatal error.Completion checkpersonalize.test2519PersonalizeGoalAdminTest->testAgentGoalEdit()
Enabled modules: ctools, personalize, personalize_testOtherpersonalize.test2513PersonalizeGoalAdminTest->setUp()
Invalid permission manage personalized content.Rolepersonalize.test2525PersonalizeGoalAdminTest->testAgentGoalEdit()
Argument 1 passed to DrupalWebTestCase::drupalLogin() must be an instance of stdClass, boolean given, called in /var/lib/drupaltestbot/sites/default/files/checkout/sites/default/modules/personalize/tests/personalize.test on line 2526 and definedRecoverable errordrupal_web_test_case.php1252DrupalWebTestCase->drupalLogin()
Trying to get property of non-objectNoticedrupal_web_test_case.php1258DrupalWebTestCase->drupalLogin()
Trying to get property of non-objectNoticedrupal_web_test_case.php1259DrupalWebTestCase->drupalLogin()
Failed to set field name to Otherpersonalize.test2526PersonalizeGoalAdminTest->testAgentGoalEdit()
Failed to set field pass to Otherpersonalize.test2526PersonalizeGoalAdminTest->testAgentGoalEdit()
Found the requested form fields at userOtherpersonalize.test2526PersonalizeGoalAdminTest->testAgentGoalEdit()
Trying to get property of non-objectNoticedrupal_web_test_case.php1265DrupalWebTestCase->drupalLogin()
User successfully logged in.User loginpersonalize.test2526PersonalizeGoalAdminTest->testAgentGoalEdit()
ExpandPersonalize MVT admin Tests (PersonalizeMVTAdminTest) [Personalize]374
MessageGroupFilenameLineFunctionStatus
The test did not complete due to a fatal error.Completion checkpersonalize.test2786PersonalizeMVTAdminTest->testMVTForms()
Enabled modules: ctools, personalize, personalize_testOtherpersonalize.test2780PersonalizeMVTAdminTest->setUp()
Invalid permission manage personalized content.Rolepersonalize.test2787PersonalizeMVTAdminTest->testMVTForms()
Argument 1 passed to DrupalWebTestCase::drupalLogin() must be an instance of stdClass, boolean given, called in /var/lib/drupaltestbot/sites/default/files/checkout/sites/default/modules/personalize/tests/personalize.test on line 2788 and definedRecoverable errordrupal_web_test_case.php1252DrupalWebTestCase->drupalLogin()
Trying to get property of non-objectNoticedrupal_web_test_case.php1258DrupalWebTestCase->drupalLogin()
Trying to get property of non-objectNoticedrupal_web_test_case.php1259DrupalWebTestCase->drupalLogin()
Failed to set field name to Otherpersonalize.test2788PersonalizeMVTAdminTest->testMVTForms()
Failed to set field pass to Otherpersonalize.test2788PersonalizeMVTAdminTest->testMVTForms()
Found the requested form fields at userOtherpersonalize.test2788PersonalizeMVTAdminTest->testMVTForms()
Trying to get property of non-objectNoticedrupal_web_test_case.php1265DrupalWebTestCase->drupalLogin()
User successfully logged in.User loginpersonalize.test2788PersonalizeMVTAdminTest->testMVTForms()
ExpandPersonalize Option Set Tests (PersonalizeOptionSetTest) [Personalize]374
MessageGroupFilenameLineFunctionStatus
The test did not complete due to a fatal error.Completion checkpersonalize.test1241PersonalizeOptionSetTest->testWinningOption()
Enabled modules: ctools, personalize, personalize_test, personalize_blocksOtherpersonalize.test1234PersonalizeOptionSetTest->setUp()
Invalid permission manage personalized content.Rolepersonalize.test1242PersonalizeOptionSetTest->testWinningOption()
Argument 1 passed to DrupalWebTestCase::drupalLogin() must be an instance of stdClass, boolean given, called in /var/lib/drupaltestbot/sites/default/files/checkout/sites/default/modules/personalize/tests/personalize.test on line 1243 and definedRecoverable errordrupal_web_test_case.php1252DrupalWebTestCase->drupalLogin()
Trying to get property of non-objectNoticedrupal_web_test_case.php1258DrupalWebTestCase->drupalLogin()
Trying to get property of non-objectNoticedrupal_web_test_case.php1259DrupalWebTestCase->drupalLogin()
Failed to set field name to Otherpersonalize.test1243PersonalizeOptionSetTest->testWinningOption()
Failed to set field pass to Otherpersonalize.test1243PersonalizeOptionSetTest->testWinningOption()
Found the requested form fields at userOtherpersonalize.test1243PersonalizeOptionSetTest->testWinningOption()
Trying to get property of non-objectNoticedrupal_web_test_case.php1265DrupalWebTestCase->drupalLogin()
User successfully logged in.User loginpersonalize.test1243PersonalizeOptionSetTest->testWinningOption()
ExpandPersonalize Taxonomy Context Tests (PersonalizeTaxonomyContextTest) [Personalize]030
MessageGroupFilenameLineFunctionStatus
Enabled modules: ctools, personalize, personalize_test, personalize_taxonomy_contextOtherpersonalize_taxonomy_context.test20PersonalizeTaxonomyContextTest->setUp()
Invalid permission administer personalize configuration.Rolepersonalize_taxonomy_context.test21PersonalizeTaxonomyContextTest->setUp()
Invalid permission manage personalized content.Rolepersonalize_taxonomy_context.test21PersonalizeTaxonomyContextTest->setUp()
ExpandPersonalize Tests (PersonalizeTest) [Personalize]040
MessageGroupFilenameLineFunctionStatus
Enabled modules: ctools, personalize, personalize_test, personalize_blocksOtherpersonalize.test338PersonalizeTest->setUp()
The test did not complete due to a fatal error.Completion checkpersonalize.test357PersonalizeTest->testPersonalizePage()
Enabled modules: ctools, personalize, personalize_test, personalize_blocksOtherpersonalize.test338PersonalizeTest->setUp()
Call to undefined function personalize_agent_set_status()PHP Fatal errorpersonalize.test359Unknown
ExpandPersonalize URL Context Tests (PersonalizeUrlContextTest) [Personalize]7194
MessageGroupFilenameLineFunctionStatus
The test did not complete due to a fatal error.Completion checkpersonalize_url_context.test26PersonalizeUrlContextTest->testQuerystringConfiguration()
Enabled modules: ctools, personalize, personalize_test, personalize_url_contextOtherpersonalize_url_context.test22PersonalizeUrlContextTest->setUp()
Invalid permission administer personalize configuration.Rolepersonalize_url_context.test23PersonalizeUrlContextTest->setUp()
Invalid permission manage personalized content.Rolepersonalize_url_context.test23PersonalizeUrlContextTest->setUp()
Argument 1 passed to DrupalWebTestCase::drupalLogin() must be an instance of stdClass, boolean given, called in /var/lib/drupaltestbot/sites/default/files/checkout/sites/default/modules/personalize/modules/personalize_url_context/tests/personalize_url_context.test on line 27 and definedRecoverable errordrupal_web_test_case.php1252DrupalWebTestCase->drupalLogin()
Trying to get property of non-objectNoticedrupal_web_test_case.php1258DrupalWebTestCase->drupalLogin()
Trying to get property of non-objectNoticedrupal_web_test_case.php1259DrupalWebTestCase->drupalLogin()
Failed to set field name to Otherpersonalize_url_context.test27PersonalizeUrlContextTest->testQuerystringConfiguration()
Failed to set field pass to Otherpersonalize_url_context.test27PersonalizeUrlContextTest->testQuerystringConfiguration()
Found the requested form fields at userOtherpersonalize_url_context.test27PersonalizeUrlContextTest->testQuerystringConfiguration()
Trying to get property of non-objectNoticedrupal_web_test_case.php1265DrupalWebTestCase->drupalLogin()
User successfully logged in.User loginpersonalize_url_context.test27PersonalizeUrlContextTest->testQuerystringConfiguration()
Found the Save buttonOtherpersonalize_url_context.test29PersonalizeUrlContextTest->testQuerystringConfiguration()
Found the requested form fields at admin/config/content/personalize/browser_contextOtherpersonalize_url_context.test29PersonalizeUrlContextTest->testQuerystringConfiguration()
Value array ( 0 => 'utm_campaign', 1 => 'utm_source', 2 => 'utm_medium', 3 => 'utm_content', 4 => 'utm_term', ) is equal to value array ( ).Otherpersonalize_url_context.test38PersonalizeUrlContextTest->testQuerystringConfiguration()
Failed to set field querystring_contexts to some-paramOtherpersonalize_url_context.test39PersonalizeUrlContextTest->testQuerystringConfiguration()
Found the Save buttonOtherpersonalize_url_context.test39PersonalizeUrlContextTest->testQuerystringConfiguration()
Found the requested form fields at admin/config/content/personalize/browser_contextOtherpersonalize_url_context.test39PersonalizeUrlContextTest->testQuerystringConfiguration()
Value array ( 0 => 'some-param', ) is equal to value array ( ).Otherpersonalize_url_context.test44PersonalizeUrlContextTest->testQuerystringConfiguration()
Failed to set field querystring_contexts to some-param param2 param3Otherpersonalize_url_context.test50PersonalizeUrlContextTest->testQuerystringConfiguration()
Found the Save buttonOtherpersonalize_url_context.test50PersonalizeUrlContextTest->testQuerystringConfiguration()
Found the requested form fields at Otherpersonalize_url_context.test50PersonalizeUrlContextTest->testQuerystringConfiguration()
Value array ( 0 => 'some-param', 1 => 'param2', 2 => 'param3', ) is equal to value array ( ).Otherpersonalize_url_context.test53PersonalizeUrlContextTest->testQuerystringConfiguration()

All

Test namePassFailException
ExpandPersonalize Admin Settings Tests (PersonalizeAdminSettingsTest) [Personalize]212911
MessageGroupFilenameLineFunctionStatus
Enabled modules: ctools, personalize, personalize_testOtherpersonalize.test2942PersonalizeAdminSettingsTest->setUp()
Invalid permission administer personalize configuration.Rolepersonalize.test2949PersonalizeAdminSettingsTest->testConfigurationSettings()
Argument 1 passed to DrupalWebTestCase::drupalLogin() must be an instance of stdClass, boolean given, called in /var/lib/drupaltestbot/sites/default/files/checkout/sites/default/modules/personalize/tests/personalize.test on line 2950 and definedRecoverable errordrupal_web_test_case.php1252DrupalWebTestCase->drupalLogin()
Trying to get property of non-objectNoticedrupal_web_test_case.php1258DrupalWebTestCase->drupalLogin()
Trying to get property of non-objectNoticedrupal_web_test_case.php1259DrupalWebTestCase->drupalLogin()
Failed to set field name to Otherpersonalize.test2950PersonalizeAdminSettingsTest->testConfigurationSettings()
Failed to set field pass to Otherpersonalize.test2950PersonalizeAdminSettingsTest->testConfigurationSettings()
Found the requested form fields at userOtherpersonalize.test2950PersonalizeAdminSettingsTest->testConfigurationSettings()
Trying to get property of non-objectNoticedrupal_web_test_case.php1265DrupalWebTestCase->drupalLogin()
User successfully logged in.User loginpersonalize.test2950PersonalizeAdminSettingsTest->testConfigurationSettings()
Failed to set field personalize_local_caching_expiration to 60Otherpersonalize.test2956PersonalizeAdminSettingsTest->testConfigurationSettings()
Failed to set field personalize_local_caching_storage to localOtherpersonalize.test2956PersonalizeAdminSettingsTest->testConfigurationSettings()
Found the Save configuration buttonOtherpersonalize.test2956PersonalizeAdminSettingsTest->testConfigurationSettings()
Found the requested form fields at admin/config/content/personalizeOtherpersonalize.test2956PersonalizeAdminSettingsTest->testConfigurationSettings()
Undefined index: personalizeNoticepersonalize.test2960PersonalizeAdminSettingsTest->testConfigurationSettings()
Value 60 is equal to value NULL.Otherpersonalize.test2960PersonalizeAdminSettingsTest->testConfigurationSettings()
Failed to set field personalize_local_caching_expiration to 60Otherpersonalize.test2965PersonalizeAdminSettingsTest->testConfigurationSettings()
Failed to set field personalize_local_caching_storage to sessionOtherpersonalize.test2965PersonalizeAdminSettingsTest->testConfigurationSettings()
Found the Save configuration buttonOtherpersonalize.test2965PersonalizeAdminSettingsTest->testConfigurationSettings()
Found the requested form fields at admin/config/content/personalizeOtherpersonalize.test2965PersonalizeAdminSettingsTest->testConfigurationSettings()
Undefined index: personalizeNoticepersonalize.test2969PersonalizeAdminSettingsTest->testConfigurationSettings()
Value 'session' is equal to value NULL.Otherpersonalize.test2969PersonalizeAdminSettingsTest->testConfigurationSettings()
Failed to set field personalize_local_caching_expiration to 60Otherpersonalize.test2977PersonalizeAdminSettingsTest->testConfigurationSettings()
Failed to set field personalize_local_caching_storage to sessionOtherpersonalize.test2977PersonalizeAdminSettingsTest->testConfigurationSettings()
Failed to set field personalize_enable_debug_mode to 1Otherpersonalize.test2977PersonalizeAdminSettingsTest->testConfigurationSettings()
Found the Save configuration buttonOtherpersonalize.test2977PersonalizeAdminSettingsTest->testConfigurationSettings()
Found the requested form fields at admin/config/content/personalizeOtherpersonalize.test2977PersonalizeAdminSettingsTest->testConfigurationSettings()
Undefined index: personalizeNoticepersonalize.test2980PersonalizeAdminSettingsTest->testConfigurationSettings()
Value NULL is TRUE.Otherpersonalize.test2980PersonalizeAdminSettingsTest->testConfigurationSettings()
The test did not complete due to a fatal error.Completion checkpersonalize.test2986PersonalizeAdminSettingsTest->testCampaignContextAjaxCallbacks()
Enabled modules: ctools, personalize, personalize_testOtherpersonalize.test2942PersonalizeAdminSettingsTest->setUp()
Invalid permission manage personalized content.Rolepersonalize.test2987PersonalizeAdminSettingsTest->testCampaignContextAjaxCallbacks()
Argument 1 passed to DrupalWebTestCase::drupalLogin() must be an instance of stdClass, boolean given, called in /var/lib/drupaltestbot/sites/default/files/checkout/sites/default/modules/personalize/tests/personalize.test on line 2988 and definedRecoverable errordrupal_web_test_case.php1252DrupalWebTestCase->drupalLogin()
Trying to get property of non-objectNoticedrupal_web_test_case.php1258DrupalWebTestCase->drupalLogin()
Trying to get property of non-objectNoticedrupal_web_test_case.php1259DrupalWebTestCase->drupalLogin()
Failed to set field name to Otherpersonalize.test2988PersonalizeAdminSettingsTest->testCampaignContextAjaxCallbacks()
Failed to set field pass to Otherpersonalize.test2988PersonalizeAdminSettingsTest->testCampaignContextAjaxCallbacks()
Found the requested form fields at userOtherpersonalize.test2988PersonalizeAdminSettingsTest->testCampaignContextAjaxCallbacks()
Trying to get property of non-objectNoticedrupal_web_test_case.php1265DrupalWebTestCase->drupalLogin()
User successfully logged in.User loginpersonalize.test2988PersonalizeAdminSettingsTest->testCampaignContextAjaxCallbacks()
ExpandPersonalize Agent Admin Tests (PersonalizeAgentAdminTest) [Personalize]684
MessageGroupFilenameLineFunctionStatus
The test did not complete due to a fatal error.Completion checkpersonalize.test1905PersonalizeAgentAdminTest->testAgentCreate()
Enabled modules: ctools, personalize, personalize_testOtherpersonalize.test1899PersonalizeAgentAdminTest->setUp()
Invalid permission manage personalized content.Rolepersonalize.test1908PersonalizeAgentAdminTest->testAgentCreate()
Argument 1 passed to DrupalWebTestCase::drupalLogin() must be an instance of stdClass, boolean given, called in /var/lib/drupaltestbot/sites/default/files/checkout/sites/default/modules/personalize/tests/personalize.test on line 1909 and definedRecoverable errordrupal_web_test_case.php1252DrupalWebTestCase->drupalLogin()
Trying to get property of non-objectNoticedrupal_web_test_case.php1258DrupalWebTestCase->drupalLogin()
Trying to get property of non-objectNoticedrupal_web_test_case.php1259DrupalWebTestCase->drupalLogin()
Failed to set field name to Otherpersonalize.test1909PersonalizeAgentAdminTest->testAgentCreate()
Failed to set field pass to Otherpersonalize.test1909PersonalizeAgentAdminTest->testAgentCreate()
Found the requested form fields at userOtherpersonalize.test1909PersonalizeAgentAdminTest->testAgentCreate()
Trying to get property of non-objectNoticedrupal_web_test_case.php1265DrupalWebTestCase->drupalLogin()
User successfully logged in.User loginpersonalize.test1909PersonalizeAgentAdminTest->testAgentCreate()
"You don't have any agent types enabled." foundOtherpersonalize.test1913PersonalizeAgentAdminTest->testAgentCreate()
ExpandPersonalize Blocks tests (PersonalizeBlocksTest) [Personalize]5164
MessageGroupFilenameLineFunctionStatus
The test did not complete due to a fatal error.Completion checkpersonalize_blocks.test28PersonalizeBlocksTest->testCreatePersonalizeBlocks()
Enabled modules: personalize_test, personalize_blocks, contextual, personalize_blocks_testOtherpersonalize_blocks.test15PersonalizeBlocksTest->setUp()
Invalid permission manage personalized content.Rolepersonalize_blocks.test23PersonalizeBlocksTest->setUp()
Invalid permission personalize block test.Rolepersonalize_blocks.test23PersonalizeBlocksTest->setUp()
Argument 1 passed to DrupalWebTestCase::drupalLogin() must be an instance of stdClass, boolean given, called in /var/lib/drupaltestbot/sites/default/files/checkout/sites/default/modules/personalize/modules/personalize_blocks/test/personalize_blocks.test on line 25 and definedRecoverable errordrupal_web_test_case.php1252DrupalWebTestCase->drupalLogin()
Trying to get property of non-objectNoticedrupal_web_test_case.php1258DrupalWebTestCase->drupalLogin()
Trying to get property of non-objectNoticedrupal_web_test_case.php1259DrupalWebTestCase->drupalLogin()
Failed to set field name to Otherpersonalize_blocks.test25PersonalizeBlocksTest->setUp()
Failed to set field pass to Otherpersonalize_blocks.test25PersonalizeBlocksTest->setUp()
Found the requested form fields at userOtherpersonalize_blocks.test25PersonalizeBlocksTest->setUp()
Trying to get property of non-objectNoticedrupal_web_test_case.php1265DrupalWebTestCase->drupalLogin()
User successfully logged in.User loginpersonalize_blocks.test25PersonalizeBlocksTest->setUp()
Failed to set field title to Otherpersonalize_blocks.test345PersonalizeBlocksTest->createPersonalizeBlock()
Failed to set field blocks[0][option_label] to Otherpersonalize_blocks.test345PersonalizeBlocksTest->createPersonalizeBlock()
Failed to set field blocks[1][option_label] to Otherpersonalize_blocks.test345PersonalizeBlocksTest->createPersonalizeBlock()
Failed to set field blocks[0][block][bid] to Otherpersonalize_blocks.test345PersonalizeBlocksTest->createPersonalizeBlock()
Failed to set field blocks[1][block][bid] to Otherpersonalize_blocks.test345PersonalizeBlocksTest->createPersonalizeBlock()
Failed to set field agent_select to test-agentOtherpersonalize_blocks.test345PersonalizeBlocksTest->createPersonalizeBlock()
Found the Save buttonOtherpersonalize_blocks.test345PersonalizeBlocksTest->createPersonalizeBlock()
Found the requested form fields at admin/structure/personalize/variations/personalize-blocks/addOtherpersonalize_blocks.test345PersonalizeBlocksTest->createPersonalizeBlock()
ExpandPersonalize Elements Tests (PersonalizeElementsTest) [Personalize]314713
MessageGroupFilenameLineFunctionStatus
Enabled modules: personalize_elements, personalize_testOtherpersonalize_elements.test19PersonalizeElementsTest->setUp()
Invalid permission manage personalized content.Rolepersonalize_elements.test25PersonalizeElementsTest->testPersonalizeElementsPermissions()
Argument 1 passed to DrupalWebTestCase::drupalLogin() must be an instance of stdClass, boolean given, called in /var/lib/drupaltestbot/sites/default/files/checkout/sites/default/modules/personalize/modules/personalize_elements/tests/personalize_elements.test on line 26 and definedRecoverable errordrupal_web_test_case.php1252DrupalWebTestCase->drupalLogin()
Trying to get property of non-objectNoticedrupal_web_test_case.php1258DrupalWebTestCase->drupalLogin()
Trying to get property of non-objectNoticedrupal_web_test_case.php1259DrupalWebTestCase->drupalLogin()
Failed to set field name to Otherpersonalize_elements.test26PersonalizeElementsTest->testPersonalizeElementsPermissions()
Failed to set field pass to Otherpersonalize_elements.test26PersonalizeElementsTest->testPersonalizeElementsPermissions()
Found the requested form fields at userOtherpersonalize_elements.test26PersonalizeElementsTest->testPersonalizeElementsPermissions()
Trying to get property of non-objectNoticedrupal_web_test_case.php1265DrupalWebTestCase->drupalLogin()
User successfully logged in.User loginpersonalize_elements.test26PersonalizeElementsTest->testPersonalizeElementsPermissions()
Invalid permission manage personalized content.Rolepersonalize_elements.test45PersonalizeElementsTest->testPersonalizeElementsPermissions()
Invalid permission use advanced personalize elements features.Rolepersonalize_elements.test45PersonalizeElementsTest->testPersonalizeElementsPermissions()
Argument 1 passed to DrupalWebTestCase::drupalLogin() must be an instance of stdClass, boolean given, called in /var/lib/drupaltestbot/sites/default/files/checkout/sites/default/modules/personalize/modules/personalize_elements/tests/personalize_elements.test on line 46 and definedRecoverable errordrupal_web_test_case.php1252DrupalWebTestCase->drupalLogin()
Trying to get property of non-objectNoticedrupal_web_test_case.php1258DrupalWebTestCase->drupalLogin()
Trying to get property of non-objectNoticedrupal_web_test_case.php1259DrupalWebTestCase->drupalLogin()
Failed to set field name to Otherpersonalize_elements.test46PersonalizeElementsTest->testPersonalizeElementsPermissions()
Failed to set field pass to Otherpersonalize_elements.test46PersonalizeElementsTest->testPersonalizeElementsPermissions()
Found the requested form fields at userOtherpersonalize_elements.test46PersonalizeElementsTest->testPersonalizeElementsPermissions()
Trying to get property of non-objectNoticedrupal_web_test_case.php1265DrupalWebTestCase->drupalLogin()
User successfully logged in.User loginpersonalize_elements.test46PersonalizeElementsTest->testPersonalizeElementsPermissions()
HTTP response expected 200, actual 403Browserpersonalize_elements.test48PersonalizeElementsTest->testPersonalizeElementsPermissions()
Value false is TRUE.Otherpersonalize_elements.test59PersonalizeElementsTest->testPersonalizeElementsPermissions()
The test did not complete due to a fatal error.Completion checkpersonalize_elements.test65PersonalizeElementsTest->testPersonalizeElementsAdmin()
Enabled modules: personalize_elements, personalize_testOtherpersonalize_elements.test19PersonalizeElementsTest->setUp()
Invalid permission manage personalized content.Rolepersonalize_elements.test69PersonalizeElementsTest->testPersonalizeElementsAdmin()
Argument 1 passed to DrupalWebTestCase::drupalLogin() must be an instance of stdClass, boolean given, called in /var/lib/drupaltestbot/sites/default/files/checkout/sites/default/modules/personalize/modules/personalize_elements/tests/personalize_elements.test on line 70 and definedRecoverable errordrupal_web_test_case.php1252DrupalWebTestCase->drupalLogin()
Trying to get property of non-objectNoticedrupal_web_test_case.php1258DrupalWebTestCase->drupalLogin()
Trying to get property of non-objectNoticedrupal_web_test_case.php1259DrupalWebTestCase->drupalLogin()
Failed to set field name to Otherpersonalize_elements.test70PersonalizeElementsTest->testPersonalizeElementsAdmin()
Failed to set field pass to Otherpersonalize_elements.test70PersonalizeElementsTest->testPersonalizeElementsAdmin()
Found the requested form fields at userOtherpersonalize_elements.test70PersonalizeElementsTest->testPersonalizeElementsAdmin()
Trying to get property of non-objectNoticedrupal_web_test_case.php1265DrupalWebTestCase->drupalLogin()
User successfully logged in.User loginpersonalize_elements.test70PersonalizeElementsTest->testPersonalizeElementsAdmin()
Failed to set field agent_select to test-agentOtherpersonalize_elements.test77PersonalizeElementsTest->testPersonalizeElementsAdmin()
Failed to set field title to z4OOGlXBOtherpersonalize_elements.test77PersonalizeElementsTest->testPersonalizeElementsAdmin()
Failed to set field selector to #some-idOtherpersonalize_elements.test77PersonalizeElementsTest->testPersonalizeElementsAdmin()
Failed to set field add_control_option to Otherpersonalize_elements.test77PersonalizeElementsTest->testPersonalizeElementsAdmin()
Found the Save buttonOtherpersonalize_elements.test77PersonalizeElementsTest->testPersonalizeElementsAdmin()
Found the requested form fields at admin/structure/personalize/variations/personalize-elements/addOtherpersonalize_elements.test77PersonalizeElementsTest->testPersonalizeElementsAdmin()
"You must choose an operation" foundOtherpersonalize_elements.test78PersonalizeElementsTest->testPersonalizeElementsAdmin()
Use of undefined constant PERSONALIZE_CONTROL_OPTION_LABEL - assumed 'PERSONALIZE_CONTROL_OPTION_LABEL'Noticepersonalize_elements.test81PersonalizeElementsTest->testPersonalizeElementsAdmin()
Found field with name 'options[0][option_label]' and value 'PERSONALIZE_CONTROL_OPTION_LABEL'Browserpersonalize_elements.test81PersonalizeElementsTest->testPersonalizeElementsAdmin()
Failed to set field agent_select to test-agentOtherpersonalize_elements.test82PersonalizeElementsTest->testPersonalizeElementsAdmin()
Failed to set field title to z4OOGlXBOtherpersonalize_elements.test82PersonalizeElementsTest->testPersonalizeElementsAdmin()
Failed to set field selector to #some-idOtherpersonalize_elements.test82PersonalizeElementsTest->testPersonalizeElementsAdmin()
Failed to set field add_control_option to Otherpersonalize_elements.test82PersonalizeElementsTest->testPersonalizeElementsAdmin()
Failed to set field variation_type to editTextOtherpersonalize_elements.test82PersonalizeElementsTest->testPersonalizeElementsAdmin()
Found the Save buttonOtherpersonalize_elements.test82PersonalizeElementsTest->testPersonalizeElementsAdmin()
Found the requested form fields at admin/structure/personalize/variations/personalize-elements/addOtherpersonalize_elements.test82PersonalizeElementsTest->testPersonalizeElementsAdmin()
"You must have at least 2 variations for a content variation set." foundOtherpersonalize_elements.test83PersonalizeElementsTest->testPersonalizeElementsAdmin()
Failed to set field agent_select to test-agentOtherpersonalize_elements.test88PersonalizeElementsTest->testPersonalizeElementsAdmin()
Failed to set field title to z4OOGlXBOtherpersonalize_elements.test88PersonalizeElementsTest->testPersonalizeElementsAdmin()
Failed to set field selector to #some-idOtherpersonalize_elements.test88PersonalizeElementsTest->testPersonalizeElementsAdmin()
Failed to set field add_control_option to 1Otherpersonalize_elements.test88PersonalizeElementsTest->testPersonalizeElementsAdmin()
Failed to set field variation_type to editTextOtherpersonalize_elements.test88PersonalizeElementsTest->testPersonalizeElementsAdmin()
Failed to set field options[1][option_label] to first-optionOtherpersonalize_elements.test88PersonalizeElementsTest->testPersonalizeElementsAdmin()
Failed to set field options[1][personalize_elements_content] to text changesOtherpersonalize_elements.test88PersonalizeElementsTest->testPersonalizeElementsAdmin()
Found the Save buttonOtherpersonalize_elements.test88PersonalizeElementsTest->testPersonalizeElementsAdmin()
Found the requested form fields at Otherpersonalize_elements.test88PersonalizeElementsTest->testPersonalizeElementsAdmin()
"The variation set was saved." foundOtherpersonalize_elements.test90PersonalizeElementsTest->testPersonalizeElementsAdmin()
ExpandPersonalize Fields Field Collection Tests (PersonalizeFieldsCollectionTest) [Personalize]61210
MessageGroupFilenameLineFunctionStatus
Enabled modules: personalize, personalize_fields, personalize_test, field_collectionOtherpersonalize_collection_fields.test19PersonalizeFieldsCollectionTest->setUp()
Invalid permission manage personalized content.Rolepersonalize_collection_fields.test28PersonalizeFieldsCollectionTest->setUp()
Argument 1 passed to DrupalWebTestCase::drupalLogin() must be an instance of stdClass, boolean given, called in /var/lib/drupaltestbot/sites/default/files/checkout/sites/default/modules/personalize/modules/personalize_fields/tests/personalize_collection_fields.test on line 32 and definedRecoverable errordrupal_web_test_case.php1252DrupalWebTestCase->drupalLogin()
Trying to get property of non-objectNoticedrupal_web_test_case.php1258DrupalWebTestCase->drupalLogin()
Trying to get property of non-objectNoticedrupal_web_test_case.php1259DrupalWebTestCase->drupalLogin()
Failed to set field name to Otherpersonalize_collection_fields.test32PersonalizeFieldsCollectionTest->testFieldCollection()
Failed to set field pass to Otherpersonalize_collection_fields.test32PersonalizeFieldsCollectionTest->testFieldCollection()
Found the requested form fields at userOtherpersonalize_collection_fields.test32PersonalizeFieldsCollectionTest->testFieldCollection()
Trying to get property of non-objectNoticedrupal_web_test_case.php1265DrupalWebTestCase->drupalLogin()
User successfully logged in.User loginpersonalize_collection_fields.test32PersonalizeFieldsCollectionTest->testFieldCollection()
FieldException: Attempt to create a field of unknown type <em class="placeholder">field_collection</em>. in field_create_field() (line 110 of /var/lib/drupaltestbot/sites/default/files/checkout/modules/field/field.crud.inc).Uncaught exceptionfield.crud.inc110field_create_field()
Enabled modules: personalize, personalize_fields, personalize_test, field_collectionOtherpersonalize_collection_fields.test19PersonalizeFieldsCollectionTest->setUp()
Invalid permission manage personalized content.Rolepersonalize_collection_fields.test28PersonalizeFieldsCollectionTest->setUp()
Argument 1 passed to DrupalWebTestCase::drupalLogin() must be an instance of stdClass, boolean given, called in /var/lib/drupaltestbot/sites/default/files/checkout/sites/default/modules/personalize/modules/personalize_fields/tests/personalize_collection_fields.test on line 142 and definedRecoverable errordrupal_web_test_case.php1252DrupalWebTestCase->drupalLogin()
Trying to get property of non-objectNoticedrupal_web_test_case.php1258DrupalWebTestCase->drupalLogin()
Trying to get property of non-objectNoticedrupal_web_test_case.php1259DrupalWebTestCase->drupalLogin()
Failed to set field name to Otherpersonalize_collection_fields.test142PersonalizeFieldsCollectionTest->testMultiValueFieldCollection()
Failed to set field pass to Otherpersonalize_collection_fields.test142PersonalizeFieldsCollectionTest->testMultiValueFieldCollection()
Found the requested form fields at userOtherpersonalize_collection_fields.test142PersonalizeFieldsCollectionTest->testMultiValueFieldCollection()
Trying to get property of non-objectNoticedrupal_web_test_case.php1265DrupalWebTestCase->drupalLogin()
User successfully logged in.User loginpersonalize_collection_fields.test142PersonalizeFieldsCollectionTest->testMultiValueFieldCollection()
FieldException: Attempt to create a field of unknown type <em class="placeholder">field_collection</em>. in field_create_field() (line 110 of /var/lib/drupaltestbot/sites/default/files/checkout/modules/field/field.crud.inc).Uncaught exceptionfield.crud.inc110field_create_field()
ExpandPersonalize Fields Tests (PersonalizeFieldsTest) [Personalize]020
MessageGroupFilenameLineFunctionStatus
The test did not complete due to a fatal error.Completion checkpersonalize_fields.test25PersonalizeFieldsTest->testPersonalizeFieldsConfig()
Enabled modules: personalize_fields, personalize_testOtherpersonalize_fields.test19PersonalizeFieldsTest->setUp()
ExpandPersonalize Fundamentals (PersonalizeFundamentalsTest) [Personalize]020
MessageGroupFilenameLineFunctionStatus
The test did not complete due to a fatal error.Completion checkpersonalize.test1104PersonalizeFundamentalsTest->testAgentMachineNameGeneration()
Enabled modules: ctools, personalizeOtherpersonalize.test1098PersonalizeFundamentalsTest->setUp()
ExpandPersonalize Goal Administration (PersonalizeGoalAdminTest) [Personalize]374
MessageGroupFilenameLineFunctionStatus
The test did not complete due to a fatal error.Completion checkpersonalize.test2519PersonalizeGoalAdminTest->testAgentGoalEdit()
Enabled modules: ctools, personalize, personalize_testOtherpersonalize.test2513PersonalizeGoalAdminTest->setUp()
Invalid permission manage personalized content.Rolepersonalize.test2525PersonalizeGoalAdminTest->testAgentGoalEdit()
Argument 1 passed to DrupalWebTestCase::drupalLogin() must be an instance of stdClass, boolean given, called in /var/lib/drupaltestbot/sites/default/files/checkout/sites/default/modules/personalize/tests/personalize.test on line 2526 and definedRecoverable errordrupal_web_test_case.php1252DrupalWebTestCase->drupalLogin()
Trying to get property of non-objectNoticedrupal_web_test_case.php1258DrupalWebTestCase->drupalLogin()
Trying to get property of non-objectNoticedrupal_web_test_case.php1259DrupalWebTestCase->drupalLogin()
Failed to set field name to Otherpersonalize.test2526PersonalizeGoalAdminTest->testAgentGoalEdit()
Failed to set field pass to Otherpersonalize.test2526PersonalizeGoalAdminTest->testAgentGoalEdit()
Found the requested form fields at userOtherpersonalize.test2526PersonalizeGoalAdminTest->testAgentGoalEdit()
Trying to get property of non-objectNoticedrupal_web_test_case.php1265DrupalWebTestCase->drupalLogin()
User successfully logged in.User loginpersonalize.test2526PersonalizeGoalAdminTest->testAgentGoalEdit()
ExpandPersonalize MVT admin Tests (PersonalizeMVTAdminTest) [Personalize]374
MessageGroupFilenameLineFunctionStatus
The test did not complete due to a fatal error.Completion checkpersonalize.test2786PersonalizeMVTAdminTest->testMVTForms()
Enabled modules: ctools, personalize, personalize_testOtherpersonalize.test2780PersonalizeMVTAdminTest->setUp()
Invalid permission manage personalized content.Rolepersonalize.test2787PersonalizeMVTAdminTest->testMVTForms()
Argument 1 passed to DrupalWebTestCase::drupalLogin() must be an instance of stdClass, boolean given, called in /var/lib/drupaltestbot/sites/default/files/checkout/sites/default/modules/personalize/tests/personalize.test on line 2788 and definedRecoverable errordrupal_web_test_case.php1252DrupalWebTestCase->drupalLogin()
Trying to get property of non-objectNoticedrupal_web_test_case.php1258DrupalWebTestCase->drupalLogin()
Trying to get property of non-objectNoticedrupal_web_test_case.php1259DrupalWebTestCase->drupalLogin()
Failed to set field name to Otherpersonalize.test2788PersonalizeMVTAdminTest->testMVTForms()
Failed to set field pass to Otherpersonalize.test2788PersonalizeMVTAdminTest->testMVTForms()
Found the requested form fields at userOtherpersonalize.test2788PersonalizeMVTAdminTest->testMVTForms()
Trying to get property of non-objectNoticedrupal_web_test_case.php1265DrupalWebTestCase->drupalLogin()
User successfully logged in.User loginpersonalize.test2788PersonalizeMVTAdminTest->testMVTForms()
ExpandPersonalize Option Set Tests (PersonalizeOptionSetTest) [Personalize]374
MessageGroupFilenameLineFunctionStatus
The test did not complete due to a fatal error.Completion checkpersonalize.test1241PersonalizeOptionSetTest->testWinningOption()
Enabled modules: ctools, personalize, personalize_test, personalize_blocksOtherpersonalize.test1234PersonalizeOptionSetTest->setUp()
Invalid permission manage personalized content.Rolepersonalize.test1242PersonalizeOptionSetTest->testWinningOption()
Argument 1 passed to DrupalWebTestCase::drupalLogin() must be an instance of stdClass, boolean given, called in /var/lib/drupaltestbot/sites/default/files/checkout/sites/default/modules/personalize/tests/personalize.test on line 1243 and definedRecoverable errordrupal_web_test_case.php1252DrupalWebTestCase->drupalLogin()
Trying to get property of non-objectNoticedrupal_web_test_case.php1258DrupalWebTestCase->drupalLogin()
Trying to get property of non-objectNoticedrupal_web_test_case.php1259DrupalWebTestCase->drupalLogin()
Failed to set field name to Otherpersonalize.test1243PersonalizeOptionSetTest->testWinningOption()
Failed to set field pass to Otherpersonalize.test1243PersonalizeOptionSetTest->testWinningOption()
Found the requested form fields at userOtherpersonalize.test1243PersonalizeOptionSetTest->testWinningOption()
Trying to get property of non-objectNoticedrupal_web_test_case.php1265DrupalWebTestCase->drupalLogin()
User successfully logged in.User loginpersonalize.test1243PersonalizeOptionSetTest->testWinningOption()
ExpandPersonalize Taxonomy Context Tests (PersonalizeTaxonomyContextTest) [Personalize]030
MessageGroupFilenameLineFunctionStatus
Enabled modules: ctools, personalize, personalize_test, personalize_taxonomy_contextOtherpersonalize_taxonomy_context.test20PersonalizeTaxonomyContextTest->setUp()
Invalid permission administer personalize configuration.Rolepersonalize_taxonomy_context.test21PersonalizeTaxonomyContextTest->setUp()
Invalid permission manage personalized content.Rolepersonalize_taxonomy_context.test21PersonalizeTaxonomyContextTest->setUp()
ExpandPersonalize Tests (PersonalizeTest) [Personalize]040
MessageGroupFilenameLineFunctionStatus
Enabled modules: ctools, personalize, personalize_test, personalize_blocksOtherpersonalize.test338PersonalizeTest->setUp()
The test did not complete due to a fatal error.Completion checkpersonalize.test357PersonalizeTest->testPersonalizePage()
Enabled modules: ctools, personalize, personalize_test, personalize_blocksOtherpersonalize.test338PersonalizeTest->setUp()
Call to undefined function personalize_agent_set_status()PHP Fatal errorpersonalize.test359Unknown
ExpandPersonalize URL Context Tests (PersonalizeUrlContextTest) [Personalize]7194
MessageGroupFilenameLineFunctionStatus
The test did not complete due to a fatal error.Completion checkpersonalize_url_context.test26PersonalizeUrlContextTest->testQuerystringConfiguration()
Enabled modules: ctools, personalize, personalize_test, personalize_url_contextOtherpersonalize_url_context.test22PersonalizeUrlContextTest->setUp()
Invalid permission administer personalize configuration.Rolepersonalize_url_context.test23PersonalizeUrlContextTest->setUp()
Invalid permission manage personalized content.Rolepersonalize_url_context.test23PersonalizeUrlContextTest->setUp()
Argument 1 passed to DrupalWebTestCase::drupalLogin() must be an instance of stdClass, boolean given, called in /var/lib/drupaltestbot/sites/default/files/checkout/sites/default/modules/personalize/modules/personalize_url_context/tests/personalize_url_context.test on line 27 and definedRecoverable errordrupal_web_test_case.php1252DrupalWebTestCase->drupalLogin()
Trying to get property of non-objectNoticedrupal_web_test_case.php1258DrupalWebTestCase->drupalLogin()
Trying to get property of non-objectNoticedrupal_web_test_case.php1259DrupalWebTestCase->drupalLogin()
Failed to set field name to Otherpersonalize_url_context.test27PersonalizeUrlContextTest->testQuerystringConfiguration()
Failed to set field pass to Otherpersonalize_url_context.test27PersonalizeUrlContextTest->testQuerystringConfiguration()
Found the requested form fields at userOtherpersonalize_url_context.test27PersonalizeUrlContextTest->testQuerystringConfiguration()
Trying to get property of non-objectNoticedrupal_web_test_case.php1265DrupalWebTestCase->drupalLogin()
User successfully logged in.User loginpersonalize_url_context.test27PersonalizeUrlContextTest->testQuerystringConfiguration()
Found the Save buttonOtherpersonalize_url_context.test29PersonalizeUrlContextTest->testQuerystringConfiguration()
Found the requested form fields at admin/config/content/personalize/browser_contextOtherpersonalize_url_context.test29PersonalizeUrlContextTest->testQuerystringConfiguration()
Value array ( 0 => 'utm_campaign', 1 => 'utm_source', 2 => 'utm_medium', 3 => 'utm_content', 4 => 'utm_term', ) is equal to value array ( ).Otherpersonalize_url_context.test38PersonalizeUrlContextTest->testQuerystringConfiguration()
Failed to set field querystring_contexts to some-paramOtherpersonalize_url_context.test39PersonalizeUrlContextTest->testQuerystringConfiguration()
Found the Save buttonOtherpersonalize_url_context.test39PersonalizeUrlContextTest->testQuerystringConfiguration()
Found the requested form fields at admin/config/content/personalize/browser_contextOtherpersonalize_url_context.test39PersonalizeUrlContextTest->testQuerystringConfiguration()
Value array ( 0 => 'some-param', ) is equal to value array ( ).Otherpersonalize_url_context.test44PersonalizeUrlContextTest->testQuerystringConfiguration()
Failed to set field querystring_contexts to some-param param2 param3Otherpersonalize_url_context.test50PersonalizeUrlContextTest->testQuerystringConfiguration()
Found the Save buttonOtherpersonalize_url_context.test50PersonalizeUrlContextTest->testQuerystringConfiguration()
Found the requested form fields at Otherpersonalize_url_context.test50PersonalizeUrlContextTest->testQuerystringConfiguration()
Value array ( 0 => 'some-param', 1 => 'param2', 2 => 'param3', ) is equal to value array ( ).Otherpersonalize_url_context.test53PersonalizeUrlContextTest->testQuerystringConfiguration()