safe_delete_jobs-2549917-2.patch

Test status
StatusResult
Last receivedThu, 08/13/2015 - 14:01:08
Last requestedThu, 08/13/2015 - 15:45:03
Last testedThu, 08/13/2015 - 15:48:26
Test count1
Environment status
PHP 5.5 MySQLfail
File information
Filesafe_delete_jobs-2549917-2.patch
BranchTranslation Management Tool - 8.x-1.x
LinkIssue Link
SummaryFAILED: [[SimpleTest]]: [PHP 5.5 MySQL] 2,426 pass(es), 56 fail(s), and 1 exception(s).
Details

PHP 5.5 MySQL

  1. Setup environment
  2. Detect an invalid patch URL
  3. Detect invalid repository information
  4. Detect invalid patch format
  5. Detect a non-applicable patch
  6. Detect invalid PHP syntax
  7. Detect a Drupal installation failure
  8. Detect a test run failure
  9. Detect a failing test
    Review the test failures below then if necessary run them locally until the problem has been fixed.
  10. Complete test suite with all tests passing
2,426 pass(es), 56 fail(s), and 1 exception(s)

Non-pass

Test namePassFailException
ExpandDrupal\tmgmt\Tests\TMGMTUiTest519561
MessageGroupFilenameLineFunctionStatus
Failed to set field settings[action] to translateOtherTMGMTUiTest.php90Drupal\tmgmt\Tests\TMGMTUiTest->testCheckoutForm()
Found the requested form fields at OtherTMGMTUiTest.php90Drupal\tmgmt\Tests\TMGMTUiTest->testCheckoutForm()
"Test translator (auto created) can not translate from English to Greek." foundOtherTMGMTUiTest.php91Drupal\tmgmt\Tests\TMGMTUiTest->testCheckoutForm()
Failed to set field settings[action] to translateOtherTMGMTUiTest.php101Drupal\tmgmt\Tests\TMGMTUiTest->testCheckoutForm()
Found the requested form fields at OtherTMGMTUiTest.php101Drupal\tmgmt\Tests\TMGMTUiTest->testCheckoutForm()
Value false is TRUE.OtherTMGMTUiTest.php105Drupal\tmgmt\Tests\TMGMTUiTest->testCheckoutForm()
Value false is TRUE.OtherTMGMTUiTest.php108Drupal\tmgmt\Tests\TMGMTUiTest->testCheckoutForm()
Value false is TRUE.OtherTMGMTUiTest.php108Drupal\tmgmt\Tests\TMGMTUiTest->testCheckoutForm()
Value false is TRUE.OtherTMGMTUiTest.php108Drupal\tmgmt\Tests\TMGMTUiTest->testCheckoutForm()
"Test translation created" foundOtherTMGMTUiTest.php110Drupal\tmgmt\Tests\TMGMTUiTest->testCheckoutForm()
"Job overview" foundOtherTMGMTUiTest.php114Drupal\tmgmt\Tests\TMGMTUiTest->testCheckoutForm()
Value '1' is not equal to value '1'.OtherTMGMTUiTest.php120Drupal\tmgmt\Tests\TMGMTUiTest->testCheckoutForm()
Failed to set field settings[action] to submitOtherTMGMTUiTest.php134Drupal\tmgmt\Tests\TMGMTUiTest->testCheckoutForm()
Found the requested form fields at OtherTMGMTUiTest.php134Drupal\tmgmt\Tests\TMGMTUiTest->testCheckoutForm()
"Test submit" foundOtherTMGMTUiTest.php135Drupal\tmgmt\Tests\TMGMTUiTest->testCheckoutForm()
Value false is TRUE.OtherTMGMTUiTest.php137Drupal\tmgmt\Tests\TMGMTUiTest->testCheckoutForm()
Failed to set field settings[action] to rejectOtherTMGMTUiTest.php154Drupal\tmgmt\Tests\TMGMTUiTest->testCheckoutForm()
Found the requested form fields at OtherTMGMTUiTest.php154Drupal\tmgmt\Tests\TMGMTUiTest->testCheckoutForm()
"This is not supported" foundOtherTMGMTUiTest.php155Drupal\tmgmt\Tests\TMGMTUiTest->testCheckoutForm()
Value false is TRUE.OtherTMGMTUiTest.php157Drupal\tmgmt\Tests\TMGMTUiTest->testCheckoutForm()
Value 2 is equal to value 0.OtherTMGMTUiTest.php161Drupal\tmgmt\Tests\TMGMTUiTest->testCheckoutForm()
Value 2 is equal to value 0.OtherTMGMTUiTest.php165Drupal\tmgmt\Tests\TMGMTUiTest->testCheckoutForm()
Failed to set field settings[action] to translateOtherTMGMTUiTest.php175Drupal\tmgmt\Tests\TMGMTUiTest->testCheckoutForm()
Found the requested form fields at OtherTMGMTUiTest.php175Drupal\tmgmt\Tests\TMGMTUiTest->testCheckoutForm()
"Test translation created" foundOtherTMGMTUiTest.php176Drupal\tmgmt\Tests\TMGMTUiTest->testCheckoutForm()
Failed to set field settings[action] to failOtherTMGMTUiTest.php193Drupal\tmgmt\Tests\TMGMTUiTest->testCheckoutForm()
Found the requested form fields at OtherTMGMTUiTest.php193Drupal\tmgmt\Tests\TMGMTUiTest->testCheckoutForm()
"Service not reachable" foundOtherTMGMTUiTest.php194Drupal\tmgmt\Tests\TMGMTUiTest->testCheckoutForm()
Failed to set field settings[action] to not_translatableOtherTMGMTUiTest.php216Drupal\tmgmt\Tests\TMGMTUiTest->testCheckoutForm()
Found the requested form fields at OtherTMGMTUiTest.php216Drupal\tmgmt\Tests\TMGMTUiTest->testCheckoutForm()
"Fail" foundOtherTMGMTUiTest.php218Drupal\tmgmt\Tests\TMGMTUiTest->testCheckoutForm()
"This is not supported." foundOtherTMGMTUiTest.php238Drupal\tmgmt\Tests\TMGMTUiTest->testCheckoutForm()
Value false is TRUE.OtherTMGMTUiTest.php240Drupal\tmgmt\Tests\TMGMTUiTest->testCheckoutForm()
Value false is TRUE.OtherTMGMTUiTest.php250Drupal\tmgmt\Tests\TMGMTUiTest->testCheckoutForm()
Value 3 is equal to value 5.OtherTMGMTUiTest.php273Drupal\tmgmt\Tests\TMGMTUiTest->testCheckoutForm()
Value 2 is equal to value 5.OtherTMGMTUiTest.php277Drupal\tmgmt\Tests\TMGMTUiTest->testCheckoutForm()
Value 3 is equal to value 5.OtherTMGMTUiTest.php298Drupal\tmgmt\Tests\TMGMTUiTest->testCheckoutForm()
"Are you sure you want to delete the translation job test_source:test:1 and 2 more?" foundOtherTMGMTUiTest.php300Drupal\tmgmt\Tests\TMGMTUiTest->testCheckoutForm()
Value 2 is equal to value 4.OtherTMGMTUiTest.php304Drupal\tmgmt\Tests\TMGMTUiTest->testCheckoutForm()
Value array ( 0 => 'admin/tmgmt/jobs/2', ) is FALSE.OtherTMGMTUiTest.php328Drupal\tmgmt\Tests\TMGMTUiTest->testCheckoutFunction()
Value false is TRUE.OtherTMGMTUiTest.php329Drupal\tmgmt\Tests\TMGMTUiTest->testCheckoutFunction()
Failed to set field settings[action] to translateOtherTMGMTUiTest.php588Drupal\tmgmt\Tests\TMGMTUiTest->testAbortJob()
Found the requested form fields at admin/tmgmt/jobs/1OtherTMGMTUiTest.php588Drupal\tmgmt\Tests\TMGMTUiTest->testAbortJob()
Found the Abort job buttonOtherTMGMTUiTest.php591Drupal\tmgmt\Tests\TMGMTUiTest->testAbortJob()
Found the requested form fields at admin/tmgmt/jobs/1OtherTMGMTUiTest.php591Drupal\tmgmt\Tests\TMGMTUiTest->testAbortJob()
Found the Confirm buttonOtherTMGMTUiTest.php592Drupal\tmgmt\Tests\TMGMTUiTest->testAbortJob()
Found the requested form fields at OtherTMGMTUiTest.php592Drupal\tmgmt\Tests\TMGMTUiTest->testAbortJob()
Value false is TRUE.OtherTMGMTUiTest.php596Drupal\tmgmt\Tests\TMGMTUiTest->testAbortJob()
Value false is TRUE.OtherTMGMTUiTest.php598Drupal\tmgmt\Tests\TMGMTUiTest->testAbortJob()
Value false is TRUE.OtherTMGMTUiTest.php598Drupal\tmgmt\Tests\TMGMTUiTest->testAbortJob()
Value false is TRUE.OtherTMGMTUiTest.php598Drupal\tmgmt\Tests\TMGMTUiTest->testAbortJob()
Found the Resubmit buttonOtherTMGMTUiTest.php602Drupal\tmgmt\Tests\TMGMTUiTest->testAbortJob()
Found the requested form fields at admin/tmgmt/jobs/1OtherTMGMTUiTest.php602Drupal\tmgmt\Tests\TMGMTUiTest->testAbortJob()
Found the Confirm buttonOtherTMGMTUiTest.php603Drupal\tmgmt\Tests\TMGMTUiTest->testAbortJob()
Found the requested form fields at OtherTMGMTUiTest.php603Drupal\tmgmt\Tests\TMGMTUiTest->testAbortJob()
Raw "This job is a duplicate of the previously aborted job #1" foundOtherTMGMTUiTest.php606Drupal\tmgmt\Tests\TMGMTUiTest->testAbortJob()
Drupal\tmgmt\TMGMTException: The job has no translator assigned. in Drupal\tmgmt\Entity\Job->getTranslator() (line 422 of /var/lib/drupaltestbot/sites/default/files/checkout/sites/default/modules/tmgmt/src/Entity/Job.php). Drupal\tmgmt\Entity\Job->getTranslator() Drupal\tmgmt\Tests\TMGMTUiTest->testAbortJob() Drupal\simpletest\TestBase->run(Array) simpletest_script_run_one_test('11', 'Drupal\tmgmt\Tests\TMGMTUiTest') Uncaught exceptionJob.php422Drupal\tmgmt\Entity\Job->getTranslator()

All

Test namePassFailException
LeafDrupal\tmgmt\Tests\CrudTest19900
LeafDrupal\tmgmt\Tests\HelperTest4300
LeafDrupal\tmgmt\Tests\LocalTasksTests3100
LeafDrupal\tmgmt\Tests\PluginsTest6300
LeafDrupal\tmgmt\Tests\TMGMTCartTest5200
ExpandDrupal\tmgmt\Tests\TMGMTUiTest519561
MessageGroupFilenameLineFunctionStatus
Failed to set field settings[action] to translateOtherTMGMTUiTest.php90Drupal\tmgmt\Tests\TMGMTUiTest->testCheckoutForm()
Found the requested form fields at OtherTMGMTUiTest.php90Drupal\tmgmt\Tests\TMGMTUiTest->testCheckoutForm()
"Test translator (auto created) can not translate from English to Greek." foundOtherTMGMTUiTest.php91Drupal\tmgmt\Tests\TMGMTUiTest->testCheckoutForm()
Failed to set field settings[action] to translateOtherTMGMTUiTest.php101Drupal\tmgmt\Tests\TMGMTUiTest->testCheckoutForm()
Found the requested form fields at OtherTMGMTUiTest.php101Drupal\tmgmt\Tests\TMGMTUiTest->testCheckoutForm()
Value false is TRUE.OtherTMGMTUiTest.php105Drupal\tmgmt\Tests\TMGMTUiTest->testCheckoutForm()
Value false is TRUE.OtherTMGMTUiTest.php108Drupal\tmgmt\Tests\TMGMTUiTest->testCheckoutForm()
Value false is TRUE.OtherTMGMTUiTest.php108Drupal\tmgmt\Tests\TMGMTUiTest->testCheckoutForm()
Value false is TRUE.OtherTMGMTUiTest.php108Drupal\tmgmt\Tests\TMGMTUiTest->testCheckoutForm()
"Test translation created" foundOtherTMGMTUiTest.php110Drupal\tmgmt\Tests\TMGMTUiTest->testCheckoutForm()
"Job overview" foundOtherTMGMTUiTest.php114Drupal\tmgmt\Tests\TMGMTUiTest->testCheckoutForm()
Value '1' is not equal to value '1'.OtherTMGMTUiTest.php120Drupal\tmgmt\Tests\TMGMTUiTest->testCheckoutForm()
Failed to set field settings[action] to submitOtherTMGMTUiTest.php134Drupal\tmgmt\Tests\TMGMTUiTest->testCheckoutForm()
Found the requested form fields at OtherTMGMTUiTest.php134Drupal\tmgmt\Tests\TMGMTUiTest->testCheckoutForm()
"Test submit" foundOtherTMGMTUiTest.php135Drupal\tmgmt\Tests\TMGMTUiTest->testCheckoutForm()
Value false is TRUE.OtherTMGMTUiTest.php137Drupal\tmgmt\Tests\TMGMTUiTest->testCheckoutForm()
Failed to set field settings[action] to rejectOtherTMGMTUiTest.php154Drupal\tmgmt\Tests\TMGMTUiTest->testCheckoutForm()
Found the requested form fields at OtherTMGMTUiTest.php154Drupal\tmgmt\Tests\TMGMTUiTest->testCheckoutForm()
"This is not supported" foundOtherTMGMTUiTest.php155Drupal\tmgmt\Tests\TMGMTUiTest->testCheckoutForm()
Value false is TRUE.OtherTMGMTUiTest.php157Drupal\tmgmt\Tests\TMGMTUiTest->testCheckoutForm()
Value 2 is equal to value 0.OtherTMGMTUiTest.php161Drupal\tmgmt\Tests\TMGMTUiTest->testCheckoutForm()
Value 2 is equal to value 0.OtherTMGMTUiTest.php165Drupal\tmgmt\Tests\TMGMTUiTest->testCheckoutForm()
Failed to set field settings[action] to translateOtherTMGMTUiTest.php175Drupal\tmgmt\Tests\TMGMTUiTest->testCheckoutForm()
Found the requested form fields at OtherTMGMTUiTest.php175Drupal\tmgmt\Tests\TMGMTUiTest->testCheckoutForm()
"Test translation created" foundOtherTMGMTUiTest.php176Drupal\tmgmt\Tests\TMGMTUiTest->testCheckoutForm()
Failed to set field settings[action] to failOtherTMGMTUiTest.php193Drupal\tmgmt\Tests\TMGMTUiTest->testCheckoutForm()
Found the requested form fields at OtherTMGMTUiTest.php193Drupal\tmgmt\Tests\TMGMTUiTest->testCheckoutForm()
"Service not reachable" foundOtherTMGMTUiTest.php194Drupal\tmgmt\Tests\TMGMTUiTest->testCheckoutForm()
Failed to set field settings[action] to not_translatableOtherTMGMTUiTest.php216Drupal\tmgmt\Tests\TMGMTUiTest->testCheckoutForm()
Found the requested form fields at OtherTMGMTUiTest.php216Drupal\tmgmt\Tests\TMGMTUiTest->testCheckoutForm()
"Fail" foundOtherTMGMTUiTest.php218Drupal\tmgmt\Tests\TMGMTUiTest->testCheckoutForm()
"This is not supported." foundOtherTMGMTUiTest.php238Drupal\tmgmt\Tests\TMGMTUiTest->testCheckoutForm()
Value false is TRUE.OtherTMGMTUiTest.php240Drupal\tmgmt\Tests\TMGMTUiTest->testCheckoutForm()
Value false is TRUE.OtherTMGMTUiTest.php250Drupal\tmgmt\Tests\TMGMTUiTest->testCheckoutForm()
Value 3 is equal to value 5.OtherTMGMTUiTest.php273Drupal\tmgmt\Tests\TMGMTUiTest->testCheckoutForm()
Value 2 is equal to value 5.OtherTMGMTUiTest.php277Drupal\tmgmt\Tests\TMGMTUiTest->testCheckoutForm()
Value 3 is equal to value 5.OtherTMGMTUiTest.php298Drupal\tmgmt\Tests\TMGMTUiTest->testCheckoutForm()
"Are you sure you want to delete the translation job test_source:test:1 and 2 more?" foundOtherTMGMTUiTest.php300Drupal\tmgmt\Tests\TMGMTUiTest->testCheckoutForm()
Value 2 is equal to value 4.OtherTMGMTUiTest.php304Drupal\tmgmt\Tests\TMGMTUiTest->testCheckoutForm()
Value array ( 0 => 'admin/tmgmt/jobs/2', ) is FALSE.OtherTMGMTUiTest.php328Drupal\tmgmt\Tests\TMGMTUiTest->testCheckoutFunction()
Value false is TRUE.OtherTMGMTUiTest.php329Drupal\tmgmt\Tests\TMGMTUiTest->testCheckoutFunction()
Failed to set field settings[action] to translateOtherTMGMTUiTest.php588Drupal\tmgmt\Tests\TMGMTUiTest->testAbortJob()
Found the requested form fields at admin/tmgmt/jobs/1OtherTMGMTUiTest.php588Drupal\tmgmt\Tests\TMGMTUiTest->testAbortJob()
Found the Abort job buttonOtherTMGMTUiTest.php591Drupal\tmgmt\Tests\TMGMTUiTest->testAbortJob()
Found the requested form fields at admin/tmgmt/jobs/1OtherTMGMTUiTest.php591Drupal\tmgmt\Tests\TMGMTUiTest->testAbortJob()
Found the Confirm buttonOtherTMGMTUiTest.php592Drupal\tmgmt\Tests\TMGMTUiTest->testAbortJob()
Found the requested form fields at OtherTMGMTUiTest.php592Drupal\tmgmt\Tests\TMGMTUiTest->testAbortJob()
Value false is TRUE.OtherTMGMTUiTest.php596Drupal\tmgmt\Tests\TMGMTUiTest->testAbortJob()
Value false is TRUE.OtherTMGMTUiTest.php598Drupal\tmgmt\Tests\TMGMTUiTest->testAbortJob()
Value false is TRUE.OtherTMGMTUiTest.php598Drupal\tmgmt\Tests\TMGMTUiTest->testAbortJob()
Value false is TRUE.OtherTMGMTUiTest.php598Drupal\tmgmt\Tests\TMGMTUiTest->testAbortJob()
Found the Resubmit buttonOtherTMGMTUiTest.php602Drupal\tmgmt\Tests\TMGMTUiTest->testAbortJob()
Found the requested form fields at admin/tmgmt/jobs/1OtherTMGMTUiTest.php602Drupal\tmgmt\Tests\TMGMTUiTest->testAbortJob()
Found the Confirm buttonOtherTMGMTUiTest.php603Drupal\tmgmt\Tests\TMGMTUiTest->testAbortJob()
Found the requested form fields at OtherTMGMTUiTest.php603Drupal\tmgmt\Tests\TMGMTUiTest->testAbortJob()
Raw "This job is a duplicate of the previously aborted job #1" foundOtherTMGMTUiTest.php606Drupal\tmgmt\Tests\TMGMTUiTest->testAbortJob()
Drupal\tmgmt\TMGMTException: The job has no translator assigned. in Drupal\tmgmt\Entity\Job->getTranslator() (line 422 of /var/lib/drupaltestbot/sites/default/files/checkout/sites/default/modules/tmgmt/src/Entity/Job.php). Drupal\tmgmt\Entity\Job->getTranslator() Drupal\tmgmt\Tests\TMGMTUiTest->testAbortJob() Drupal\simpletest\TestBase->run(Array) simpletest_script_run_one_test('11', 'Drupal\tmgmt\Tests\TMGMTUiTest') Uncaught exceptionJob.php422Drupal\tmgmt\Entity\Job->getTranslator()
LeafDrupal\tmgmt\Tests\TranslatorTest5000
LeafDrupal\tmgmt\Tests\TranslatorUITest3000
LeafDrupal\tmgmt_config\Tests\ConfigSourceListTest24400
LeafDrupal\tmgmt_config\Tests\ConfigSourceUiTest23500
LeafDrupal\tmgmt_config\Tests\ConfigSourceUnitTest3900
LeafDrupal\tmgmt_content\Tests\ContentEntitySourceListTest15900
LeafDrupal\tmgmt_content\Tests\ContentEntitySourceUiTest27100
LeafDrupal\tmgmt_content\Tests\ContentEntitySourceUnitTest14600
LeafDrupal\tmgmt_content\Tests\ContentEntitySuggestionsTest2400
LeafDrupal\tmgmt_demo\Tests\TMGMTDemoTest4800
LeafDrupal\tmgmt_file\Tests\FileTranslatorTest16000
LeafDrupal\tmgmt_locale\Tests\LocaleSourceTest6300
LeafDrupal\tmgmt_locale\Tests\LocaleSourceUiTest5000