entity-2546654-7-Entity-list-wrapper-unsaved-entites-TEST-only.patch

Test status
StatusResult
Last receivedWed, 08/12/2015 - 12:16:01
Last requestedWed, 08/12/2015 - 12:17:01
Last testedWed, 08/12/2015 - 12:18:36
Test count1
Environment status
MySQLfail
File information
Fileentity-2546654-7-Entity-list-wrapper-unsaved-entites-TEST-only.patch
BranchEntity API - 7.x-1.x
LinkIssue Link
SummaryFAILED: [[SimpleTest]]: [MySQL] 631 pass(es), 1 fail(s), and 1 exception(s).
Details

MySQL

  1. Setup environment
  2. Detect an invalid patch URL
  3. Detect invalid repository information
  4. Detect invalid patch format
  5. Detect a non-applicable patch
  6. Detect invalid PHP syntax
  7. Detect a Drupal installation failure
  8. Detect a test run failure
  9. Detect a failing test
    Review the test failures below then if necessary run them locally until the problem has been fixed.
  10. Complete test suite with all tests passing
631 pass(es), 1 fail(s), and 1 exception(s)

Non-pass

Test namePassFailException
ExpandMetadata Wrapper (EntityMetadataTestCase) [Entity API]13011
MessageGroupFilenameLineFunctionStatus
Wrapped term was found in advanced list.Otherentity.test974EntityMetadataTestCase->testListMetadataWrappers()
EntityMetadataWrapperException: Unable to get the data property name as the parent data structure is not set. in EntityStructureWrapper->getPropertyValue() (line 438 of /var/lib/drupaltestbot/sites/default/files/checkout/sites/default/modules/entity/includes/entity.wrapper.inc).Uncaught exceptionentity.wrapper.inc438EntityStructureWrapper->getPropertyValue()

All

Test namePassFailException
LeafEntity API comment node access (EntityAPICommentNodeAccessTestCase) [Entity API]3500
LeafEntity CRUD (EntityAPITestCase) [Entity API]7900
LeafEntity CRUD i18n integration (EntityAPIi18nItegrationTestCase) [Entity API]2400
LeafEntity Metadata Node Access (EntityMetadataNodeAccessTestCase) [Entity API]3400
LeafEntity Metadata Node Create Access (EntityMetadataNodeCreateAccessTestCase) [Entity API]1500
LeafEntity Metadata Node Revision Access (EntityMetadataNodeRevisionAccessTestCase) [Entity API]2900
LeafEntity tokens (EntityTokenTestCase) [Entity API]600
ExpandMetadata Wrapper (EntityMetadataTestCase) [Entity API]13011
MessageGroupFilenameLineFunctionStatus
Wrapped term was found in advanced list.Otherentity.test974EntityMetadataTestCase->testListMetadataWrappers()
EntityMetadataWrapperException: Unable to get the data property name as the parent data structure is not set. in EntityStructureWrapper->getPropertyValue() (line 438 of /var/lib/drupaltestbot/sites/default/files/checkout/sites/default/modules/entity/includes/entity.wrapper.inc).Uncaught exceptionentity.wrapper.inc438EntityStructureWrapper->getPropertyValue()
LeafProperty info core integration (EntityMetadataIntegrationTestCase) [Entity API]27900