add_bundle_info_in_the-2460641-12-TEST-ONLY.patch

Test status
StatusResult
Last receivedWed, 08/12/2015 - 10:00:00
Last requestedWed, 08/12/2015 - 10:03:41
Last testedWed, 08/12/2015 - 10:07:46
Test count1
Environment status
PHP 5.5 MySQLfail
File information
Fileadd_bundle_info_in_the-2460641-12-TEST-ONLY.patch
BranchCollect - 8.x-1.x
LinkIssue Link
SummaryFAILED: [[SimpleTest]]: [PHP 5.5 MySQL] 1,481 pass(es), 5 fail(s), and 0 exception(s).
Details

PHP 5.5 MySQL

  1. Setup environment
  2. Detect an invalid patch URL
  3. Detect invalid repository information
  4. Detect invalid patch format
  5. Detect a non-applicable patch
  6. Detect invalid PHP syntax
  7. Detect a Drupal installation failure
  8. Detect a test run failure
  9. Detect a failing test
    Review the test failures below then if necessary run them locally until the problem has been fixed.
  10. Complete test suite with all tests passing
1,481 pass(es), 5 fail(s), and 0 exception(s)

Non-pass

Test namePassFailException
ExpandDrupal\collect\Tests\EntityWebTest47050
MessageGroupFilenameLineFunctionStatus
"The entity could not be recreated. Create a missing article bundle to recreate the entity." foundOtherEntityWebTest.php475Drupal\collect\Tests\EntityWebTest->testRecreateEntities()
[12-Aug-2015 10:07:04 UTC] Uncaught PHP Exception Drupal\Component\Plugin\Exception\PluginNotFoundException: "The "entity:node:article" plugin does not exist." at /var/lib/drupaltestbot/sites/default/files/checkout/core/lib/Drupal/Component/Plugin/Discovery/DiscoveryTrait.php line 57 Fatal errorUnknown0Unknown
"Missing bundle Article is created." foundOtherEntityWebTest.php567Drupal\collect\Tests\EntityWebTest->testCompareFieldDefinition()
"Article" foundOtherEntityWebTest.php569Drupal\collect\Tests\EntityWebTest->testCompareFieldDefinition()
Raw "Use <em>articles</em> for time-sensitive content like news, press releases or blog posts." foundOtherEntityWebTest.php570Drupal\collect\Tests\EntityWebTest->testCompareFieldDefinition()

All

Test namePassFailException
LeafDrupal\collect\Tests\CollectJsonModelTest3100
LeafDrupal\collect\Tests\CollectWebTest40300
LeafDrupal\collect\Tests\ContainerTest2100
LeafDrupal\collect\Tests\DependencyInjectionTest800
ExpandDrupal\collect\Tests\EntityWebTest47050
MessageGroupFilenameLineFunctionStatus
"The entity could not be recreated. Create a missing article bundle to recreate the entity." foundOtherEntityWebTest.php475Drupal\collect\Tests\EntityWebTest->testRecreateEntities()
[12-Aug-2015 10:07:04 UTC] Uncaught PHP Exception Drupal\Component\Plugin\Exception\PluginNotFoundException: "The "entity:node:article" plugin does not exist." at /var/lib/drupaltestbot/sites/default/files/checkout/core/lib/Drupal/Component/Plugin/Discovery/DiscoveryTrait.php line 57 Fatal errorUnknown0Unknown
"Missing bundle Article is created." foundOtherEntityWebTest.php567Drupal\collect\Tests\EntityWebTest->testCompareFieldDefinition()
"Article" foundOtherEntityWebTest.php569Drupal\collect\Tests\EntityWebTest->testCompareFieldDefinition()
Raw "Use <em>articles</em> for time-sensitive content like news, press releases or blog posts." foundOtherEntityWebTest.php570Drupal\collect\Tests\EntityWebTest->testCompareFieldDefinition()
LeafDrupal\collect\Tests\FetchUrlModelTest600
LeafDrupal\collect\Tests\FieldDefinitionModelTest900
LeafDrupal\collect\Tests\JsonModelTest700
LeafDrupal\collect\Tests\ModelManagerTest500
LeafDrupal\collect\Tests\ModelTest7300
LeafDrupal\collect\Tests\ProcessingTest400
LeafDrupal\collect\Tests\ProcessingWebTest5800
LeafDrupal\collect\Tests\RelationTest1500
LeafDrupal\collect\Tests\RelationWebTest10100
LeafDrupal\collect\Tests\TypedDataProviderTest1000
LeafDrupal\collect_client\Tests\CollectClientWebTest22800
LeafDrupal\collect_client_contact\Tests\ContactItemHandlerTest2000
LeafDrupal\collect_common\Tests\CollectCommonKernelTest600
LeafDrupal\Tests\collect\Unit\Plugin\rest\resource\CollectResourceTest200
LeafDrupal\Tests\collect_client\Unit\Plugin\QueueWorker\QueueWorkerTest400