2548659-14.patch

Test status
StatusResult
Last receivedWed, 08/12/2015 - 09:39:00
Last requestedWed, 08/12/2015 - 09:39:02
Last testedWed, 08/12/2015 - 09:39:56
Test count1
Environment status
PHP 5.5 MySQLfail
File information
File2548659-14.patch
BranchTwitter - 8.x-1.x
LinkIssue Link
SummaryFAILED: [[SimpleTest]]: [PHP 5.5 MySQL] 0 pass(es), 2 fail(s), and 2 exception(s).
Details

PHP 5.5 MySQL

  1. Setup environment
  2. Detect an invalid patch URL
  3. Detect invalid repository information
  4. Detect invalid patch format
  5. Detect a non-applicable patch
  6. Detect invalid PHP syntax
  7. Detect a Drupal installation failure
  8. Detect a test run failure
  9. Detect a failing test
    Review the test failures below then if necessary run them locally until the problem has been fixed.
  10. Complete test suite with all tests passing
0 pass(es), 2 fail(s), and 2 exception(s)

Non-pass

Test namePassFailException
ExpandDrupal\twitter\Tests\TwitterCore011
MessageGroupFilenameLineFunctionStatus
The test did not complete due to a fatal error.Completion checkTwitterCore.php29Drupal\twitter\Tests\TwitterCore->testAccountAdditionNoOauth()
ReflectionException: Internal error: Failed to retrieve the default value in ReflectionParameter->getDefaultValue() (line 135 of /var/lib/drupaltestbot/sites/default/files/checkout/core/lib/Drupal/Core/DependencyInjection/Compiler/TaggedHandlersPass.php). ReflectionParameter->getDefaultValue() Drupal\Core\DependencyInjection\Compiler\TaggedHandlersPass->process(Object) Symfony\Component\DependencyInjection\Compiler\Compiler->compile(Object) Symfony\Component\DependencyInjection\ContainerBuilder->compile() Drupal\Core\DrupalKernel->compileContainer() Drupal\Core\DrupalKernel->initializeContainer() Drupal\Core\DrupalKernel->updateModules(Array, Array) Drupal\Core\Extension\ModuleInstaller->updateKernel(Array) Drupal\Core\Extension\ModuleInstaller->install(Array, 1) Drupal\Core\ProxyClass\Extension\ModuleInstaller->install(Array, 1) Drupal\simpletest\WebTestBase->installModulesFromClassProperty(Object) Drupal\simpletest\WebTestBase->setUp() Drupal\simpletest\TestBase->run(Array) simpletest_script_run_one_test('2', 'Drupal\twitter\Tests\TwitterCore') Uncaught exceptionTaggedHandlersPass.php135ReflectionParameter->getDefaultValue()
ExpandDrupal\twitter\Tests\TwitterInputFilters011
MessageGroupFilenameLineFunctionStatus
The test did not complete due to a fatal error.Completion checkTwitterInputFilters.php24Drupal\twitter\Tests\TwitterInputFilters->testInputFilters()
ReflectionException: Internal error: Failed to retrieve the default value in ReflectionParameter->getDefaultValue() (line 135 of /var/lib/drupaltestbot/sites/default/files/checkout/core/lib/Drupal/Core/DependencyInjection/Compiler/TaggedHandlersPass.php). ReflectionParameter->getDefaultValue() Drupal\Core\DependencyInjection\Compiler\TaggedHandlersPass->process(Object) Symfony\Component\DependencyInjection\Compiler\Compiler->compile(Object) Symfony\Component\DependencyInjection\ContainerBuilder->compile() Drupal\Core\DrupalKernel->compileContainer() Drupal\Core\DrupalKernel->initializeContainer() Drupal\Core\DrupalKernel->updateModules(Array, Array) Drupal\Core\Extension\ModuleInstaller->updateKernel(Array) Drupal\Core\Extension\ModuleInstaller->install(Array, 1) Drupal\Core\ProxyClass\Extension\ModuleInstaller->install(Array, 1) Drupal\simpletest\WebTestBase->installModulesFromClassProperty(Object) Drupal\simpletest\WebTestBase->setUp() Drupal\simpletest\TestBase->run(Array) simpletest_script_run_one_test('1', 'Drupal\twitter\Tests\TwitterInputFilters') Uncaught exceptionTaggedHandlersPass.php135ReflectionParameter->getDefaultValue()

All

Test namePassFailException
ExpandDrupal\twitter\Tests\TwitterCore011
MessageGroupFilenameLineFunctionStatus
The test did not complete due to a fatal error.Completion checkTwitterCore.php29Drupal\twitter\Tests\TwitterCore->testAccountAdditionNoOauth()
ReflectionException: Internal error: Failed to retrieve the default value in ReflectionParameter->getDefaultValue() (line 135 of /var/lib/drupaltestbot/sites/default/files/checkout/core/lib/Drupal/Core/DependencyInjection/Compiler/TaggedHandlersPass.php). ReflectionParameter->getDefaultValue() Drupal\Core\DependencyInjection\Compiler\TaggedHandlersPass->process(Object) Symfony\Component\DependencyInjection\Compiler\Compiler->compile(Object) Symfony\Component\DependencyInjection\ContainerBuilder->compile() Drupal\Core\DrupalKernel->compileContainer() Drupal\Core\DrupalKernel->initializeContainer() Drupal\Core\DrupalKernel->updateModules(Array, Array) Drupal\Core\Extension\ModuleInstaller->updateKernel(Array) Drupal\Core\Extension\ModuleInstaller->install(Array, 1) Drupal\Core\ProxyClass\Extension\ModuleInstaller->install(Array, 1) Drupal\simpletest\WebTestBase->installModulesFromClassProperty(Object) Drupal\simpletest\WebTestBase->setUp() Drupal\simpletest\TestBase->run(Array) simpletest_script_run_one_test('2', 'Drupal\twitter\Tests\TwitterCore') Uncaught exceptionTaggedHandlersPass.php135ReflectionParameter->getDefaultValue()
ExpandDrupal\twitter\Tests\TwitterInputFilters011
MessageGroupFilenameLineFunctionStatus
The test did not complete due to a fatal error.Completion checkTwitterInputFilters.php24Drupal\twitter\Tests\TwitterInputFilters->testInputFilters()
ReflectionException: Internal error: Failed to retrieve the default value in ReflectionParameter->getDefaultValue() (line 135 of /var/lib/drupaltestbot/sites/default/files/checkout/core/lib/Drupal/Core/DependencyInjection/Compiler/TaggedHandlersPass.php). ReflectionParameter->getDefaultValue() Drupal\Core\DependencyInjection\Compiler\TaggedHandlersPass->process(Object) Symfony\Component\DependencyInjection\Compiler\Compiler->compile(Object) Symfony\Component\DependencyInjection\ContainerBuilder->compile() Drupal\Core\DrupalKernel->compileContainer() Drupal\Core\DrupalKernel->initializeContainer() Drupal\Core\DrupalKernel->updateModules(Array, Array) Drupal\Core\Extension\ModuleInstaller->updateKernel(Array) Drupal\Core\Extension\ModuleInstaller->install(Array, 1) Drupal\Core\ProxyClass\Extension\ModuleInstaller->install(Array, 1) Drupal\simpletest\WebTestBase->installModulesFromClassProperty(Object) Drupal\simpletest\WebTestBase->setUp() Drupal\simpletest\TestBase->run(Array) simpletest_script_run_one_test('1', 'Drupal\twitter\Tests\TwitterInputFilters') Uncaught exceptionTaggedHandlersPass.php135ReflectionParameter->getDefaultValue()