langcode_missing_schema-2549561-2.patch

Test status
StatusResult
Last receivedTue, 08/11/2015 - 23:20:07
Last requestedTue, 08/11/2015 - 23:25:44
Last testedTue, 08/11/2015 - 23:30:56
Test count1
Environment status
PHP 5.5 MySQLfail
File information
Filelangcode_missing_schema-2549561-2.patch
BranchSimplenews - 8.x-1.x
LinkIssue Link
SummaryFAILED: [[SimpleTest]]: [PHP 5.5 MySQL] 2,136 pass(es), 1 fail(s), and 1 exception(s).
Details

PHP 5.5 MySQL

  1. Setup environment
  2. Detect an invalid patch URL
  3. Detect invalid repository information
  4. Detect invalid patch format
  5. Detect a non-applicable patch
  6. Detect invalid PHP syntax
  7. Detect a Drupal installation failure
  8. Detect a test run failure
  9. Detect a failing test
    Review the test failures below then if necessary run them locally until the problem has been fixed.
  10. Complete test suite with all tests passing
2,136 pass(es), 1 fail(s), and 1 exception(s)

Non-pass

Test namePassFailException
ExpandDrupal\simplenews_demo\Tests\SimplenewsDemoTest011
MessageGroupFilenameLineFunctionStatus
The test did not complete due to a fatal error.Completion checkSimplenewsDemoTest.php43Drupal\simplenews_demo\Tests\SimplenewsDemoTest->testInstalled()
Drupal\Core\Config\Schema\SchemaIncompleteException: Schema errors for simplenews_scheduler.settings with the following errors: simplenews_scheduler.settings:langcode missing schema in Drupal\Core\Config\Testing\ConfigSchemaChecker->onConfigSave() (line 98 of /var/lib/drupaltestbot/sites/default/files/checkout/core/lib/Drupal/Core/Config/Testing/ConfigSchemaChecker.php). Drupal\Core\Config\Testing\ConfigSchemaChecker->onConfigSave(Object, 'config.save', Object) Drupal\Component\EventDispatcher\ContainerAwareEventDispatcher->dispatch('config.save', Object) Drupal\Core\Config\Config->save(1) Drupal\Core\Config\ConfigInstaller->createConfiguration('', Array) Drupal\Core\Config\ConfigInstaller->installDefaultConfig('module', 'simplenews_scheduler') Drupal\Core\ProxyClass\Config\ConfigInstaller->installDefaultConfig('module', 'simplenews_scheduler') Drupal\Core\Extension\ModuleInstaller->install(Array, 1) Drupal\Core\ProxyClass\Extension\ModuleInstaller->install(Array) Drupal\simplenews_demo\Tests\SimplenewsDemoTest->setUp() Drupal\simpletest\TestBase->run(Array) simpletest_script_run_one_test('1', 'Drupal\simplenews_demo\Tests\SimplenewsDemoTest') Uncaught exceptionConfigSchemaChecker.php98Drupal\Core\Config\Testing\ConfigSchemaChecker->onConfigSave()

All

Test namePassFailException
LeafDrupal\simplenews\Tests\SimplenewsAdministrationTest51900
LeafDrupal\simplenews\Tests\SimplenewsI18nTest5700
LeafDrupal\simplenews\Tests\SimplenewsKernelTest500
LeafDrupal\simplenews\Tests\SimplenewsMonitoringTest800
LeafDrupal\simplenews\Tests\SimplenewsPersonalizationFormsTest15400
LeafDrupal\simplenews\Tests\SimplenewsSendTest43000
LeafDrupal\simplenews\Tests\SimplenewsSourceTest28500
LeafDrupal\simplenews\Tests\SimplenewsSubscribeTest57000
LeafDrupal\simplenews\Tests\SimplenewsSynchronizeFieldsFormTest3200
LeafDrupal\simplenews\Tests\SimplenewsSynchronizeFieldsTest3400
LeafDrupal\simplenews\Tests\SimplenewsTestSubscriptionOutput4200
ExpandDrupal\simplenews_demo\Tests\SimplenewsDemoTest011
MessageGroupFilenameLineFunctionStatus
The test did not complete due to a fatal error.Completion checkSimplenewsDemoTest.php43Drupal\simplenews_demo\Tests\SimplenewsDemoTest->testInstalled()
Drupal\Core\Config\Schema\SchemaIncompleteException: Schema errors for simplenews_scheduler.settings with the following errors: simplenews_scheduler.settings:langcode missing schema in Drupal\Core\Config\Testing\ConfigSchemaChecker->onConfigSave() (line 98 of /var/lib/drupaltestbot/sites/default/files/checkout/core/lib/Drupal/Core/Config/Testing/ConfigSchemaChecker.php). Drupal\Core\Config\Testing\ConfigSchemaChecker->onConfigSave(Object, 'config.save', Object) Drupal\Component\EventDispatcher\ContainerAwareEventDispatcher->dispatch('config.save', Object) Drupal\Core\Config\Config->save(1) Drupal\Core\Config\ConfigInstaller->createConfiguration('', Array) Drupal\Core\Config\ConfigInstaller->installDefaultConfig('module', 'simplenews_scheduler') Drupal\Core\ProxyClass\Config\ConfigInstaller->installDefaultConfig('module', 'simplenews_scheduler') Drupal\Core\Extension\ModuleInstaller->install(Array, 1) Drupal\Core\ProxyClass\Extension\ModuleInstaller->install(Array) Drupal\simplenews_demo\Tests\SimplenewsDemoTest->setUp() Drupal\simpletest\TestBase->run(Array) simpletest_script_run_one_test('1', 'Drupal\simplenews_demo\Tests\SimplenewsDemoTest') Uncaught exceptionConfigSchemaChecker.php98Drupal\Core\Config\Testing\ConfigSchemaChecker->onConfigSave()