improve_matching-2548905-2.patch

Test status
StatusResult
Last receivedMon, 08/10/2015 - 16:40:00
Last requestedMon, 08/10/2015 - 16:40:01
Last testedMon, 08/10/2015 - 16:43:11
Test count1
Environment status
MySQLfail
File information
Fileimprove_matching-2548905-2.patch
BranchQuiz - 7.x-5.x
LinkIssue Link
SummaryFAILED: [[SimpleTest]]: [MySQL] 3,315 pass(es), 2 fail(s), and 0 exception(s).
Details

MySQL

  1. Setup environment
  2. Detect an invalid patch URL
  3. Detect invalid repository information
  4. Detect invalid patch format
  5. Detect a non-applicable patch
  6. Detect invalid PHP syntax
  7. Detect a Drupal installation failure
  8. Detect a test run failure
  9. Detect a failing test
    Review the test failures below then if necessary run them locally until the problem has been fixed.
  10. Complete test suite with all tests passing
3,315 pass(es), 2 fail(s), and 0 exception(s)

Non-pass

Test namePassFailException
ExpandQuiz upgrade (QuizUpgradeTestCase) [Quiz]23520
MessageGroupFilenameLineFunctionStatus
Failed: PDOException: SQLSTATE[42S02]: Base table or view not found: 1146 Table 'drupaltestbotmysql.drupal_quiz_node_results_answers' doesn't exist: UPDATE drupal_quiz_node_results_answers ra left join drupal_quiz_matching_user_answers mua on mua.result_id = ra.result_id left join drupal_quiz_matching_node mn on mn.match_id = mua.match_id SET mua.result_answer_id = ra.result_answer_id; Array ( ) in matching_update_7501() (line 184 of /var/lib/drupaltestbot/sites/default/files/checkout/sites/default/modules/quiz/question_types/matching/matching.install).Otherupgrade.test246UpgradePathTestCase->performUpgrade()
The upgrade was completed successfully.OtherQuizUpgradeTestCase.test47QuizUpgradeTestCase->test740Beta2Upgrade()

All

Test namePassFailException
LeafLong answer (LongAnswerTestCase) [Quiz]17000
LeafMatching (MatchingTestCase) [Quiz]15600
LeafMultichoice (MultichoiceTestCase) [Quiz]38600
LeafQuiz creation (QuizCreationTestCase) [Quiz]38300
LeafQuiz directions (QuizDirectionsTestCase) [Quiz]2700
LeafQuiz feedback (QuizFeedbackTestCase) [Quiz]23700
LeafQuiz navigation (QuizNavigationTestCase) [Quiz]18500
LeafQuiz page (QuizPageTestCase) [Quiz]11500
LeafQuiz question numbering (QuizQuestionNumbering) [Quiz]4300
LeafQuiz random (QuizRandomTestCase) [Quiz]11900
LeafQuiz results (QuizResultTestCase) [Quiz]32200
LeafQuiz taking (QuizTakingTestCase) [Quiz]32400
LeafQuiz timer (QuizTimerTestCase) [Quiz]3300
ExpandQuiz upgrade (QuizUpgradeTestCase) [Quiz]23520
MessageGroupFilenameLineFunctionStatus
Failed: PDOException: SQLSTATE[42S02]: Base table or view not found: 1146 Table 'drupaltestbotmysql.drupal_quiz_node_results_answers' doesn't exist: UPDATE drupal_quiz_node_results_answers ra left join drupal_quiz_matching_user_answers mua on mua.result_id = ra.result_id left join drupal_quiz_matching_node mn on mn.match_id = mua.match_id SET mua.result_answer_id = ra.result_answer_id; Array ( ) in matching_update_7501() (line 184 of /var/lib/drupaltestbot/sites/default/files/checkout/sites/default/modules/quiz/question_types/matching/matching.install).Otherupgrade.test246UpgradePathTestCase->performUpgrade()
The upgrade was completed successfully.OtherQuizUpgradeTestCase.test47QuizUpgradeTestCase->test740Beta2Upgrade()
LeafScale (ScaleTestCase) [Quiz]11300
LeafShort answer (ShortAnswerTestCase) [Quiz]30300
LeafTrue/False (TrueFalseTestCase) [Quiz]16400