examples-rest_example-1883784-32-D8.patch

Test status
StatusResult
Last receivedSun, 08/09/2015 - 23:20:00
Last requestedSun, 08/09/2015 - 23:20:01
Last testedSun, 08/09/2015 - 23:22:16
Test count1
Environment status
PHP 5.5 MySQLfail
File information
Fileexamples-rest_example-1883784-32-D8.patch
BranchExamples for Developers - 8.x-1.x
LinkIssue Link
SummaryFAILED: [[SimpleTest]]: [PHP 5.5 MySQL] 1,020 pass(es), 1 fail(s), and 1 exception(s).
Details

PHP 5.5 MySQL

  1. Setup environment
  2. Detect an invalid patch URL
  3. Detect invalid repository information
  4. Detect invalid patch format
  5. Detect a non-applicable patch
  6. Detect invalid PHP syntax
  7. Detect a Drupal installation failure
  8. Detect a test run failure
  9. Detect a failing test
    Review the test failures below then if necessary run them locally until the problem has been fixed.
  10. Complete test suite with all tests passing
1,020 pass(es), 1 fail(s), and 1 exception(s)

Non-pass

Test namePassFailException
ExpandDrupal\rest_example\Tests\RestExampleMenuTest011
MessageGroupFilenameLineFunctionStatus
The test did not complete due to a fatal error.Completion checkRestExampleMenuTest.php40Drupal\rest_example\Tests\RestExampleMenuTest->testRestExampleLink()
Drupal\Core\Config\Schema\SchemaIncompleteException: Schema errors for views.view.rest_service with the following errors: views.view.rest_service:display.default.display_options.fields.nid.settings.thousand_separator missing schema, views.view.rest_service:display.default.display_options.fields.nid.settings.prefix_suffix missing schema, views.view.rest_service:display.default.display_options.arguments.nid.validate_options missing schema in Drupal\Core\Config\Testing\ConfigSchemaChecker->onConfigSave() (line 98 of /var/lib/drupaltestbot/sites/default/files/checkout/core/lib/Drupal/Core/Config/Testing/ConfigSchemaChecker.php). Drupal\Core\Config\Testing\ConfigSchemaChecker->onConfigSave(Object, 'config.save', Object) Drupal\Component\EventDispatcher\ContainerAwareEventDispatcher->dispatch('config.save', Object) Drupal\Core\Config\Config->save(1) Drupal\Core\Config\Entity\ConfigEntityStorage->doSave('rest_service', Object) Drupal\Core\Entity\EntityStorageBase->save(Object) Drupal\Core\Config\Entity\ConfigEntityStorage->save(Object) Drupal\Core\Entity\Entity->save() Drupal\Core\Config\Entity\ConfigEntityBase->save() Drupal\Core\Config\ConfigInstaller->createConfiguration('', Array) Drupal\Core\Config\ConfigInstaller->installDefaultConfig('module', 'rest_example') Drupal\Core\ProxyClass\Config\ConfigInstaller->installDefaultConfig('module', 'rest_example') Drupal\Core\Extension\ModuleInstaller->install(Array, 1) Drupal\Core\ProxyClass\Extension\ModuleInstaller->install(Array, 1) Drupal\simpletest\WebTestBase->installModulesFromClassProperty(Object) Drupal\simpletest\WebTestBase->setUp() Drupal\simpletest\TestBase->run(Array) simpletest_script_run_one_test('23', 'Drupal\rest_example\Tests\RestExampleMenuTest') Uncaught exceptionConfigSchemaChecker.php98Drupal\Core\Config\Testing\ConfigSchemaChecker->onConfigSave()

All

Test namePassFailException
LeafDrupal\block_example\Tests\BlockExampleMenuTest800
LeafDrupal\block_example\Tests\BlockExampleTest2700
LeafDrupal\cache_example\Tests\CacheExampleTestCase5900
LeafDrupal\config_entity_example\Tests\ConfigEntityExampleTest7100
LeafDrupal\content_entity_example\Tests\ContentEntityExampleTest22500
LeafDrupal\dbtng_example\Tests\DBTNGExampleTest5900
LeafDrupal\email_example\Tests\EmailExampleTest2100
LeafDrupal\examples\Tests\ExamplesTest2100
LeafDrupal\field_example\Tests\FieldExampleMenuTest800
ExpandDrupal\field_example\Tests\Text3WidgetTest11700
MessageGroupFilenameLineFunctionStatus
Saved settings for field <em class="placeholder">qt2ihroynt</em> with widget <em class="placeholder">field_example_3text</em> and cardinality <em class="placeholder">1</em>DebugFieldExampleWebTestBase.php134Drupal\field_example\FieldExampleWebTestBase->createField()
Saved settings for field <em class="placeholder">cw0va1owcm</em> with widget <em class="placeholder">field_example_3text</em> and cardinality <em class="placeholder">-1</em>DebugFieldExampleWebTestBase.php134Drupal\field_example\FieldExampleWebTestBase->createField()
ExpandDrupal\field_example\Tests\TextWidgetTest11700
MessageGroupFilenameLineFunctionStatus
Saved settings for field <em class="placeholder">nl29oyewuk</em> with widget <em class="placeholder">field_example_text</em> and cardinality <em class="placeholder">1</em>DebugFieldExampleWebTestBase.php134Drupal\field_example\FieldExampleWebTestBase->createField()
Saved settings for field <em class="placeholder">cetfnq3qpd</em> with widget <em class="placeholder">field_example_text</em> and cardinality <em class="placeholder">-1</em>DebugFieldExampleWebTestBase.php134Drupal\field_example\FieldExampleWebTestBase->createField()
LeafDrupal\js_example\Tests\JsExampleTest1000
LeafDrupal\node_type_example\Tests\NodeTypeExampleTest4300
LeafDrupal\page_example\Tests\PageExampleTest9000
LeafDrupal\phpunit_example\Tests\PHPUnitExampleMenuTest800
ExpandDrupal\rest_example\Tests\RestExampleMenuTest011
MessageGroupFilenameLineFunctionStatus
The test did not complete due to a fatal error.Completion checkRestExampleMenuTest.php40Drupal\rest_example\Tests\RestExampleMenuTest->testRestExampleLink()
Drupal\Core\Config\Schema\SchemaIncompleteException: Schema errors for views.view.rest_service with the following errors: views.view.rest_service:display.default.display_options.fields.nid.settings.thousand_separator missing schema, views.view.rest_service:display.default.display_options.fields.nid.settings.prefix_suffix missing schema, views.view.rest_service:display.default.display_options.arguments.nid.validate_options missing schema in Drupal\Core\Config\Testing\ConfigSchemaChecker->onConfigSave() (line 98 of /var/lib/drupaltestbot/sites/default/files/checkout/core/lib/Drupal/Core/Config/Testing/ConfigSchemaChecker.php). Drupal\Core\Config\Testing\ConfigSchemaChecker->onConfigSave(Object, 'config.save', Object) Drupal\Component\EventDispatcher\ContainerAwareEventDispatcher->dispatch('config.save', Object) Drupal\Core\Config\Config->save(1) Drupal\Core\Config\Entity\ConfigEntityStorage->doSave('rest_service', Object) Drupal\Core\Entity\EntityStorageBase->save(Object) Drupal\Core\Config\Entity\ConfigEntityStorage->save(Object) Drupal\Core\Entity\Entity->save() Drupal\Core\Config\Entity\ConfigEntityBase->save() Drupal\Core\Config\ConfigInstaller->createConfiguration('', Array) Drupal\Core\Config\ConfigInstaller->installDefaultConfig('module', 'rest_example') Drupal\Core\ProxyClass\Config\ConfigInstaller->installDefaultConfig('module', 'rest_example') Drupal\Core\Extension\ModuleInstaller->install(Array, 1) Drupal\Core\ProxyClass\Extension\ModuleInstaller->install(Array, 1) Drupal\simpletest\WebTestBase->installModulesFromClassProperty(Object) Drupal\simpletest\WebTestBase->setUp() Drupal\simpletest\TestBase->run(Array) simpletest_script_run_one_test('23', 'Drupal\rest_example\Tests\RestExampleMenuTest') Uncaught exceptionConfigSchemaChecker.php98Drupal\Core\Config\Testing\ConfigSchemaChecker->onConfigSave()
LeafDrupal\simpletest_example\Tests\SimpleTestExampleMockModuleTest1200
LeafDrupal\simpletest_example\Tests\SimpleTestExampleTest3500
LeafDrupal\tablesort_example\Tests\TableSortExampleTest2700
LeafDrupal\Tests\phpunit_example\Unit\AddClassTest2700
LeafDrupal\Tests\phpunit_example\Unit\DisplayManagerTest100
LeafDrupal\Tests\phpunit_example\Unit\ProtectedPrivatesTest400
LeafDrupal\tour_example\Tests\TourExampleTest3000