2508107_26.patch

Test status
StatusResult
Last receivedFri, 08/07/2015 - 15:07:01
Last requestedFri, 08/07/2015 - 15:18:04
Last testedFri, 08/07/2015 - 15:19:45
Test count1
Environment status
PHP 5.5 MySQLfail
File information
File2508107_26.patch
BranchInline Entity Form - 8.x-1.x
LinkIssue Link
SummaryFAILED: [[SimpleTest]]: [PHP 5.5 MySQL] 0 pass(es), 1 fail(s), and 1 exception(s).
Details

PHP 5.5 MySQL

  1. Setup environment
  2. Detect an invalid patch URL
  3. Detect invalid repository information
  4. Detect invalid patch format
  5. Detect a non-applicable patch
  6. Detect invalid PHP syntax
  7. Detect a Drupal installation failure
  8. Detect a test run failure
  9. Detect a failing test
    Review the test failures below then if necessary run them locally until the problem has been fixed.
  10. Complete test suite with all tests passing
0 pass(es), 1 fail(s), and 1 exception(s)

Non-pass

Test namePassFailException
ExpandDrupal\inline_entity_form\Tests\InlineEntityFormWebTest011
MessageGroupFilenameLineFunctionStatus
The test did not complete due to a fatal error.Completion checkInlineEntityFormWebTest.php48Drupal\inline_entity_form\Tests\InlineEntityFormWebTest->testCustomFormIEF()
Drupal\Core\Config\Schema\SchemaIncompleteException: Schema errors for core.entity_form_display.node.ief_simple_single.default with the following errors: core.entity_form_display.node.ief_simple_single.default:content.single.settings.match_operator missing schema, core.entity_form_display.node.ief_simple_single.default:content.single.settings.allow_existing missing schema in Drupal\Core\Config\Testing\ConfigSchemaChecker->onConfigSave() (line 98 of /var/lib/drupaltestbot/sites/default/files/checkout/core/lib/Drupal/Core/Config/Testing/ConfigSchemaChecker.php). Drupal\Core\Config\Testing\ConfigSchemaChecker->onConfigSave(Object, 'config.save', Object) Drupal\Component\EventDispatcher\ContainerAwareEventDispatcher->dispatch('config.save', Object) Drupal\Core\Config\Config->save(1) Drupal\Core\Config\Entity\ConfigEntityStorage->doSave('node.ief_simple_single.default', Object) Drupal\Core\Entity\EntityStorageBase->save(Object) Drupal\Core\Config\Entity\ConfigEntityStorage->save(Object) Drupal\Core\Entity\Entity->save() Drupal\Core\Config\Entity\ConfigEntityBase->save() Drupal\Core\Config\ConfigInstaller->createConfiguration('', Array) Drupal\Core\Config\ConfigInstaller->installDefaultConfig('module', 'inline_entity_form_test') Drupal\Core\ProxyClass\Config\ConfigInstaller->installDefaultConfig('module', 'inline_entity_form_test') Drupal\Core\Extension\ModuleInstaller->install(Array, 1) Drupal\Core\ProxyClass\Extension\ModuleInstaller->install(Array, 1) Drupal\simpletest\WebTestBase->installModulesFromClassProperty(Object) Drupal\simpletest\WebTestBase->setUp() Drupal\inline_entity_form\Tests\InlineEntityFormWebTest->setUp() Drupal\simpletest\TestBase->run(Array) simpletest_script_run_one_test('1', 'Drupal\inline_entity_form\Tests\InlineEntityFormWebTest') Uncaught exceptionConfigSchemaChecker.php98Drupal\Core\Config\Testing\ConfigSchemaChecker->onConfigSave()

All

Test namePassFailException
ExpandDrupal\inline_entity_form\Tests\InlineEntityFormWebTest011
MessageGroupFilenameLineFunctionStatus
The test did not complete due to a fatal error.Completion checkInlineEntityFormWebTest.php48Drupal\inline_entity_form\Tests\InlineEntityFormWebTest->testCustomFormIEF()
Drupal\Core\Config\Schema\SchemaIncompleteException: Schema errors for core.entity_form_display.node.ief_simple_single.default with the following errors: core.entity_form_display.node.ief_simple_single.default:content.single.settings.match_operator missing schema, core.entity_form_display.node.ief_simple_single.default:content.single.settings.allow_existing missing schema in Drupal\Core\Config\Testing\ConfigSchemaChecker->onConfigSave() (line 98 of /var/lib/drupaltestbot/sites/default/files/checkout/core/lib/Drupal/Core/Config/Testing/ConfigSchemaChecker.php). Drupal\Core\Config\Testing\ConfigSchemaChecker->onConfigSave(Object, 'config.save', Object) Drupal\Component\EventDispatcher\ContainerAwareEventDispatcher->dispatch('config.save', Object) Drupal\Core\Config\Config->save(1) Drupal\Core\Config\Entity\ConfigEntityStorage->doSave('node.ief_simple_single.default', Object) Drupal\Core\Entity\EntityStorageBase->save(Object) Drupal\Core\Config\Entity\ConfigEntityStorage->save(Object) Drupal\Core\Entity\Entity->save() Drupal\Core\Config\Entity\ConfigEntityBase->save() Drupal\Core\Config\ConfigInstaller->createConfiguration('', Array) Drupal\Core\Config\ConfigInstaller->installDefaultConfig('module', 'inline_entity_form_test') Drupal\Core\ProxyClass\Config\ConfigInstaller->installDefaultConfig('module', 'inline_entity_form_test') Drupal\Core\Extension\ModuleInstaller->install(Array, 1) Drupal\Core\ProxyClass\Extension\ModuleInstaller->install(Array, 1) Drupal\simpletest\WebTestBase->installModulesFromClassProperty(Object) Drupal\simpletest\WebTestBase->setUp() Drupal\inline_entity_form\Tests\InlineEntityFormWebTest->setUp() Drupal\simpletest\TestBase->run(Array) simpletest_script_run_one_test('1', 'Drupal\inline_entity_form\Tests\InlineEntityFormWebTest') Uncaught exceptionConfigSchemaChecker.php98Drupal\Core\Config\Testing\ConfigSchemaChecker->onConfigSave()