fix_config_schema-2547365-2.patch

Test status
StatusResult
Last receivedFri, 08/07/2015 - 10:33:00
Last requestedFri, 08/07/2015 - 10:36:36
Last testedFri, 08/07/2015 - 10:39:40
Test count1
Environment status
PHP 5.5 MySQLfail
File information
Filefix_config_schema-2547365-2.patch
BranchTranslation Management Tool - 8.x-1.x
LinkIssue Link
SummaryFAILED: [[SimpleTest]]: [PHP 5.5 MySQL] 1,793 pass(es), 301 fail(s), and 57 exception(s).
Details

PHP 5.5 MySQL

  1. Setup environment
  2. Detect an invalid patch URL
  3. Detect invalid repository information
  4. Detect invalid patch format
  5. Detect a non-applicable patch
  6. Detect invalid PHP syntax
  7. Detect a Drupal installation failure
  8. Detect a test run failure
  9. Detect a failing test
    Review the test failures below then if necessary run them locally until the problem has been fixed.
  10. Complete test suite with all tests passing
1,793 pass(es), 301 fail(s), and 57 exception(s)

Non-pass

Test namePassFailException
ExpandDrupal\tmgmt\Tests\TMGMTCartTest4751
MessageGroupFilenameLineFunctionStatus
Object of class Drupal\views\Entity\View could not be converted to stringRecoverable fatal errorSql.php1457Drupal\views\Plugin\views\query\Sql->execute()
"One job needs to be checked out." foundOtherTMGMTCartTest.php84Drupal\tmgmt\Tests\TMGMTCartTest->testCartEnforceSourceLanguage()
Raw "One item skipped as for the language English it was not possible to retrieve a translation." foundOtherTMGMTCartTest.php85Drupal\tmgmt\Tests\TMGMTCartTest->testCartEnforceSourceLanguage()
"You have enforced the the job source language which most likely resulted in having a translation of your original content as the job source text. You should review the job translation received from the translator carefully to prevent the content quality loss." foundOtherTMGMTCartTest.php86Drupal\tmgmt\Tests\TMGMTCartTest->testCartEnforceSourceLanguage()
Found the Submit to translator buttonOtherTMGMTCartTest.php91Drupal\tmgmt\Tests\TMGMTCartTest->testCartEnforceSourceLanguage()
Found the requested form fields at OtherTMGMTCartTest.php91Drupal\tmgmt\Tests\TMGMTCartTest->testCartEnforceSourceLanguage()
ExpandDrupal\tmgmt\Tests\TMGMTUiTest2168320
MessageGroupFilenameLineFunctionStatus
Object of class Drupal\views\Entity\View could not be converted to stringRecoverable fatal errorSql.php1457Drupal\views\Plugin\views\query\Sql->execute()
"test_source:test:1" foundOtherTMGMTUiTest.php68Drupal\tmgmt\Tests\TMGMTUiTest->testCheckoutForm()
Object of class Drupal\views\Entity\View could not be converted to stringRecoverable fatal errorSql.php1457Drupal\views\Plugin\views\query\Sql->execute()
"test_source:test:1" foundOtherTMGMTUiTest.php79Drupal\tmgmt\Tests\TMGMTUiTest->testCheckoutForm()
"test_source:test:2" foundOtherTMGMTUiTest.php80Drupal\tmgmt\Tests\TMGMTUiTest->testCheckoutForm()
"test_source:test:3" foundOtherTMGMTUiTest.php81Drupal\tmgmt\Tests\TMGMTUiTest->testCheckoutForm()
Failed to set field target_language to elOtherTMGMTUiTest.php90Drupal\tmgmt\Tests\TMGMTUiTest->testCheckoutForm()
Failed to set field settings[action] to translateOtherTMGMTUiTest.php90Drupal\tmgmt\Tests\TMGMTUiTest->testCheckoutForm()
Found the Submit to translator buttonOtherTMGMTUiTest.php90Drupal\tmgmt\Tests\TMGMTUiTest->testCheckoutForm()
Found the requested form fields at OtherTMGMTUiTest.php90Drupal\tmgmt\Tests\TMGMTUiTest->testCheckoutForm()
"Test translator (auto created) can not translate from English to Greek." foundOtherTMGMTUiTest.php91Drupal\tmgmt\Tests\TMGMTUiTest->testCheckoutForm()
Failed to set field target_language to esOtherTMGMTUiTest.php101Drupal\tmgmt\Tests\TMGMTUiTest->testCheckoutForm()
Failed to set field settings[action] to translateOtherTMGMTUiTest.php101Drupal\tmgmt\Tests\TMGMTUiTest->testCheckoutForm()
Found the Submit to translator buttonOtherTMGMTUiTest.php101Drupal\tmgmt\Tests\TMGMTUiTest->testCheckoutForm()
Found the requested form fields at OtherTMGMTUiTest.php101Drupal\tmgmt\Tests\TMGMTUiTest->testCheckoutForm()
Value false is TRUE.OtherTMGMTUiTest.php105Drupal\tmgmt\Tests\TMGMTUiTest->testCheckoutForm()
Value false is TRUE.OtherTMGMTUiTest.php108Drupal\tmgmt\Tests\TMGMTUiTest->testCheckoutForm()
Value false is TRUE.OtherTMGMTUiTest.php108Drupal\tmgmt\Tests\TMGMTUiTest->testCheckoutForm()
Value false is TRUE.OtherTMGMTUiTest.php108Drupal\tmgmt\Tests\TMGMTUiTest->testCheckoutForm()
"Test translation created" foundOtherTMGMTUiTest.php110Drupal\tmgmt\Tests\TMGMTUiTest->testCheckoutForm()
"Job overview" foundOtherTMGMTUiTest.php114Drupal\tmgmt\Tests\TMGMTUiTest->testCheckoutForm()
Value '1' is not equal to value '1'.OtherTMGMTUiTest.php120Drupal\tmgmt\Tests\TMGMTUiTest->testCheckoutForm()
Object of class Drupal\views\Entity\View could not be converted to stringRecoverable fatal errorSql.php1457Drupal\views\Plugin\views\query\Sql->execute()
"You can provide a label for this job in order to identify it easily later on." foundOtherTMGMTUiTest.php127Drupal\tmgmt\Tests\TMGMTUiTest->testCheckoutForm()
"test_source:test:1" foundOtherTMGMTUiTest.php128Drupal\tmgmt\Tests\TMGMTUiTest->testCheckoutForm()
Failed to set field target_language to esOtherTMGMTUiTest.php134Drupal\tmgmt\Tests\TMGMTUiTest->testCheckoutForm()
Failed to set field settings[action] to submitOtherTMGMTUiTest.php134Drupal\tmgmt\Tests\TMGMTUiTest->testCheckoutForm()
Found the Submit to translator buttonOtherTMGMTUiTest.php134Drupal\tmgmt\Tests\TMGMTUiTest->testCheckoutForm()
Found the requested form fields at OtherTMGMTUiTest.php134Drupal\tmgmt\Tests\TMGMTUiTest->testCheckoutForm()
"Test submit" foundOtherTMGMTUiTest.php135Drupal\tmgmt\Tests\TMGMTUiTest->testCheckoutForm()
Value false is TRUE.OtherTMGMTUiTest.php137Drupal\tmgmt\Tests\TMGMTUiTest->testCheckoutForm()
Object of class Drupal\views\Entity\View could not be converted to stringRecoverable fatal errorSql.php1457Drupal\views\Plugin\views\query\Sql->execute()
"You can provide a label for this job in order to identify it easily later on." foundOtherTMGMTUiTest.php148Drupal\tmgmt\Tests\TMGMTUiTest->testCheckoutForm()
"test_source:test:1" foundOtherTMGMTUiTest.php149Drupal\tmgmt\Tests\TMGMTUiTest->testCheckoutForm()
Failed to set field settings[action] to rejectOtherTMGMTUiTest.php154Drupal\tmgmt\Tests\TMGMTUiTest->testCheckoutForm()
Found the Submit to translator buttonOtherTMGMTUiTest.php154Drupal\tmgmt\Tests\TMGMTUiTest->testCheckoutForm()
Found the requested form fields at OtherTMGMTUiTest.php154Drupal\tmgmt\Tests\TMGMTUiTest->testCheckoutForm()
"This is not supported" foundOtherTMGMTUiTest.php155Drupal\tmgmt\Tests\TMGMTUiTest->testCheckoutForm()
Value false is TRUE.OtherTMGMTUiTest.php157Drupal\tmgmt\Tests\TMGMTUiTest->testCheckoutForm()
Value 2 is equal to value 0.OtherTMGMTUiTest.php161Drupal\tmgmt\Tests\TMGMTUiTest->testCheckoutForm()
Value 2 is equal to value 0.OtherTMGMTUiTest.php165Drupal\tmgmt\Tests\TMGMTUiTest->testCheckoutForm()
Failed to set field settings[action] to translateOtherTMGMTUiTest.php175Drupal\tmgmt\Tests\TMGMTUiTest->testCheckoutForm()
Found the Submit to translator buttonOtherTMGMTUiTest.php175Drupal\tmgmt\Tests\TMGMTUiTest->testCheckoutForm()
Found the requested form fields at OtherTMGMTUiTest.php175Drupal\tmgmt\Tests\TMGMTUiTest->testCheckoutForm()
"Test translation created" foundOtherTMGMTUiTest.php176Drupal\tmgmt\Tests\TMGMTUiTest->testCheckoutForm()
Object of class Drupal\views\Entity\View could not be converted to stringRecoverable fatal errorSql.php1457Drupal\views\Plugin\views\query\Sql->execute()
"You can provide a label for this job in order to identify it easily later on." foundOtherTMGMTUiTest.php187Drupal\tmgmt\Tests\TMGMTUiTest->testCheckoutForm()
"test_source:test:1" foundOtherTMGMTUiTest.php188Drupal\tmgmt\Tests\TMGMTUiTest->testCheckoutForm()
Failed to set field settings[action] to failOtherTMGMTUiTest.php193Drupal\tmgmt\Tests\TMGMTUiTest->testCheckoutForm()
Found the Submit to translator buttonOtherTMGMTUiTest.php193Drupal\tmgmt\Tests\TMGMTUiTest->testCheckoutForm()
Found the requested form fields at OtherTMGMTUiTest.php193Drupal\tmgmt\Tests\TMGMTUiTest->testCheckoutForm()
"Service not reachable" foundOtherTMGMTUiTest.php194Drupal\tmgmt\Tests\TMGMTUiTest->testCheckoutForm()
"You can provide a label for this job in order to identify it easily later on." foundOtherTMGMTUiTest.php199Drupal\tmgmt\Tests\TMGMTUiTest->testCheckoutForm()
Object of class Drupal\views\Entity\View could not be converted to stringRecoverable fatal errorSql.php1457Drupal\views\Plugin\views\query\Sql->execute()
"You can provide a label for this job in order to identify it easily later on." foundOtherTMGMTUiTest.php210Drupal\tmgmt\Tests\TMGMTUiTest->testCheckoutForm()
"test_source:test:1" foundOtherTMGMTUiTest.php211Drupal\tmgmt\Tests\TMGMTUiTest->testCheckoutForm()
Failed to set field settings[action] to not_translatableOtherTMGMTUiTest.php216Drupal\tmgmt\Tests\TMGMTUiTest->testCheckoutForm()
Found the Submit to translator buttonOtherTMGMTUiTest.php216Drupal\tmgmt\Tests\TMGMTUiTest->testCheckoutForm()
Found the requested form fields at OtherTMGMTUiTest.php216Drupal\tmgmt\Tests\TMGMTUiTest->testCheckoutForm()
"Fail" foundOtherTMGMTUiTest.php218Drupal\tmgmt\Tests\TMGMTUiTest->testCheckoutForm()
Object of class Drupal\views\Entity\View could not be converted to stringRecoverable fatal errorSql.php1457Drupal\views\Plugin\views\query\Sql->execute()
"You can provide a label for this job in order to identify it easily later on." foundOtherTMGMTUiTest.php233Drupal\tmgmt\Tests\TMGMTUiTest->testCheckoutForm()
"test_source:test:1" foundOtherTMGMTUiTest.php234Drupal\tmgmt\Tests\TMGMTUiTest->testCheckoutForm()
Found the Submit to translator buttonOtherTMGMTUiTest.php237Drupal\tmgmt\Tests\TMGMTUiTest->testCheckoutForm()
Found the requested form fields at OtherTMGMTUiTest.php237Drupal\tmgmt\Tests\TMGMTUiTest->testCheckoutForm()
"This is not supported." foundOtherTMGMTUiTest.php238Drupal\tmgmt\Tests\TMGMTUiTest->testCheckoutForm()
Value false is TRUE.OtherTMGMTUiTest.php240Drupal\tmgmt\Tests\TMGMTUiTest->testCheckoutForm()
Object of class Drupal\views\Entity\View could not be converted to stringRecoverable fatal errorSql.php1457Drupal\views\Plugin\views\query\Sql->execute()
Undefined offset: 0Drupal\simpletest\WebTestBase->drupalPostAjaxForm('admin/tmgmt/jobs/3', Array, 'target_language') Drupal\tmgmt\Tests\TMGMTUiTest->testCheckoutForm() Drupal\simpletest\TestBase->run(Array) simpletest_script_run_one_test('13', 'Drupal\tmgmt\Tests\TMGMTUiTest') NoticeWebTestBase.php1826Drupal\simpletest\WebTestBase->drupalPostAjaxForm()
Undefined index: ajaxDrupal\simpletest\WebTestBase->drupalPostAjaxForm('admin/tmgmt/jobs/3', Array, 'target_language') Drupal\tmgmt\Tests\TMGMTUiTest->testCheckoutForm() Drupal\simpletest\TestBase->run(Array) simpletest_script_run_one_test('13', 'Drupal\tmgmt\Tests\TMGMTUiTest') NoticeWebTestBase.php1827Drupal\simpletest\WebTestBase->drupalPostAjaxForm()
Exception: No #ajax path specified. in Drupal\simpletest\WebTestBase->drupalPostAjaxForm() (line 1863 of /var/lib/drupaltestbot/sites/default/files/checkout/core/modules/simpletest/src/WebTestBase.php). Drupal\simpletest\WebTestBase->drupalPostAjaxForm('admin/tmgmt/jobs/3', Array, 'target_language') Drupal\tmgmt\Tests\TMGMTUiTest->testCheckoutForm() Drupal\simpletest\TestBase->run(Array) simpletest_script_run_one_test('13', 'Drupal\tmgmt\Tests\TMGMTUiTest') Uncaught exceptionWebTestBase.php1863Drupal\simpletest\WebTestBase->drupalPostAjaxForm()
Object of class Drupal\views\Entity\View could not be converted to stringRecoverable fatal errorSql.php1457Drupal\views\Plugin\views\query\Sql->execute()
Failed to set field target_language to deOtherTMGMTUiTest.php492Drupal\tmgmt\Tests\TMGMTUiTest->testReview()
Failed to set field settings[action] to translateOtherTMGMTUiTest.php492Drupal\tmgmt\Tests\TMGMTUiTest->testReview()
Found the Submit to translator buttonOtherTMGMTUiTest.php492Drupal\tmgmt\Tests\TMGMTUiTest->testReview()
Found the requested form fields at admin/tmgmt/jobs/1OtherTMGMTUiTest.php492Drupal\tmgmt\Tests\TMGMTUiTest->testReview()
Object of class Drupal\views\Entity\View could not be converted to stringRecoverable fatal errorSql.php1457Drupal\views\Plugin\views\query\Sql->execute()
Object of class Drupal\views\Entity\View could not be converted to stringRecoverable fatal errorSql.php1457Drupal\views\Plugin\views\query\Sql->execute()
Raw "20" foundOtherTMGMTUiTest.php520Drupal\tmgmt\Tests\TMGMTUiTest->testSuggestions()
Undefined offset: 0Drupal\simpletest\WebTestBase->drupalPostAjaxForm(NULL, Array, Array) Drupal\tmgmt\Tests\TMGMTUiTest->testSuggestions() Drupal\simpletest\TestBase->run(Array) simpletest_script_run_one_test('13', 'Drupal\tmgmt\Tests\TMGMTUiTest') NoticeWebTestBase.php1826Drupal\simpletest\WebTestBase->drupalPostAjaxForm()
Undefined index: ajaxDrupal\simpletest\WebTestBase->drupalPostAjaxForm(NULL, Array, Array) Drupal\tmgmt\Tests\TMGMTUiTest->testSuggestions() Drupal\simpletest\TestBase->run(Array) simpletest_script_run_one_test('13', 'Drupal\tmgmt\Tests\TMGMTUiTest') NoticeWebTestBase.php1827Drupal\simpletest\WebTestBase->drupalPostAjaxForm()
Exception: No #ajax path specified. in Drupal\simpletest\WebTestBase->drupalPostAjaxForm() (line 1863 of /var/lib/drupaltestbot/sites/default/files/checkout/core/modules/simpletest/src/WebTestBase.php). Drupal\simpletest\WebTestBase->drupalPostAjaxForm(NULL, Array, Array) Drupal\tmgmt\Tests\TMGMTUiTest->testSuggestions() Drupal\simpletest\TestBase->run(Array) simpletest_script_run_one_test('13', 'Drupal\tmgmt\Tests\TMGMTUiTest') Uncaught exceptionWebTestBase.php1863Drupal\simpletest\WebTestBase->drupalPostAjaxForm()
The test did not complete due to a fatal error.Completion checkTMGMTUiTest.php578Drupal\tmgmt\Tests\TMGMTUiTest->testAbortJob()
Object of class Drupal\views\Entity\View could not be converted to stringRecoverable fatal errorSql.php1457Drupal\views\Plugin\views\query\Sql->execute()
Failed to set field target_language to esOtherTMGMTUiTest.php588Drupal\tmgmt\Tests\TMGMTUiTest->testAbortJob()
Failed to set field settings[action] to translateOtherTMGMTUiTest.php588Drupal\tmgmt\Tests\TMGMTUiTest->testAbortJob()
Found the Submit to translator buttonOtherTMGMTUiTest.php588Drupal\tmgmt\Tests\TMGMTUiTest->testAbortJob()
Found the requested form fields at admin/tmgmt/jobs/1OtherTMGMTUiTest.php588Drupal\tmgmt\Tests\TMGMTUiTest->testAbortJob()
Object of class Drupal\views\Entity\View could not be converted to stringRecoverable fatal errorSql.php1457Drupal\views\Plugin\views\query\Sql->execute()
Found the Abort job buttonOtherTMGMTUiTest.php591Drupal\tmgmt\Tests\TMGMTUiTest->testAbortJob()
Found the requested form fields at admin/tmgmt/jobs/1OtherTMGMTUiTest.php591Drupal\tmgmt\Tests\TMGMTUiTest->testAbortJob()
Found the Confirm buttonOtherTMGMTUiTest.php592Drupal\tmgmt\Tests\TMGMTUiTest->testAbortJob()
Found the requested form fields at OtherTMGMTUiTest.php592Drupal\tmgmt\Tests\TMGMTUiTest->testAbortJob()
Value false is TRUE.OtherTMGMTUiTest.php596Drupal\tmgmt\Tests\TMGMTUiTest->testAbortJob()
Value false is TRUE.OtherTMGMTUiTest.php598Drupal\tmgmt\Tests\TMGMTUiTest->testAbortJob()
Value false is TRUE.OtherTMGMTUiTest.php598Drupal\tmgmt\Tests\TMGMTUiTest->testAbortJob()
Value false is TRUE.OtherTMGMTUiTest.php598Drupal\tmgmt\Tests\TMGMTUiTest->testAbortJob()
Object of class Drupal\views\Entity\View could not be converted to stringRecoverable fatal errorSql.php1457Drupal\views\Plugin\views\query\Sql->execute()
Found the Resubmit buttonOtherTMGMTUiTest.php602Drupal\tmgmt\Tests\TMGMTUiTest->testAbortJob()
Found the requested form fields at admin/tmgmt/jobs/1OtherTMGMTUiTest.php602Drupal\tmgmt\Tests\TMGMTUiTest->testAbortJob()
Found the Confirm buttonOtherTMGMTUiTest.php603Drupal\tmgmt\Tests\TMGMTUiTest->testAbortJob()
Found the requested form fields at OtherTMGMTUiTest.php603Drupal\tmgmt\Tests\TMGMTUiTest->testAbortJob()
Raw "This job is a duplicate of the previously aborted job #1" foundOtherTMGMTUiTest.php606Drupal\tmgmt\Tests\TMGMTUiTest->testAbortJob()
ExpandDrupal\tmgmt_config\Tests\ConfigSourceListTest161638
MessageGroupFilenameLineFunctionStatus
Object of class Drupal\views\Entity\View could not be converted to stringRecoverable fatal errorSql.php1457Drupal\views\Plugin\views\query\Sql->execute()
"One job needs to be checked out." foundOtherConfigSourceListTest.php65Drupal\tmgmt_config\Tests\ConfigSourceListTest->testNodeTypeSubmissions()
"Article content type (English to ?, Unprocessed)" foundOtherConfigSourceListTest.php66Drupal\tmgmt_config\Tests\ConfigSourceListTest->testNodeTypeSubmissions()
Found the Submit to translator buttonOtherConfigSourceListTest.php69Drupal\tmgmt_config\Tests\ConfigSourceListTest->testNodeTypeSubmissions()
Found the requested form fields at OtherConfigSourceListTest.php69Drupal\tmgmt_config\Tests\ConfigSourceListTest->testNodeTypeSubmissions()
Expected 'http://ec2-52-27-196-164.us-west-2.compute.amazonaws.com/checkout/admin/tmgmt/sources/config/node_type' matches current URL (http://ec2-52-27-196-164.us-west-2.compute.amazonaws.com/checkout/admin/tmgmt/jobs/1).OtherConfigSourceListTest.php72Drupal\tmgmt_config\Tests\ConfigSourceListTest->testNodeTypeSubmissions()
"Test translation created." foundOtherConfigSourceListTest.php74Drupal\tmgmt_config\Tests\ConfigSourceListTest->testNodeTypeSubmissions()
"The translation of Article content type to German is finished and can now be reviewed." foundOtherConfigSourceListTest.php75Drupal\tmgmt_config\Tests\ConfigSourceListTest->testNodeTypeSubmissions()
Object of class Drupal\views\Entity\View could not be converted to stringRecoverable fatal errorSql.php1457Drupal\views\Plugin\views\query\Sql->execute()
"One job needs to be checked out." foundOtherConfigSourceListTest.php86Drupal\tmgmt_config\Tests\ConfigSourceListTest->testNodeTypeSubmissions()
"Article content type and 1 more (English to ?, Unprocessed)" foundOtherConfigSourceListTest.php87Drupal\tmgmt_config\Tests\ConfigSourceListTest->testNodeTypeSubmissions()
Found the Submit to translator buttonOtherConfigSourceListTest.php90Drupal\tmgmt_config\Tests\ConfigSourceListTest->testNodeTypeSubmissions()
Found the requested form fields at OtherConfigSourceListTest.php90Drupal\tmgmt_config\Tests\ConfigSourceListTest->testNodeTypeSubmissions()
Expected 'http://ec2-52-27-196-164.us-west-2.compute.amazonaws.com/checkout/admin/tmgmt/sources/config/node_type' matches current URL (http://ec2-52-27-196-164.us-west-2.compute.amazonaws.com/checkout/admin/tmgmt/jobs/2).OtherConfigSourceListTest.php93Drupal\tmgmt_config\Tests\ConfigSourceListTest->testNodeTypeSubmissions()
"Test translation created." foundOtherConfigSourceListTest.php95Drupal\tmgmt_config\Tests\ConfigSourceListTest->testNodeTypeSubmissions()
"The translation of Article content type to German is finished and can now be reviewed." foundOtherConfigSourceListTest.php96Drupal\tmgmt_config\Tests\ConfigSourceListTest->testNodeTypeSubmissions()
"The translation of Page content type to German is finished and can now be reviewed." foundOtherConfigSourceListTest.php97Drupal\tmgmt_config\Tests\ConfigSourceListTest->testNodeTypeSubmissions()
Object of class Drupal\views\Entity\View could not be converted to stringRecoverable fatal errorSql.php1457Drupal\views\Plugin\views\query\Sql->execute()
"One job needs to be checked out." foundOtherConfigSourceListTest.php114Drupal\tmgmt_config\Tests\ConfigSourceListTest->testViewTranslation()
"Archive view (English to ?, Unprocessed)" foundOtherConfigSourceListTest.php115Drupal\tmgmt_config\Tests\ConfigSourceListTest->testViewTranslation()
Found the Submit to translator buttonOtherConfigSourceListTest.php118Drupal\tmgmt_config\Tests\ConfigSourceListTest->testViewTranslation()
Found the requested form fields at OtherConfigSourceListTest.php118Drupal\tmgmt_config\Tests\ConfigSourceListTest->testViewTranslation()
Expected 'http://ec2-52-27-196-164.us-west-2.compute.amazonaws.com/checkout/admin/tmgmt/sources/config/view' matches current URL (http://ec2-52-27-196-164.us-west-2.compute.amazonaws.com/checkout/admin/tmgmt/jobs/1).OtherConfigSourceListTest.php121Drupal\tmgmt_config\Tests\ConfigSourceListTest->testViewTranslation()
"Test translation created." foundOtherConfigSourceListTest.php123Drupal\tmgmt_config\Tests\ConfigSourceListTest->testViewTranslation()
"The translation of Archive view to German is finished and can now be reviewed." foundOtherConfigSourceListTest.php124Drupal\tmgmt_config\Tests\ConfigSourceListTest->testViewTranslation()
Failed to set field items[views.view.archive] to 1OtherConfigSourceListTest.php134Drupal\tmgmt_config\Tests\ConfigSourceListTest->testViewTranslation()
Failed to set field items[views.view.content_recent] to 1OtherConfigSourceListTest.php134Drupal\tmgmt_config\Tests\ConfigSourceListTest->testViewTranslation()
Failed to set field items[views.view.content] to 1OtherConfigSourceListTest.php134Drupal\tmgmt_config\Tests\ConfigSourceListTest->testViewTranslation()
Failed to set field items[views.view.tmgmt_job_overview] to 1OtherConfigSourceListTest.php134Drupal\tmgmt_config\Tests\ConfigSourceListTest->testViewTranslation()
Found the Request translation buttonOtherConfigSourceListTest.php134Drupal\tmgmt_config\Tests\ConfigSourceListTest->testViewTranslation()
Found the requested form fields at OtherConfigSourceListTest.php134Drupal\tmgmt_config\Tests\ConfigSourceListTest->testViewTranslation()
"One job needs to be checked out." foundOtherConfigSourceListTest.php137Drupal\tmgmt_config\Tests\ConfigSourceListTest->testViewTranslation()
"Archive view and 3 more (English to ?, Unprocessed)" foundOtherConfigSourceListTest.php138Drupal\tmgmt_config\Tests\ConfigSourceListTest->testViewTranslation()
Found the Submit to translator buttonOtherConfigSourceListTest.php141Drupal\tmgmt_config\Tests\ConfigSourceListTest->testViewTranslation()
Found the requested form fields at OtherConfigSourceListTest.php141Drupal\tmgmt_config\Tests\ConfigSourceListTest->testViewTranslation()
Expected 'http://ec2-52-27-196-164.us-west-2.compute.amazonaws.com/checkout/admin/tmgmt/sources/config/view' matches current URL (http://ec2-52-27-196-164.us-west-2.compute.amazonaws.com/checkout/admin/tmgmt/jobs/1).OtherConfigSourceListTest.php144Drupal\tmgmt_config\Tests\ConfigSourceListTest->testViewTranslation()
"Test translation created." foundOtherConfigSourceListTest.php146Drupal\tmgmt_config\Tests\ConfigSourceListTest->testViewTranslation()
"The translation of Archive view to German is finished and can now be reviewed." foundOtherConfigSourceListTest.php147Drupal\tmgmt_config\Tests\ConfigSourceListTest->testViewTranslation()
"The translation of Recent content view to German is finished and can now be reviewed." foundOtherConfigSourceListTest.php148Drupal\tmgmt_config\Tests\ConfigSourceListTest->testViewTranslation()
"The translation of Content view to German is finished and can now be reviewed." foundOtherConfigSourceListTest.php149Drupal\tmgmt_config\Tests\ConfigSourceListTest->testViewTranslation()
"The translation of Job overview view to German is finished and can now be reviewed." foundOtherConfigSourceListTest.php150Drupal\tmgmt_config\Tests\ConfigSourceListTest->testViewTranslation()
Failed to set field items[views.view.tmgmt_job_items] to 1OtherConfigSourceListTest.php156Drupal\tmgmt_config\Tests\ConfigSourceListTest->testViewTranslation()
Found the Add to cart buttonOtherConfigSourceListTest.php156Drupal\tmgmt_config\Tests\ConfigSourceListTest->testViewTranslation()
Found the requested form fields at OtherConfigSourceListTest.php156Drupal\tmgmt_config\Tests\ConfigSourceListTest->testViewTranslation()
Link cart does not exist on http://ec2-52-27-196-164.us-west-2.compute.amazonaws.com/checkout/admin/tmgmt/jobs/1BrowserConfigSourceListTest.php157Drupal\tmgmt_config\Tests\ConfigSourceListTest->testViewTranslation()
Undefined offset: 0Drupal\tmgmt_config\Tests\ConfigSourceListTest->testViewTranslation() Drupal\simpletest\TestBase->run(Array) simpletest_script_run_one_test('10', 'Drupal\tmgmt_config\Tests\ConfigSourceListTest') NoticeConfigSourceListTest.php160Drupal\tmgmt_config\Tests\ConfigSourceListTest->testViewTranslation()
Trying to get property of non-objectDrupal\tmgmt_config\Tests\ConfigSourceListTest->testViewTranslation() Drupal\simpletest\TestBase->run(Array) simpletest_script_run_one_test('10', 'Drupal\tmgmt_config\Tests\ConfigSourceListTest') NoticeConfigSourceListTest.php160Drupal\tmgmt_config\Tests\ConfigSourceListTest->testViewTranslation()
Value '' is equal to value 'Cart'.OtherConfigSourceListTest.php161Drupal\tmgmt_config\Tests\ConfigSourceListTest->testViewTranslation()
Page title '' is equal to 'Cart | Drupal'.OtherConfigSourceListTest.php162Drupal\tmgmt_config\Tests\ConfigSourceListTest->testViewTranslation()
"Request translation" foundOtherConfigSourceListTest.php163Drupal\tmgmt_config\Tests\ConfigSourceListTest->testViewTranslation()
Object of class Drupal\views\Entity\View could not be converted to stringRecoverable fatal errorSql.php1457Drupal\views\Plugin\views\query\Sql->execute()
"One job needs to be checked out." foundOtherConfigSourceListTest.php244Drupal\tmgmt_config\Tests\ConfigSourceListTest->testSimpleConfigTranslation()
"System information (English to ?, Unprocessed)" foundOtherConfigSourceListTest.php245Drupal\tmgmt_config\Tests\ConfigSourceListTest->testSimpleConfigTranslation()
Found the Submit to translator buttonOtherConfigSourceListTest.php248Drupal\tmgmt_config\Tests\ConfigSourceListTest->testSimpleConfigTranslation()
Found the requested form fields at OtherConfigSourceListTest.php248Drupal\tmgmt_config\Tests\ConfigSourceListTest->testSimpleConfigTranslation()
Expected 'http://ec2-52-27-196-164.us-west-2.compute.amazonaws.com/checkout/admin/tmgmt/sources/config/_simple_config' matches current URL (http://ec2-52-27-196-164.us-west-2.compute.amazonaws.com/checkout/admin/tmgmt/jobs/1).OtherConfigSourceListTest.php251Drupal\tmgmt_config\Tests\ConfigSourceListTest->testSimpleConfigTranslation()
Raw "href="/checkout/admin/tmgmt/items/1?destination=admin/tmgmt/sources/config/_simple_config" title="Active job item: Needs review"" foundOtherConfigSourceListTest.php257Drupal\tmgmt_config\Tests\ConfigSourceListTest->testSimpleConfigTranslation()
"Test translation created." foundOtherConfigSourceListTest.php259Drupal\tmgmt_config\Tests\ConfigSourceListTest->testSimpleConfigTranslation()
"The translation of System information to German is finished and can now be reviewed." foundOtherConfigSourceListTest.php260Drupal\tmgmt_config\Tests\ConfigSourceListTest->testSimpleConfigTranslation()
Undefined offset: 0Drupal\tmgmt_config\Tests\ConfigSourceListTest->testSimpleConfigTranslation() Drupal\simpletest\TestBase->run(Array) simpletest_script_run_one_test('10', 'Drupal\tmgmt_config\Tests\ConfigSourceListTest') NoticeConfigSourceListTest.php264Drupal\tmgmt_config\Tests\ConfigSourceListTest->testSimpleConfigTranslation()
Uninitialized string offset: 0Drupal\simpletest\WebTestBase->getAbsoluteUrl(NULL) Drupal\tmgmt_config\Tests\ConfigSourceListTest->testSimpleConfigTranslation() Drupal\simpletest\TestBase->run(Array) simpletest_script_run_one_test('10', 'Drupal\tmgmt_config\Tests\ConfigSourceListTest') NoticeWebTestBase.php2468Drupal\simpletest\WebTestBase->getAbsoluteUrl()
Found the Save buttonOtherConfigSourceListTest.php266Drupal\tmgmt_config\Tests\ConfigSourceListTest->testSimpleConfigTranslation()
Found the requested form fields at OtherConfigSourceListTest.php266Drupal\tmgmt_config\Tests\ConfigSourceListTest->testSimpleConfigTranslation()
Failed to set field items[entity.user.admin_form] to 1OtherConfigSourceListTest.php272Drupal\tmgmt_config\Tests\ConfigSourceListTest->testSimpleConfigTranslation()
Found the Request translation buttonOtherConfigSourceListTest.php272Drupal\tmgmt_config\Tests\ConfigSourceListTest->testSimpleConfigTranslation()
Found the requested form fields at OtherConfigSourceListTest.php272Drupal\tmgmt_config\Tests\ConfigSourceListTest->testSimpleConfigTranslation()
"Account settings (English to ?, Unprocessed)" foundOtherConfigSourceListTest.php276Drupal\tmgmt_config\Tests\ConfigSourceListTest->testSimpleConfigTranslation()
Found the Submit to translator buttonOtherConfigSourceListTest.php277Drupal\tmgmt_config\Tests\ConfigSourceListTest->testSimpleConfigTranslation()
Found the requested form fields at OtherConfigSourceListTest.php277Drupal\tmgmt_config\Tests\ConfigSourceListTest->testSimpleConfigTranslation()
Expected 'http://ec2-52-27-196-164.us-west-2.compute.amazonaws.com/checkout/admin/tmgmt/sources/config/_simple_config' matches current URL (http://ec2-52-27-196-164.us-west-2.compute.amazonaws.com/checkout/user/4).OtherConfigSourceListTest.php280Drupal\tmgmt_config\Tests\ConfigSourceListTest->testSimpleConfigTranslation()
Value 0 is equal to value 2.OtherConfigSourceListTest.php288Drupal\tmgmt_config\Tests\ConfigSourceListTest->testSimpleConfigTranslation()
ExpandDrupal\tmgmt_config\Tests\ConfigSourceUiTest166527
MessageGroupFilenameLineFunctionStatus
Object of class Drupal\views\Entity\View could not be converted to stringRecoverable fatal errorSql.php1457Drupal\views\Plugin\views\query\Sql->execute()
"One job needs to be checked out." foundOtherConfigSourceUiTest.php68Drupal\tmgmt_config\Tests\ConfigSourceUiTest->testNodeTypeTranslateTabSingleCheckout()
"Article content type (English to German, Unprocessed)" foundOtherConfigSourceUiTest.php69Drupal\tmgmt_config\Tests\ConfigSourceUiTest->testNodeTypeTranslateTabSingleCheckout()
Found the Submit to translator buttonOtherConfigSourceUiTest.php72Drupal\tmgmt_config\Tests\ConfigSourceUiTest->testNodeTypeTranslateTabSingleCheckout()
Found the requested form fields at OtherConfigSourceUiTest.php72Drupal\tmgmt_config\Tests\ConfigSourceUiTest->testNodeTypeTranslateTabSingleCheckout()
Expected 'http://ec2-52-27-196-164.us-west-2.compute.amazonaws.com/checkout/admin/structure/types/manage/article/translate' matches current URL (http://ec2-52-27-196-164.us-west-2.compute.amazonaws.com/checkout/admin/tmgmt/jobs/1).OtherConfigSourceUiTest.php75Drupal\tmgmt_config\Tests\ConfigSourceUiTest->testNodeTypeTranslateTabSingleCheckout()
Link Needs review does not exist on http://ec2-52-27-196-164.us-west-2.compute.amazonaws.com/checkout/admin/structure/types/manage/article/translateBrowserConfigSourceUiTest.php89Drupal\tmgmt_config\Tests\ConfigSourceUiTest->testNodeTypeTranslateTabSingleCheckout()
Found the Save as completed buttonOtherConfigSourceUiTest.php90Drupal\tmgmt_config\Tests\ConfigSourceUiTest->testNodeTypeTranslateTabSingleCheckout()
Found the requested form fields at OtherConfigSourceUiTest.php90Drupal\tmgmt_config\Tests\ConfigSourceUiTest->testNodeTypeTranslateTabSingleCheckout()
Object of class Drupal\views\Entity\View could not be converted to stringRecoverable fatal errorSql.php1457Drupal\views\Plugin\views\query\Sql->execute()
"One job needs to be checked out." foundOtherConfigSourceUiTest.php99Drupal\tmgmt_config\Tests\ConfigSourceUiTest->testNodeTypeTranslateTabSingleCheckout()
"Article content type (English to Spanish, Unprocessed)" foundOtherConfigSourceUiTest.php100Drupal\tmgmt_config\Tests\ConfigSourceUiTest->testNodeTypeTranslateTabSingleCheckout()
Found the Submit to translator buttonOtherConfigSourceUiTest.php101Drupal\tmgmt_config\Tests\ConfigSourceUiTest->testNodeTypeTranslateTabSingleCheckout()
Found the requested form fields at OtherConfigSourceUiTest.php101Drupal\tmgmt_config\Tests\ConfigSourceUiTest->testNodeTypeTranslateTabSingleCheckout()
Expected 'http://ec2-52-27-196-164.us-west-2.compute.amazonaws.com/checkout/admin/structure/types/manage/article/translate' matches current URL (http://ec2-52-27-196-164.us-west-2.compute.amazonaws.com/checkout/admin/tmgmt/jobs/2).OtherConfigSourceUiTest.php104Drupal\tmgmt_config\Tests\ConfigSourceUiTest->testNodeTypeTranslateTabSingleCheckout()
Value 0 is equal to value 2.OtherConfigSourceUiTest.php115Drupal\tmgmt_config\Tests\ConfigSourceUiTest->testNodeTypeTranslateTabSingleCheckout()
Object of class Drupal\views\Entity\View could not be converted to stringRecoverable fatal errorSql.php1457Drupal\views\Plugin\views\query\Sql->execute()
"2 jobs need to be checked out." foundOtherConfigSourceUiTest.php145Drupal\tmgmt_config\Tests\ConfigSourceUiTest->testNodeTypeTranslateTabMultipeCheckout()
"Article content type (English to German, Unprocessed)" foundOtherConfigSourceUiTest.php148Drupal\tmgmt_config\Tests\ConfigSourceUiTest->testNodeTypeTranslateTabMultipeCheckout()
Found the Submit to translator and continue buttonOtherConfigSourceUiTest.php149Drupal\tmgmt_config\Tests\ConfigSourceUiTest->testNodeTypeTranslateTabMultipeCheckout()
Found the requested form fields at OtherConfigSourceUiTest.php149Drupal\tmgmt_config\Tests\ConfigSourceUiTest->testNodeTypeTranslateTabMultipeCheckout()
"Article content type (English to Spanish, Unprocessed)" foundOtherConfigSourceUiTest.php150Drupal\tmgmt_config\Tests\ConfigSourceUiTest->testNodeTypeTranslateTabMultipeCheckout()
Found the Submit to translator buttonOtherConfigSourceUiTest.php151Drupal\tmgmt_config\Tests\ConfigSourceUiTest->testNodeTypeTranslateTabMultipeCheckout()
Found the requested form fields at OtherConfigSourceUiTest.php151Drupal\tmgmt_config\Tests\ConfigSourceUiTest->testNodeTypeTranslateTabMultipeCheckout()
Expected 'http://ec2-52-27-196-164.us-west-2.compute.amazonaws.com/checkout/admin/structure/types/manage/article/translate' matches current URL (http://ec2-52-27-196-164.us-west-2.compute.amazonaws.com/checkout/admin/tmgmt/jobs/1).OtherConfigSourceUiTest.php154Drupal\tmgmt_config\Tests\ConfigSourceUiTest->testNodeTypeTranslateTabMultipeCheckout()
"Test translation created." foundOtherConfigSourceUiTest.php155Drupal\tmgmt_config\Tests\ConfigSourceUiTest->testNodeTypeTranslateTabMultipeCheckout()
Value 0 is equal to value 2.OtherConfigSourceUiTest.php170Drupal\tmgmt_config\Tests\ConfigSourceUiTest->testNodeTypeTranslateTabMultipeCheckout()
Object of class Drupal\views\Entity\View could not be converted to stringRecoverable fatal errorSql.php1457Drupal\views\Plugin\views\query\Sql->execute()
"One job needs to be checked out." foundOtherConfigSourceUiTest.php193Drupal\tmgmt_config\Tests\ConfigSourceUiTest->testViewTranslateTabSingleCheckout()
"Content view (English to German, Unprocessed)" foundOtherConfigSourceUiTest.php194Drupal\tmgmt_config\Tests\ConfigSourceUiTest->testViewTranslateTabSingleCheckout()
Found the Submit to translator buttonOtherConfigSourceUiTest.php197Drupal\tmgmt_config\Tests\ConfigSourceUiTest->testViewTranslateTabSingleCheckout()
Found the requested form fields at OtherConfigSourceUiTest.php197Drupal\tmgmt_config\Tests\ConfigSourceUiTest->testViewTranslateTabSingleCheckout()
Expected 'http://ec2-52-27-196-164.us-west-2.compute.amazonaws.com/checkout/admin/structure/views/view/content/translate' matches current URL (http://ec2-52-27-196-164.us-west-2.compute.amazonaws.com/checkout/admin/tmgmt/jobs/1).OtherConfigSourceUiTest.php200Drupal\tmgmt_config\Tests\ConfigSourceUiTest->testViewTranslateTabSingleCheckout()
Link Needs review does not exist on http://ec2-52-27-196-164.us-west-2.compute.amazonaws.com/checkout/admin/structure/views/view/content/translateBrowserConfigSourceUiTest.php214Drupal\tmgmt_config\Tests\ConfigSourceUiTest->testViewTranslateTabSingleCheckout()
Found the Save as completed buttonOtherConfigSourceUiTest.php215Drupal\tmgmt_config\Tests\ConfigSourceUiTest->testViewTranslateTabSingleCheckout()
Found the requested form fields at OtherConfigSourceUiTest.php215Drupal\tmgmt_config\Tests\ConfigSourceUiTest->testViewTranslateTabSingleCheckout()
Object of class Drupal\views\Entity\View could not be converted to stringRecoverable fatal errorSql.php1457Drupal\views\Plugin\views\query\Sql->execute()
"One job needs to be checked out." foundOtherConfigSourceUiTest.php224Drupal\tmgmt_config\Tests\ConfigSourceUiTest->testViewTranslateTabSingleCheckout()
"Content view (English to Spanish, Unprocessed)" foundOtherConfigSourceUiTest.php225Drupal\tmgmt_config\Tests\ConfigSourceUiTest->testViewTranslateTabSingleCheckout()
Found the Submit to translator buttonOtherConfigSourceUiTest.php226Drupal\tmgmt_config\Tests\ConfigSourceUiTest->testViewTranslateTabSingleCheckout()
Found the requested form fields at OtherConfigSourceUiTest.php226Drupal\tmgmt_config\Tests\ConfigSourceUiTest->testViewTranslateTabSingleCheckout()
Expected 'http://ec2-52-27-196-164.us-west-2.compute.amazonaws.com/checkout/admin/structure/views/view/content/translate' matches current URL (http://ec2-52-27-196-164.us-west-2.compute.amazonaws.com/checkout/admin/tmgmt/jobs/2).OtherConfigSourceUiTest.php229Drupal\tmgmt_config\Tests\ConfigSourceUiTest->testViewTranslateTabSingleCheckout()
Value 0 is equal to value 2.OtherConfigSourceUiTest.php240Drupal\tmgmt_config\Tests\ConfigSourceUiTest->testViewTranslateTabSingleCheckout()
Object of class Drupal\views\Entity\View could not be converted to stringRecoverable fatal errorSql.php1457Drupal\views\Plugin\views\query\Sql->execute()
"One job needs to be checked out." foundOtherConfigSourceUiTest.php283Drupal\tmgmt_config\Tests\ConfigSourceUiTest->testSimpleConfiguration()
"System information (English to German, Unprocessed)" foundOtherConfigSourceUiTest.php284Drupal\tmgmt_config\Tests\ConfigSourceUiTest->testSimpleConfiguration()
Found the Submit to translator buttonOtherConfigSourceUiTest.php287Drupal\tmgmt_config\Tests\ConfigSourceUiTest->testSimpleConfiguration()
Found the requested form fields at OtherConfigSourceUiTest.php287Drupal\tmgmt_config\Tests\ConfigSourceUiTest->testSimpleConfiguration()
Expected 'http://ec2-52-27-196-164.us-west-2.compute.amazonaws.com/checkout/admin/config/system/site-information/translate' matches current URL (http://ec2-52-27-196-164.us-west-2.compute.amazonaws.com/checkout/admin/tmgmt/jobs/1).OtherConfigSourceUiTest.php290Drupal\tmgmt_config\Tests\ConfigSourceUiTest->testSimpleConfiguration()
Link Needs review does not exist on http://ec2-52-27-196-164.us-west-2.compute.amazonaws.com/checkout/admin/config/system/site-information/translateBrowserConfigSourceUiTest.php304Drupal\tmgmt_config\Tests\ConfigSourceUiTest->testSimpleConfiguration()
Found the Save buttonOtherConfigSourceUiTest.php305Drupal\tmgmt_config\Tests\ConfigSourceUiTest->testSimpleConfiguration()
Found the requested form fields at OtherConfigSourceUiTest.php305Drupal\tmgmt_config\Tests\ConfigSourceUiTest->testSimpleConfiguration()
Object of class Drupal\views\Entity\View could not be converted to stringRecoverable fatal errorSql.php1457Drupal\views\Plugin\views\query\Sql->execute()
"One job needs to be checked out." foundOtherConfigSourceUiTest.php314Drupal\tmgmt_config\Tests\ConfigSourceUiTest->testSimpleConfiguration()
"System information (English to Spanish, Unprocessed)" foundOtherConfigSourceUiTest.php315Drupal\tmgmt_config\Tests\ConfigSourceUiTest->testSimpleConfiguration()
Found the Submit to translator buttonOtherConfigSourceUiTest.php316Drupal\tmgmt_config\Tests\ConfigSourceUiTest->testSimpleConfiguration()
Found the requested form fields at OtherConfigSourceUiTest.php316Drupal\tmgmt_config\Tests\ConfigSourceUiTest->testSimpleConfiguration()
Expected 'http://ec2-52-27-196-164.us-west-2.compute.amazonaws.com/checkout/admin/config/system/site-information/translate' matches current URL (http://ec2-52-27-196-164.us-west-2.compute.amazonaws.com/checkout/admin/tmgmt/jobs/2).OtherConfigSourceUiTest.php319Drupal\tmgmt_config\Tests\ConfigSourceUiTest->testSimpleConfiguration()
Value 0 is equal to value 2.OtherConfigSourceUiTest.php330Drupal\tmgmt_config\Tests\ConfigSourceUiTest->testSimpleConfiguration()
ExpandDrupal\tmgmt_content\Tests\ContentEntitySourceListTest14033
MessageGroupFilenameLineFunctionStatus
Object of class Drupal\views\Entity\View could not be converted to stringRecoverable fatal errorSql.php1457Drupal\views\Plugin\views\query\Sql->execute()
"One job needs to be checked out." foundOtherContentEntitySourceListTest.php180Drupal\tmgmt_content\Tests\ContentEntitySourceListTest->testTranslationSubmissions()
Object of class Drupal\views\Entity\View could not be converted to stringRecoverable fatal errorSql.php1457Drupal\views\Plugin\views\query\Sql->execute()
"One job needs to be checked out." foundOtherContentEntitySourceListTest.php189Drupal\tmgmt_content\Tests\ContentEntitySourceListTest->testTranslationSubmissions()
Object of class Drupal\views\Entity\View could not be converted to stringRecoverable fatal errorSql.php1457Drupal\views\Plugin\views\query\Sql->execute()
"3 jobs need to be checked out." foundOtherContentEntitySourceListTest.php206Drupal\tmgmt_content\Tests\ContentEntitySourceListTest->testTranslationSubmissions()
ExpandDrupal\tmgmt_content\Tests\ContentEntitySourceUiTest214485
MessageGroupFilenameLineFunctionStatus
Object of class Drupal\views\Entity\View could not be converted to stringRecoverable fatal errorSql.php1457Drupal\views\Plugin\views\query\Sql->execute()
"One job needs to be checked out." foundOtherContentEntitySourceUiTest.php83Drupal\tmgmt_content\Tests\ContentEntitySourceUiTest->testNodeTranslateTabSingleCheckout()
"uLNk4bve" foundOtherContentEntitySourceUiTest.php84Drupal\tmgmt_content\Tests\ContentEntitySourceUiTest->testNodeTranslateTabSingleCheckout()
Found the Submit to translator buttonOtherContentEntitySourceUiTest.php87Drupal\tmgmt_content\Tests\ContentEntitySourceUiTest->testNodeTranslateTabSingleCheckout()
Found the requested form fields at OtherContentEntitySourceUiTest.php87Drupal\tmgmt_content\Tests\ContentEntitySourceUiTest->testNodeTranslateTabSingleCheckout()
Value 'http://ec2-52-27-196-164.us-west-2.compute.amazonaws.com/checkout/node/1/translations' is equal to value 'http://ec2-52-27-196-164.us-west-2.compute.amazonaws.com/checkout/admin/tmgmt/jobs/1'.OtherContentEntitySourceUiTest.php90Drupal\tmgmt_content\Tests\ContentEntitySourceUiTest->testNodeTranslateTabSingleCheckout()
"Test translation created." foundOtherContentEntitySourceUiTest.php91Drupal\tmgmt_content\Tests\ContentEntitySourceUiTest->testNodeTranslateTabSingleCheckout()
"The translation of uLNk4bve to German is finished and can now be reviewed." foundOtherContentEntitySourceUiTest.php95Drupal\tmgmt_content\Tests\ContentEntitySourceUiTest->testNodeTranslateTabSingleCheckout()
Link Needs review does not exist on http://ec2-52-27-196-164.us-west-2.compute.amazonaws.com/checkout/admin/tmgmt/jobs/1BrowserContentEntitySourceUiTest.php98Drupal\tmgmt_content\Tests\ContentEntitySourceUiTest->testNodeTranslateTabSingleCheckout()
Found the Save as completed buttonOtherContentEntitySourceUiTest.php99Drupal\tmgmt_content\Tests\ContentEntitySourceUiTest->testNodeTranslateTabSingleCheckout()
Found the requested form fields at OtherContentEntitySourceUiTest.php99Drupal\tmgmt_content\Tests\ContentEntitySourceUiTest->testNodeTranslateTabSingleCheckout()
"The translation for uLNk4bve has been accepted." foundOtherContentEntitySourceUiTest.php101Drupal\tmgmt_content\Tests\ContentEntitySourceUiTest->testNodeTranslateTabSingleCheckout()
Link de_uLNk4bve does not exist on http://ec2-52-27-196-164.us-west-2.compute.amazonaws.com/checkout/admin/tmgmt/jobs/1BrowserContentEntitySourceUiTest.php104Drupal\tmgmt_content\Tests\ContentEntitySourceUiTest->testNodeTranslateTabSingleCheckout()
"de_uLNk4bve" foundOtherContentEntitySourceUiTest.php105Drupal\tmgmt_content\Tests\ContentEntitySourceUiTest->testNodeTranslateTabSingleCheckout()
"de_dIxE4jFhbbO2grdSSCOo" foundOtherContentEntitySourceUiTest.php106Drupal\tmgmt_content\Tests\ContentEntitySourceUiTest->testNodeTranslateTabSingleCheckout()
Object of class Drupal\views\Entity\View could not be converted to stringRecoverable fatal errorSql.php1457Drupal\views\Plugin\views\query\Sql->execute()
Object of class Drupal\views\Entity\View could not be converted to stringRecoverable fatal errorSql.php1457Drupal\views\Plugin\views\query\Sql->execute()
"One job needs to be checked out." foundOtherContentEntitySourceUiTest.php133Drupal\tmgmt_content\Tests\ContentEntitySourceUiTest->testNodeTranslateTabSingleCheckout()
"uLNk4bve" foundOtherContentEntitySourceUiTest.php134Drupal\tmgmt_content\Tests\ContentEntitySourceUiTest->testNodeTranslateTabSingleCheckout()
Found the Submit to translator buttonOtherContentEntitySourceUiTest.php135Drupal\tmgmt_content\Tests\ContentEntitySourceUiTest->testNodeTranslateTabSingleCheckout()
Found the requested form fields at OtherContentEntitySourceUiTest.php135Drupal\tmgmt_content\Tests\ContentEntitySourceUiTest->testNodeTranslateTabSingleCheckout()
Value 'http://ec2-52-27-196-164.us-west-2.compute.amazonaws.com/checkout/node/1' is equal to value 'http://ec2-52-27-196-164.us-west-2.compute.amazonaws.com/checkout/admin/tmgmt/jobs/3'.OtherContentEntitySourceUiTest.php138Drupal\tmgmt_content\Tests\ContentEntitySourceUiTest->testNodeTranslateTabSingleCheckout()
"uLNk4bve" not foundOtherContentEntitySourceUiTest.php148Drupal\tmgmt_content\Tests\ContentEntitySourceUiTest->testNodeTranslateTabSingleCheckout()
Object of class Drupal\views\Entity\View could not be converted to stringRecoverable fatal errorSql.php1457Drupal\views\Plugin\views\query\Sql->execute()
"2 jobs need to be checked out." foundOtherContentEntitySourceUiTest.php205Drupal\tmgmt_content\Tests\ContentEntitySourceUiTest->testNodeTranslateTabMultipeCheckout()
"abbLnhVf" foundOtherContentEntitySourceUiTest.php208Drupal\tmgmt_content\Tests\ContentEntitySourceUiTest->testNodeTranslateTabMultipeCheckout()
Found the Submit to translator and continue buttonOtherContentEntitySourceUiTest.php209Drupal\tmgmt_content\Tests\ContentEntitySourceUiTest->testNodeTranslateTabMultipeCheckout()
Found the requested form fields at OtherContentEntitySourceUiTest.php209Drupal\tmgmt_content\Tests\ContentEntitySourceUiTest->testNodeTranslateTabMultipeCheckout()
"abbLnhVf" foundOtherContentEntitySourceUiTest.php210Drupal\tmgmt_content\Tests\ContentEntitySourceUiTest->testNodeTranslateTabMultipeCheckout()
Found the Submit to translator buttonOtherContentEntitySourceUiTest.php211Drupal\tmgmt_content\Tests\ContentEntitySourceUiTest->testNodeTranslateTabMultipeCheckout()
Found the requested form fields at OtherContentEntitySourceUiTest.php211Drupal\tmgmt_content\Tests\ContentEntitySourceUiTest->testNodeTranslateTabMultipeCheckout()
Value 'http://ec2-52-27-196-164.us-west-2.compute.amazonaws.com/checkout/node/1/translations' is equal to value 'http://ec2-52-27-196-164.us-west-2.compute.amazonaws.com/checkout/admin/tmgmt/jobs/1'.OtherContentEntitySourceUiTest.php214Drupal\tmgmt_content\Tests\ContentEntitySourceUiTest->testNodeTranslateTabMultipeCheckout()
"Test translation created." foundOtherContentEntitySourceUiTest.php215Drupal\tmgmt_content\Tests\ContentEntitySourceUiTest->testNodeTranslateTabMultipeCheckout()
"The translation for abbLnhVf has been accepted." foundOtherContentEntitySourceUiTest.php220Drupal\tmgmt_content\Tests\ContentEntitySourceUiTest->testNodeTranslateTabMultipeCheckout()
"de_abbLnhVf" foundOtherContentEntitySourceUiTest.php225Drupal\tmgmt_content\Tests\ContentEntitySourceUiTest->testNodeTranslateTabMultipeCheckout()
"de_xm71w3yoyFCSdiUGmjRy" foundOtherContentEntitySourceUiTest.php226Drupal\tmgmt_content\Tests\ContentEntitySourceUiTest->testNodeTranslateTabMultipeCheckout()
"es_abbLnhVf" foundOtherContentEntitySourceUiTest.php229Drupal\tmgmt_content\Tests\ContentEntitySourceUiTest->testNodeTranslateTabMultipeCheckout()
"es_xm71w3yoyFCSdiUGmjRy" foundOtherContentEntitySourceUiTest.php230Drupal\tmgmt_content\Tests\ContentEntitySourceUiTest->testNodeTranslateTabMultipeCheckout()
Object of class Drupal\views\Entity\View could not be converted to stringRecoverable fatal errorSql.php1457Drupal\views\Plugin\views\query\Sql->execute()
"2 jobs need to be checked out." foundOtherContentEntitySourceUiTest.php300Drupal\tmgmt_content\Tests\ContentEntitySourceUiTest->testCommentTranslateTab()
"hsRNhLMd" foundOtherContentEntitySourceUiTest.php303Drupal\tmgmt_content\Tests\ContentEntitySourceUiTest->testCommentTranslateTab()
Found the Submit to translator and continue buttonOtherContentEntitySourceUiTest.php304Drupal\tmgmt_content\Tests\ContentEntitySourceUiTest->testCommentTranslateTab()
Found the requested form fields at OtherContentEntitySourceUiTest.php304Drupal\tmgmt_content\Tests\ContentEntitySourceUiTest->testCommentTranslateTab()
"hsRNhLMd" foundOtherContentEntitySourceUiTest.php305Drupal\tmgmt_content\Tests\ContentEntitySourceUiTest->testCommentTranslateTab()
Found the Submit to translator buttonOtherContentEntitySourceUiTest.php306Drupal\tmgmt_content\Tests\ContentEntitySourceUiTest->testCommentTranslateTab()
Found the requested form fields at OtherContentEntitySourceUiTest.php306Drupal\tmgmt_content\Tests\ContentEntitySourceUiTest->testCommentTranslateTab()
Expected 'http://ec2-52-27-196-164.us-west-2.compute.amazonaws.com/checkout/comment/1/translations' matches current URL (http://ec2-52-27-196-164.us-west-2.compute.amazonaws.com/checkout/admin/tmgmt/jobs/1).OtherContentEntitySourceUiTest.php309Drupal\tmgmt_content\Tests\ContentEntitySourceUiTest->testCommentTranslateTab()
"Test translation created." foundOtherContentEntitySourceUiTest.php310Drupal\tmgmt_content\Tests\ContentEntitySourceUiTest->testCommentTranslateTab()
"The translation for hsRNhLMd has been accepted." foundOtherContentEntitySourceUiTest.php315Drupal\tmgmt_content\Tests\ContentEntitySourceUiTest->testCommentTranslateTab()
Link de_hsRNhLMd does not exist on http://ec2-52-27-196-164.us-west-2.compute.amazonaws.com/checkout/admin/tmgmt/jobs/1BrowserContentEntitySourceUiTest.php318Drupal\tmgmt_content\Tests\ContentEntitySourceUiTest->testCommentTranslateTab()
"de_g0nKLVRf" foundOtherContentEntitySourceUiTest.php319Drupal\tmgmt_content\Tests\ContentEntitySourceUiTest->testCommentTranslateTab()
Link es_hsRNhLMd does not exist on http://ec2-52-27-196-164.us-west-2.compute.amazonaws.com/checkout/comment/1/translationsBrowserContentEntitySourceUiTest.php323Drupal\tmgmt_content\Tests\ContentEntitySourceUiTest->testCommentTranslateTab()
"es_g0nKLVRf" foundOtherContentEntitySourceUiTest.php325Drupal\tmgmt_content\Tests\ContentEntitySourceUiTest->testCommentTranslateTab()
ExpandDrupal\tmgmt_demo\Tests\TMGMTDemoTest4122
MessageGroupFilenameLineFunctionStatus
Object of class Drupal\views\Entity\View could not be converted to stringRecoverable fatal errorSql.php1457Drupal\views\Plugin\views\query\Sql->execute()
"2 jobs need to be checked out." foundOtherTMGMTDemoTest.php46Drupal\tmgmt_demo\Tests\TMGMTDemoTest->testInstalled()
Object of class Drupal\views\Entity\View could not be converted to stringRecoverable fatal errorSql.php1457Drupal\views\Plugin\views\query\Sql->execute()
"2 jobs need to be checked out." foundOtherTMGMTDemoTest.php52Drupal\tmgmt_demo\Tests\TMGMTDemoTest->testInstalled()
ExpandDrupal\tmgmt_file\Tests\FileTranslatorTest873310
MessageGroupFilenameLineFunctionStatus
Object of class Drupal\views\Entity\View could not be converted to stringRecoverable fatal errorSql.php1457Drupal\views\Plugin\views\query\Sql->execute()
Failed to set field files[file] to public://tmgmt_file/translated.xlfOtherFileTranslatorTest.php89Drupal\tmgmt_file\Tests\FileTranslatorTest->testXLIFFTextProcessing()
Found the Import buttonOtherFileTranslatorTest.php89Drupal\tmgmt_file\Tests\FileTranslatorTest->testXLIFFTextProcessing()
Found the requested form fields at http://ec2-52-27-196-164.us-west-2.compute.amazonaws.com/checkout/admin/tmgmt/jobs/1OtherFileTranslatorTest.php89Drupal\tmgmt_file\Tests\FileTranslatorTest->testXLIFFTextProcessing()
Undefined index: #translationDrupal\tmgmt_file\Tests\FileTranslatorTest->testXLIFFTextProcessing() Drupal\simpletest\TestBase->run(Array) simpletest_script_run_one_test('19', 'Drupal\tmgmt_file\Tests\FileTranslatorTest') NoticeFileTranslatorTest.php98Drupal\tmgmt_file\Tests\FileTranslatorTest->testXLIFFTextProcessing()
Value '' is equal to value '<p>one translated paragraph with special characters: äöüľščťžýáíéäňú©«®™»</p> <p>one translated paragraph with a <br />break line</p> <p>one translated paragraph with html entities: &amp;&lt;&gt;</p> <p>and here we have some link <a href="http://example.com">break line</a></p> <p>one translated paragraph with an <img src="not-existing.gif" alt="not existing image" title="not existing image" />image</p> <p>hello <span class="green">world</span> this is <span class="red">simple html</span></p><div>nested 1<div>nested 2<div>nested 3</div></div></div>'.OtherFileTranslatorTest.php98Drupal\tmgmt_file\Tests\FileTranslatorTest->testXLIFFTextProcessing()
Value false is TRUE.OtherFileTranslatorTest.php102Drupal\tmgmt_file\Tests\FileTranslatorTest->testXLIFFTextProcessing()
Object of class Drupal\views\Entity\View could not be converted to stringRecoverable fatal errorSql.php1457Drupal\views\Plugin\views\query\Sql->execute()
Failed to set field files[file] to public://tmgmt_file/translated.xlfOtherFileTranslatorTest.php122Drupal\tmgmt_file\Tests\FileTranslatorTest->testXLIFFTextProcessing()
Found the Import buttonOtherFileTranslatorTest.php122Drupal\tmgmt_file\Tests\FileTranslatorTest->testXLIFFTextProcessing()
Found the requested form fields at http://ec2-52-27-196-164.us-west-2.compute.amazonaws.com/checkout/admin/tmgmt/jobs/2OtherFileTranslatorTest.php122Drupal\tmgmt_file\Tests\FileTranslatorTest->testXLIFFTextProcessing()
The validation of semantic integrity must fail.OtherFileTranslatorTest.php127Drupal\tmgmt_file\Tests\FileTranslatorTest->testXLIFFTextProcessing()
Object of class Drupal\views\Entity\View could not be converted to stringRecoverable fatal errorSql.php1457Drupal\views\Plugin\views\query\Sql->execute()
Failed to set field files[file] to public://tmgmt_file/translated.htmlOtherFileTranslatorTest.php397Drupal\tmgmt_file\Tests\FileTranslatorTest->importFile()
Found the Import buttonOtherFileTranslatorTest.php397Drupal\tmgmt_file\Tests\FileTranslatorTest->importFile()
Found the requested form fields at http://ec2-52-27-196-164.us-west-2.compute.amazonaws.com/checkout/admin/tmgmt/jobs/1OtherFileTranslatorTest.php397Drupal\tmgmt_file\Tests\FileTranslatorTest->importFile()
Link review does not exist on http://ec2-52-27-196-164.us-west-2.compute.amazonaws.com/checkout/admin/tmgmt/jobs/1BrowserFileTranslatorTest.php406Drupal\tmgmt_file\Tests\FileTranslatorTest->importFile()
"de_Text for job item with type test and id 1." foundOtherFileTranslatorTest.php408Drupal\tmgmt_file\Tests\FileTranslatorTest->importFile()
Found the Save as completed buttonOtherFileTranslatorTest.php413Drupal\tmgmt_file\Tests\FileTranslatorTest->importFile()
Found the requested form fields at OtherFileTranslatorTest.php413Drupal\tmgmt_file\Tests\FileTranslatorTest->importFile()
Link review does not exist on http://ec2-52-27-196-164.us-west-2.compute.amazonaws.com/checkout/admin/tmgmt/jobs/1BrowserFileTranslatorTest.php415Drupal\tmgmt_file\Tests\FileTranslatorTest->importFile()
"de_Text for job item with type test and id 2." foundOtherFileTranslatorTest.php420Drupal\tmgmt_file\Tests\FileTranslatorTest->importFile()
Found the Save as completed buttonOtherFileTranslatorTest.php422Drupal\tmgmt_file\Tests\FileTranslatorTest->importFile()
Found the requested form fields at OtherFileTranslatorTest.php422Drupal\tmgmt_file\Tests\FileTranslatorTest->importFile()
"Finished" foundOtherFileTranslatorTest.php426Drupal\tmgmt_file\Tests\FileTranslatorTest->importFile()
Object of class Drupal\views\Entity\View could not be converted to stringRecoverable fatal errorSql.php1457Drupal\views\Plugin\views\query\Sql->execute()
Failed to set field files[file] to public://tmgmt_file/wrong_file.xlfOtherFileTranslatorTest.php273Drupal\tmgmt_file\Tests\FileTranslatorTest->testXLIFF()
Found the Import buttonOtherFileTranslatorTest.php273Drupal\tmgmt_file\Tests\FileTranslatorTest->testXLIFF()
Found the requested form fields at http://ec2-52-27-196-164.us-west-2.compute.amazonaws.com/checkout/admin/tmgmt/jobs/1OtherFileTranslatorTest.php273Drupal\tmgmt_file\Tests\FileTranslatorTest->testXLIFF()
"Failed to validate file, import aborted." foundOtherFileTranslatorTest.php274Drupal\tmgmt_file\Tests\FileTranslatorTest->testXLIFF()
Object of class Drupal\views\Entity\View could not be converted to stringRecoverable fatal errorSql.php1457Drupal\views\Plugin\views\query\Sql->execute()
Failed to set field files[file] to public://tmgmt_file/wrong_file.xlfOtherFileTranslatorTest.php294Drupal\tmgmt_file\Tests\FileTranslatorTest->testXLIFF()
Found the Import buttonOtherFileTranslatorTest.php294Drupal\tmgmt_file\Tests\FileTranslatorTest->testXLIFF()
Found the requested form fields at http://ec2-52-27-196-164.us-west-2.compute.amazonaws.com/checkout/admin/tmgmt/jobs/1OtherFileTranslatorTest.php294Drupal\tmgmt_file\Tests\FileTranslatorTest->testXLIFF()
Raw "The imported file job id 2 does not match the job id 1." foundOtherFileTranslatorTest.php298Drupal\tmgmt_file\Tests\FileTranslatorTest->testXLIFF()
Object of class Drupal\views\Entity\View could not be converted to stringRecoverable fatal errorSql.php1457Drupal\views\Plugin\views\query\Sql->execute()
Failed to set field files[file] to public://tmgmt_file/translated file.xlfOtherFileTranslatorTest.php308Drupal\tmgmt_file\Tests\FileTranslatorTest->testXLIFF()
Found the Import buttonOtherFileTranslatorTest.php308Drupal\tmgmt_file\Tests\FileTranslatorTest->testXLIFF()
Found the requested form fields at http://ec2-52-27-196-164.us-west-2.compute.amazonaws.com/checkout/admin/tmgmt/jobs/1OtherFileTranslatorTest.php308Drupal\tmgmt_file\Tests\FileTranslatorTest->testXLIFF()
Link review does not exist on http://ec2-52-27-196-164.us-west-2.compute.amazonaws.com/checkout/admin/tmgmt/jobs/1BrowserFileTranslatorTest.php309Drupal\tmgmt_file\Tests\FileTranslatorTest->testXLIFF()
Undefined offset: 0Drupal\simpletest\WebTestBase->drupalPostAjaxForm(NULL, NULL, Array) Drupal\tmgmt_file\Tests\FileTranslatorTest->testXLIFF() Drupal\simpletest\TestBase->run(Array) simpletest_script_run_one_test('19', 'Drupal\tmgmt_file\Tests\FileTranslatorTest') NoticeWebTestBase.php1826Drupal\simpletest\WebTestBase->drupalPostAjaxForm()
Undefined index: ajaxDrupal\simpletest\WebTestBase->drupalPostAjaxForm(NULL, NULL, Array) Drupal\tmgmt_file\Tests\FileTranslatorTest->testXLIFF() Drupal\simpletest\TestBase->run(Array) simpletest_script_run_one_test('19', 'Drupal\tmgmt_file\Tests\FileTranslatorTest') NoticeWebTestBase.php1827Drupal\simpletest\WebTestBase->drupalPostAjaxForm()
Exception: No #ajax path specified. in Drupal\simpletest\WebTestBase->drupalPostAjaxForm() (line 1863 of /var/lib/drupaltestbot/sites/default/files/checkout/core/modules/simpletest/src/WebTestBase.php). Drupal\simpletest\WebTestBase->drupalPostAjaxForm(NULL, NULL, Array) Drupal\tmgmt_file\Tests\FileTranslatorTest->testXLIFF() Drupal\simpletest\TestBase->run(Array) simpletest_script_run_one_test('19', 'Drupal\tmgmt_file\Tests\FileTranslatorTest') Uncaught exceptionWebTestBase.php1863Drupal\simpletest\WebTestBase->drupalPostAjaxForm()
ExpandDrupal\tmgmt_locale\Tests\LocaleSourceUiTest39121
MessageGroupFilenameLineFunctionStatus
Object of class Drupal\views\Entity\View could not be converted to stringRecoverable fatal errorSql.php1457Drupal\views\Plugin\views\query\Sql->execute()
"Hello World" foundOtherLocaleSourceUiTest.php76Drupal\tmgmt_locale\Tests\LocaleSourceUiTest->testOverview()
"Locale" foundOtherLocaleSourceUiTest.php77Drupal\tmgmt_locale\Tests\LocaleSourceUiTest->testOverview()
"2" foundOtherLocaleSourceUiTest.php78Drupal\tmgmt_locale\Tests\LocaleSourceUiTest->testOverview()
Failed to set field target_language to gsw-berneOtherLocaleSourceUiTest.php79Drupal\tmgmt_locale\Tests\LocaleSourceUiTest->testOverview()
Found the Submit to translator buttonOtherLocaleSourceUiTest.php79Drupal\tmgmt_locale\Tests\LocaleSourceUiTest->testOverview()
Found the requested form fields at OtherLocaleSourceUiTest.php79Drupal\tmgmt_locale\Tests\LocaleSourceUiTest->testOverview()
Raw "Active job item: Needs review" foundOtherLocaleSourceUiTest.php83Drupal\tmgmt_locale\Tests\LocaleSourceUiTest->testOverview()
Raw "gsw-berne_Hello World" foundOtherLocaleSourceUiTest.php88Drupal\tmgmt_locale\Tests\LocaleSourceUiTest->testOverview()
Found the Save as completed buttonOtherLocaleSourceUiTest.php89Drupal\tmgmt_locale\Tests\LocaleSourceUiTest->testOverview()
Found the requested form fields at OtherLocaleSourceUiTest.php89Drupal\tmgmt_locale\Tests\LocaleSourceUiTest->testOverview()
Value 'Not translated' is equal to value 'Translation up to date'.OtherLocaleSourceUiTest.php97Drupal\tmgmt_locale\Tests\LocaleSourceUiTest->testOverview()
"Hello World" not foundOtherLocaleSourceUiTest.php113Drupal\tmgmt_locale\Tests\LocaleSourceUiTest->testOverview()

All

Test namePassFailException
LeafDrupal\tmgmt\Tests\CrudTest19900
LeafDrupal\tmgmt\Tests\HelperTest4300
LeafDrupal\tmgmt\Tests\LocalTasksTests3100
LeafDrupal\tmgmt\Tests\PluginsTest6500
ExpandDrupal\tmgmt\Tests\TMGMTCartTest4751
MessageGroupFilenameLineFunctionStatus
Object of class Drupal\views\Entity\View could not be converted to stringRecoverable fatal errorSql.php1457Drupal\views\Plugin\views\query\Sql->execute()
"One job needs to be checked out." foundOtherTMGMTCartTest.php84Drupal\tmgmt\Tests\TMGMTCartTest->testCartEnforceSourceLanguage()
Raw "One item skipped as for the language English it was not possible to retrieve a translation." foundOtherTMGMTCartTest.php85Drupal\tmgmt\Tests\TMGMTCartTest->testCartEnforceSourceLanguage()
"You have enforced the the job source language which most likely resulted in having a translation of your original content as the job source text. You should review the job translation received from the translator carefully to prevent the content quality loss." foundOtherTMGMTCartTest.php86Drupal\tmgmt\Tests\TMGMTCartTest->testCartEnforceSourceLanguage()
Found the Submit to translator buttonOtherTMGMTCartTest.php91Drupal\tmgmt\Tests\TMGMTCartTest->testCartEnforceSourceLanguage()
Found the requested form fields at OtherTMGMTCartTest.php91Drupal\tmgmt\Tests\TMGMTCartTest->testCartEnforceSourceLanguage()
ExpandDrupal\tmgmt\Tests\TMGMTUiTest2168320
MessageGroupFilenameLineFunctionStatus
Object of class Drupal\views\Entity\View could not be converted to stringRecoverable fatal errorSql.php1457Drupal\views\Plugin\views\query\Sql->execute()
"test_source:test:1" foundOtherTMGMTUiTest.php68Drupal\tmgmt\Tests\TMGMTUiTest->testCheckoutForm()
Object of class Drupal\views\Entity\View could not be converted to stringRecoverable fatal errorSql.php1457Drupal\views\Plugin\views\query\Sql->execute()
"test_source:test:1" foundOtherTMGMTUiTest.php79Drupal\tmgmt\Tests\TMGMTUiTest->testCheckoutForm()
"test_source:test:2" foundOtherTMGMTUiTest.php80Drupal\tmgmt\Tests\TMGMTUiTest->testCheckoutForm()
"test_source:test:3" foundOtherTMGMTUiTest.php81Drupal\tmgmt\Tests\TMGMTUiTest->testCheckoutForm()
Failed to set field target_language to elOtherTMGMTUiTest.php90Drupal\tmgmt\Tests\TMGMTUiTest->testCheckoutForm()
Failed to set field settings[action] to translateOtherTMGMTUiTest.php90Drupal\tmgmt\Tests\TMGMTUiTest->testCheckoutForm()
Found the Submit to translator buttonOtherTMGMTUiTest.php90Drupal\tmgmt\Tests\TMGMTUiTest->testCheckoutForm()
Found the requested form fields at OtherTMGMTUiTest.php90Drupal\tmgmt\Tests\TMGMTUiTest->testCheckoutForm()
"Test translator (auto created) can not translate from English to Greek." foundOtherTMGMTUiTest.php91Drupal\tmgmt\Tests\TMGMTUiTest->testCheckoutForm()
Failed to set field target_language to esOtherTMGMTUiTest.php101Drupal\tmgmt\Tests\TMGMTUiTest->testCheckoutForm()
Failed to set field settings[action] to translateOtherTMGMTUiTest.php101Drupal\tmgmt\Tests\TMGMTUiTest->testCheckoutForm()
Found the Submit to translator buttonOtherTMGMTUiTest.php101Drupal\tmgmt\Tests\TMGMTUiTest->testCheckoutForm()
Found the requested form fields at OtherTMGMTUiTest.php101Drupal\tmgmt\Tests\TMGMTUiTest->testCheckoutForm()
Value false is TRUE.OtherTMGMTUiTest.php105Drupal\tmgmt\Tests\TMGMTUiTest->testCheckoutForm()
Value false is TRUE.OtherTMGMTUiTest.php108Drupal\tmgmt\Tests\TMGMTUiTest->testCheckoutForm()
Value false is TRUE.OtherTMGMTUiTest.php108Drupal\tmgmt\Tests\TMGMTUiTest->testCheckoutForm()
Value false is TRUE.OtherTMGMTUiTest.php108Drupal\tmgmt\Tests\TMGMTUiTest->testCheckoutForm()
"Test translation created" foundOtherTMGMTUiTest.php110Drupal\tmgmt\Tests\TMGMTUiTest->testCheckoutForm()
"Job overview" foundOtherTMGMTUiTest.php114Drupal\tmgmt\Tests\TMGMTUiTest->testCheckoutForm()
Value '1' is not equal to value '1'.OtherTMGMTUiTest.php120Drupal\tmgmt\Tests\TMGMTUiTest->testCheckoutForm()
Object of class Drupal\views\Entity\View could not be converted to stringRecoverable fatal errorSql.php1457Drupal\views\Plugin\views\query\Sql->execute()
"You can provide a label for this job in order to identify it easily later on." foundOtherTMGMTUiTest.php127Drupal\tmgmt\Tests\TMGMTUiTest->testCheckoutForm()
"test_source:test:1" foundOtherTMGMTUiTest.php128Drupal\tmgmt\Tests\TMGMTUiTest->testCheckoutForm()
Failed to set field target_language to esOtherTMGMTUiTest.php134Drupal\tmgmt\Tests\TMGMTUiTest->testCheckoutForm()
Failed to set field settings[action] to submitOtherTMGMTUiTest.php134Drupal\tmgmt\Tests\TMGMTUiTest->testCheckoutForm()
Found the Submit to translator buttonOtherTMGMTUiTest.php134Drupal\tmgmt\Tests\TMGMTUiTest->testCheckoutForm()
Found the requested form fields at OtherTMGMTUiTest.php134Drupal\tmgmt\Tests\TMGMTUiTest->testCheckoutForm()
"Test submit" foundOtherTMGMTUiTest.php135Drupal\tmgmt\Tests\TMGMTUiTest->testCheckoutForm()
Value false is TRUE.OtherTMGMTUiTest.php137Drupal\tmgmt\Tests\TMGMTUiTest->testCheckoutForm()
Object of class Drupal\views\Entity\View could not be converted to stringRecoverable fatal errorSql.php1457Drupal\views\Plugin\views\query\Sql->execute()
"You can provide a label for this job in order to identify it easily later on." foundOtherTMGMTUiTest.php148Drupal\tmgmt\Tests\TMGMTUiTest->testCheckoutForm()
"test_source:test:1" foundOtherTMGMTUiTest.php149Drupal\tmgmt\Tests\TMGMTUiTest->testCheckoutForm()
Failed to set field settings[action] to rejectOtherTMGMTUiTest.php154Drupal\tmgmt\Tests\TMGMTUiTest->testCheckoutForm()
Found the Submit to translator buttonOtherTMGMTUiTest.php154Drupal\tmgmt\Tests\TMGMTUiTest->testCheckoutForm()
Found the requested form fields at OtherTMGMTUiTest.php154Drupal\tmgmt\Tests\TMGMTUiTest->testCheckoutForm()
"This is not supported" foundOtherTMGMTUiTest.php155Drupal\tmgmt\Tests\TMGMTUiTest->testCheckoutForm()
Value false is TRUE.OtherTMGMTUiTest.php157Drupal\tmgmt\Tests\TMGMTUiTest->testCheckoutForm()
Value 2 is equal to value 0.OtherTMGMTUiTest.php161Drupal\tmgmt\Tests\TMGMTUiTest->testCheckoutForm()
Value 2 is equal to value 0.OtherTMGMTUiTest.php165Drupal\tmgmt\Tests\TMGMTUiTest->testCheckoutForm()
Failed to set field settings[action] to translateOtherTMGMTUiTest.php175Drupal\tmgmt\Tests\TMGMTUiTest->testCheckoutForm()
Found the Submit to translator buttonOtherTMGMTUiTest.php175Drupal\tmgmt\Tests\TMGMTUiTest->testCheckoutForm()
Found the requested form fields at OtherTMGMTUiTest.php175Drupal\tmgmt\Tests\TMGMTUiTest->testCheckoutForm()
"Test translation created" foundOtherTMGMTUiTest.php176Drupal\tmgmt\Tests\TMGMTUiTest->testCheckoutForm()
Object of class Drupal\views\Entity\View could not be converted to stringRecoverable fatal errorSql.php1457Drupal\views\Plugin\views\query\Sql->execute()
"You can provide a label for this job in order to identify it easily later on." foundOtherTMGMTUiTest.php187Drupal\tmgmt\Tests\TMGMTUiTest->testCheckoutForm()
"test_source:test:1" foundOtherTMGMTUiTest.php188Drupal\tmgmt\Tests\TMGMTUiTest->testCheckoutForm()
Failed to set field settings[action] to failOtherTMGMTUiTest.php193Drupal\tmgmt\Tests\TMGMTUiTest->testCheckoutForm()
Found the Submit to translator buttonOtherTMGMTUiTest.php193Drupal\tmgmt\Tests\TMGMTUiTest->testCheckoutForm()
Found the requested form fields at OtherTMGMTUiTest.php193Drupal\tmgmt\Tests\TMGMTUiTest->testCheckoutForm()
"Service not reachable" foundOtherTMGMTUiTest.php194Drupal\tmgmt\Tests\TMGMTUiTest->testCheckoutForm()
"You can provide a label for this job in order to identify it easily later on." foundOtherTMGMTUiTest.php199Drupal\tmgmt\Tests\TMGMTUiTest->testCheckoutForm()
Object of class Drupal\views\Entity\View could not be converted to stringRecoverable fatal errorSql.php1457Drupal\views\Plugin\views\query\Sql->execute()
"You can provide a label for this job in order to identify it easily later on." foundOtherTMGMTUiTest.php210Drupal\tmgmt\Tests\TMGMTUiTest->testCheckoutForm()
"test_source:test:1" foundOtherTMGMTUiTest.php211Drupal\tmgmt\Tests\TMGMTUiTest->testCheckoutForm()
Failed to set field settings[action] to not_translatableOtherTMGMTUiTest.php216Drupal\tmgmt\Tests\TMGMTUiTest->testCheckoutForm()
Found the Submit to translator buttonOtherTMGMTUiTest.php216Drupal\tmgmt\Tests\TMGMTUiTest->testCheckoutForm()
Found the requested form fields at OtherTMGMTUiTest.php216Drupal\tmgmt\Tests\TMGMTUiTest->testCheckoutForm()
"Fail" foundOtherTMGMTUiTest.php218Drupal\tmgmt\Tests\TMGMTUiTest->testCheckoutForm()
Object of class Drupal\views\Entity\View could not be converted to stringRecoverable fatal errorSql.php1457Drupal\views\Plugin\views\query\Sql->execute()
"You can provide a label for this job in order to identify it easily later on." foundOtherTMGMTUiTest.php233Drupal\tmgmt\Tests\TMGMTUiTest->testCheckoutForm()
"test_source:test:1" foundOtherTMGMTUiTest.php234Drupal\tmgmt\Tests\TMGMTUiTest->testCheckoutForm()
Found the Submit to translator buttonOtherTMGMTUiTest.php237Drupal\tmgmt\Tests\TMGMTUiTest->testCheckoutForm()
Found the requested form fields at OtherTMGMTUiTest.php237Drupal\tmgmt\Tests\TMGMTUiTest->testCheckoutForm()
"This is not supported." foundOtherTMGMTUiTest.php238Drupal\tmgmt\Tests\TMGMTUiTest->testCheckoutForm()
Value false is TRUE.OtherTMGMTUiTest.php240Drupal\tmgmt\Tests\TMGMTUiTest->testCheckoutForm()
Object of class Drupal\views\Entity\View could not be converted to stringRecoverable fatal errorSql.php1457Drupal\views\Plugin\views\query\Sql->execute()
Undefined offset: 0Drupal\simpletest\WebTestBase->drupalPostAjaxForm('admin/tmgmt/jobs/3', Array, 'target_language') Drupal\tmgmt\Tests\TMGMTUiTest->testCheckoutForm() Drupal\simpletest\TestBase->run(Array) simpletest_script_run_one_test('13', 'Drupal\tmgmt\Tests\TMGMTUiTest') NoticeWebTestBase.php1826Drupal\simpletest\WebTestBase->drupalPostAjaxForm()
Undefined index: ajaxDrupal\simpletest\WebTestBase->drupalPostAjaxForm('admin/tmgmt/jobs/3', Array, 'target_language') Drupal\tmgmt\Tests\TMGMTUiTest->testCheckoutForm() Drupal\simpletest\TestBase->run(Array) simpletest_script_run_one_test('13', 'Drupal\tmgmt\Tests\TMGMTUiTest') NoticeWebTestBase.php1827Drupal\simpletest\WebTestBase->drupalPostAjaxForm()
Exception: No #ajax path specified. in Drupal\simpletest\WebTestBase->drupalPostAjaxForm() (line 1863 of /var/lib/drupaltestbot/sites/default/files/checkout/core/modules/simpletest/src/WebTestBase.php). Drupal\simpletest\WebTestBase->drupalPostAjaxForm('admin/tmgmt/jobs/3', Array, 'target_language') Drupal\tmgmt\Tests\TMGMTUiTest->testCheckoutForm() Drupal\simpletest\TestBase->run(Array) simpletest_script_run_one_test('13', 'Drupal\tmgmt\Tests\TMGMTUiTest') Uncaught exceptionWebTestBase.php1863Drupal\simpletest\WebTestBase->drupalPostAjaxForm()
Object of class Drupal\views\Entity\View could not be converted to stringRecoverable fatal errorSql.php1457Drupal\views\Plugin\views\query\Sql->execute()
Failed to set field target_language to deOtherTMGMTUiTest.php492Drupal\tmgmt\Tests\TMGMTUiTest->testReview()
Failed to set field settings[action] to translateOtherTMGMTUiTest.php492Drupal\tmgmt\Tests\TMGMTUiTest->testReview()
Found the Submit to translator buttonOtherTMGMTUiTest.php492Drupal\tmgmt\Tests\TMGMTUiTest->testReview()
Found the requested form fields at admin/tmgmt/jobs/1OtherTMGMTUiTest.php492Drupal\tmgmt\Tests\TMGMTUiTest->testReview()
Object of class Drupal\views\Entity\View could not be converted to stringRecoverable fatal errorSql.php1457Drupal\views\Plugin\views\query\Sql->execute()
Object of class Drupal\views\Entity\View could not be converted to stringRecoverable fatal errorSql.php1457Drupal\views\Plugin\views\query\Sql->execute()
Raw "20" foundOtherTMGMTUiTest.php520Drupal\tmgmt\Tests\TMGMTUiTest->testSuggestions()
Undefined offset: 0Drupal\simpletest\WebTestBase->drupalPostAjaxForm(NULL, Array, Array) Drupal\tmgmt\Tests\TMGMTUiTest->testSuggestions() Drupal\simpletest\TestBase->run(Array) simpletest_script_run_one_test('13', 'Drupal\tmgmt\Tests\TMGMTUiTest') NoticeWebTestBase.php1826Drupal\simpletest\WebTestBase->drupalPostAjaxForm()
Undefined index: ajaxDrupal\simpletest\WebTestBase->drupalPostAjaxForm(NULL, Array, Array) Drupal\tmgmt\Tests\TMGMTUiTest->testSuggestions() Drupal\simpletest\TestBase->run(Array) simpletest_script_run_one_test('13', 'Drupal\tmgmt\Tests\TMGMTUiTest') NoticeWebTestBase.php1827Drupal\simpletest\WebTestBase->drupalPostAjaxForm()
Exception: No #ajax path specified. in Drupal\simpletest\WebTestBase->drupalPostAjaxForm() (line 1863 of /var/lib/drupaltestbot/sites/default/files/checkout/core/modules/simpletest/src/WebTestBase.php). Drupal\simpletest\WebTestBase->drupalPostAjaxForm(NULL, Array, Array) Drupal\tmgmt\Tests\TMGMTUiTest->testSuggestions() Drupal\simpletest\TestBase->run(Array) simpletest_script_run_one_test('13', 'Drupal\tmgmt\Tests\TMGMTUiTest') Uncaught exceptionWebTestBase.php1863Drupal\simpletest\WebTestBase->drupalPostAjaxForm()
The test did not complete due to a fatal error.Completion checkTMGMTUiTest.php578Drupal\tmgmt\Tests\TMGMTUiTest->testAbortJob()
Object of class Drupal\views\Entity\View could not be converted to stringRecoverable fatal errorSql.php1457Drupal\views\Plugin\views\query\Sql->execute()
Failed to set field target_language to esOtherTMGMTUiTest.php588Drupal\tmgmt\Tests\TMGMTUiTest->testAbortJob()
Failed to set field settings[action] to translateOtherTMGMTUiTest.php588Drupal\tmgmt\Tests\TMGMTUiTest->testAbortJob()
Found the Submit to translator buttonOtherTMGMTUiTest.php588Drupal\tmgmt\Tests\TMGMTUiTest->testAbortJob()
Found the requested form fields at admin/tmgmt/jobs/1OtherTMGMTUiTest.php588Drupal\tmgmt\Tests\TMGMTUiTest->testAbortJob()
Object of class Drupal\views\Entity\View could not be converted to stringRecoverable fatal errorSql.php1457Drupal\views\Plugin\views\query\Sql->execute()
Found the Abort job buttonOtherTMGMTUiTest.php591Drupal\tmgmt\Tests\TMGMTUiTest->testAbortJob()
Found the requested form fields at admin/tmgmt/jobs/1OtherTMGMTUiTest.php591Drupal\tmgmt\Tests\TMGMTUiTest->testAbortJob()
Found the Confirm buttonOtherTMGMTUiTest.php592Drupal\tmgmt\Tests\TMGMTUiTest->testAbortJob()
Found the requested form fields at OtherTMGMTUiTest.php592Drupal\tmgmt\Tests\TMGMTUiTest->testAbortJob()
Value false is TRUE.OtherTMGMTUiTest.php596Drupal\tmgmt\Tests\TMGMTUiTest->testAbortJob()
Value false is TRUE.OtherTMGMTUiTest.php598Drupal\tmgmt\Tests\TMGMTUiTest->testAbortJob()
Value false is TRUE.OtherTMGMTUiTest.php598Drupal\tmgmt\Tests\TMGMTUiTest->testAbortJob()
Value false is TRUE.OtherTMGMTUiTest.php598Drupal\tmgmt\Tests\TMGMTUiTest->testAbortJob()
Object of class Drupal\views\Entity\View could not be converted to stringRecoverable fatal errorSql.php1457Drupal\views\Plugin\views\query\Sql->execute()
Found the Resubmit buttonOtherTMGMTUiTest.php602Drupal\tmgmt\Tests\TMGMTUiTest->testAbortJob()
Found the requested form fields at admin/tmgmt/jobs/1OtherTMGMTUiTest.php602Drupal\tmgmt\Tests\TMGMTUiTest->testAbortJob()
Found the Confirm buttonOtherTMGMTUiTest.php603Drupal\tmgmt\Tests\TMGMTUiTest->testAbortJob()
Found the requested form fields at OtherTMGMTUiTest.php603Drupal\tmgmt\Tests\TMGMTUiTest->testAbortJob()
Raw "This job is a duplicate of the previously aborted job #1" foundOtherTMGMTUiTest.php606Drupal\tmgmt\Tests\TMGMTUiTest->testAbortJob()
LeafDrupal\tmgmt\Tests\TranslatorTest4200
LeafDrupal\tmgmt\Tests\TranslatorUITest3000
ExpandDrupal\tmgmt_config\Tests\ConfigSourceListTest161638
MessageGroupFilenameLineFunctionStatus
Object of class Drupal\views\Entity\View could not be converted to stringRecoverable fatal errorSql.php1457Drupal\views\Plugin\views\query\Sql->execute()
"One job needs to be checked out." foundOtherConfigSourceListTest.php65Drupal\tmgmt_config\Tests\ConfigSourceListTest->testNodeTypeSubmissions()
"Article content type (English to ?, Unprocessed)" foundOtherConfigSourceListTest.php66Drupal\tmgmt_config\Tests\ConfigSourceListTest->testNodeTypeSubmissions()
Found the Submit to translator buttonOtherConfigSourceListTest.php69Drupal\tmgmt_config\Tests\ConfigSourceListTest->testNodeTypeSubmissions()
Found the requested form fields at OtherConfigSourceListTest.php69Drupal\tmgmt_config\Tests\ConfigSourceListTest->testNodeTypeSubmissions()
Expected 'http://ec2-52-27-196-164.us-west-2.compute.amazonaws.com/checkout/admin/tmgmt/sources/config/node_type' matches current URL (http://ec2-52-27-196-164.us-west-2.compute.amazonaws.com/checkout/admin/tmgmt/jobs/1).OtherConfigSourceListTest.php72Drupal\tmgmt_config\Tests\ConfigSourceListTest->testNodeTypeSubmissions()
"Test translation created." foundOtherConfigSourceListTest.php74Drupal\tmgmt_config\Tests\ConfigSourceListTest->testNodeTypeSubmissions()
"The translation of Article content type to German is finished and can now be reviewed." foundOtherConfigSourceListTest.php75Drupal\tmgmt_config\Tests\ConfigSourceListTest->testNodeTypeSubmissions()
Object of class Drupal\views\Entity\View could not be converted to stringRecoverable fatal errorSql.php1457Drupal\views\Plugin\views\query\Sql->execute()
"One job needs to be checked out." foundOtherConfigSourceListTest.php86Drupal\tmgmt_config\Tests\ConfigSourceListTest->testNodeTypeSubmissions()
"Article content type and 1 more (English to ?, Unprocessed)" foundOtherConfigSourceListTest.php87Drupal\tmgmt_config\Tests\ConfigSourceListTest->testNodeTypeSubmissions()
Found the Submit to translator buttonOtherConfigSourceListTest.php90Drupal\tmgmt_config\Tests\ConfigSourceListTest->testNodeTypeSubmissions()
Found the requested form fields at OtherConfigSourceListTest.php90Drupal\tmgmt_config\Tests\ConfigSourceListTest->testNodeTypeSubmissions()
Expected 'http://ec2-52-27-196-164.us-west-2.compute.amazonaws.com/checkout/admin/tmgmt/sources/config/node_type' matches current URL (http://ec2-52-27-196-164.us-west-2.compute.amazonaws.com/checkout/admin/tmgmt/jobs/2).OtherConfigSourceListTest.php93Drupal\tmgmt_config\Tests\ConfigSourceListTest->testNodeTypeSubmissions()
"Test translation created." foundOtherConfigSourceListTest.php95Drupal\tmgmt_config\Tests\ConfigSourceListTest->testNodeTypeSubmissions()
"The translation of Article content type to German is finished and can now be reviewed." foundOtherConfigSourceListTest.php96Drupal\tmgmt_config\Tests\ConfigSourceListTest->testNodeTypeSubmissions()
"The translation of Page content type to German is finished and can now be reviewed." foundOtherConfigSourceListTest.php97Drupal\tmgmt_config\Tests\ConfigSourceListTest->testNodeTypeSubmissions()
Object of class Drupal\views\Entity\View could not be converted to stringRecoverable fatal errorSql.php1457Drupal\views\Plugin\views\query\Sql->execute()
"One job needs to be checked out." foundOtherConfigSourceListTest.php114Drupal\tmgmt_config\Tests\ConfigSourceListTest->testViewTranslation()
"Archive view (English to ?, Unprocessed)" foundOtherConfigSourceListTest.php115Drupal\tmgmt_config\Tests\ConfigSourceListTest->testViewTranslation()
Found the Submit to translator buttonOtherConfigSourceListTest.php118Drupal\tmgmt_config\Tests\ConfigSourceListTest->testViewTranslation()
Found the requested form fields at OtherConfigSourceListTest.php118Drupal\tmgmt_config\Tests\ConfigSourceListTest->testViewTranslation()
Expected 'http://ec2-52-27-196-164.us-west-2.compute.amazonaws.com/checkout/admin/tmgmt/sources/config/view' matches current URL (http://ec2-52-27-196-164.us-west-2.compute.amazonaws.com/checkout/admin/tmgmt/jobs/1).OtherConfigSourceListTest.php121Drupal\tmgmt_config\Tests\ConfigSourceListTest->testViewTranslation()
"Test translation created." foundOtherConfigSourceListTest.php123Drupal\tmgmt_config\Tests\ConfigSourceListTest->testViewTranslation()
"The translation of Archive view to German is finished and can now be reviewed." foundOtherConfigSourceListTest.php124Drupal\tmgmt_config\Tests\ConfigSourceListTest->testViewTranslation()
Failed to set field items[views.view.archive] to 1OtherConfigSourceListTest.php134Drupal\tmgmt_config\Tests\ConfigSourceListTest->testViewTranslation()
Failed to set field items[views.view.content_recent] to 1OtherConfigSourceListTest.php134Drupal\tmgmt_config\Tests\ConfigSourceListTest->testViewTranslation()
Failed to set field items[views.view.content] to 1OtherConfigSourceListTest.php134Drupal\tmgmt_config\Tests\ConfigSourceListTest->testViewTranslation()
Failed to set field items[views.view.tmgmt_job_overview] to 1OtherConfigSourceListTest.php134Drupal\tmgmt_config\Tests\ConfigSourceListTest->testViewTranslation()
Found the Request translation buttonOtherConfigSourceListTest.php134Drupal\tmgmt_config\Tests\ConfigSourceListTest->testViewTranslation()
Found the requested form fields at OtherConfigSourceListTest.php134Drupal\tmgmt_config\Tests\ConfigSourceListTest->testViewTranslation()
"One job needs to be checked out." foundOtherConfigSourceListTest.php137Drupal\tmgmt_config\Tests\ConfigSourceListTest->testViewTranslation()
"Archive view and 3 more (English to ?, Unprocessed)" foundOtherConfigSourceListTest.php138Drupal\tmgmt_config\Tests\ConfigSourceListTest->testViewTranslation()
Found the Submit to translator buttonOtherConfigSourceListTest.php141Drupal\tmgmt_config\Tests\ConfigSourceListTest->testViewTranslation()
Found the requested form fields at OtherConfigSourceListTest.php141Drupal\tmgmt_config\Tests\ConfigSourceListTest->testViewTranslation()
Expected 'http://ec2-52-27-196-164.us-west-2.compute.amazonaws.com/checkout/admin/tmgmt/sources/config/view' matches current URL (http://ec2-52-27-196-164.us-west-2.compute.amazonaws.com/checkout/admin/tmgmt/jobs/1).OtherConfigSourceListTest.php144Drupal\tmgmt_config\Tests\ConfigSourceListTest->testViewTranslation()
"Test translation created." foundOtherConfigSourceListTest.php146Drupal\tmgmt_config\Tests\ConfigSourceListTest->testViewTranslation()
"The translation of Archive view to German is finished and can now be reviewed." foundOtherConfigSourceListTest.php147Drupal\tmgmt_config\Tests\ConfigSourceListTest->testViewTranslation()
"The translation of Recent content view to German is finished and can now be reviewed." foundOtherConfigSourceListTest.php148Drupal\tmgmt_config\Tests\ConfigSourceListTest->testViewTranslation()
"The translation of Content view to German is finished and can now be reviewed." foundOtherConfigSourceListTest.php149Drupal\tmgmt_config\Tests\ConfigSourceListTest->testViewTranslation()
"The translation of Job overview view to German is finished and can now be reviewed." foundOtherConfigSourceListTest.php150Drupal\tmgmt_config\Tests\ConfigSourceListTest->testViewTranslation()
Failed to set field items[views.view.tmgmt_job_items] to 1OtherConfigSourceListTest.php156Drupal\tmgmt_config\Tests\ConfigSourceListTest->testViewTranslation()
Found the Add to cart buttonOtherConfigSourceListTest.php156Drupal\tmgmt_config\Tests\ConfigSourceListTest->testViewTranslation()
Found the requested form fields at OtherConfigSourceListTest.php156Drupal\tmgmt_config\Tests\ConfigSourceListTest->testViewTranslation()
Link cart does not exist on http://ec2-52-27-196-164.us-west-2.compute.amazonaws.com/checkout/admin/tmgmt/jobs/1BrowserConfigSourceListTest.php157Drupal\tmgmt_config\Tests\ConfigSourceListTest->testViewTranslation()
Undefined offset: 0Drupal\tmgmt_config\Tests\ConfigSourceListTest->testViewTranslation() Drupal\simpletest\TestBase->run(Array) simpletest_script_run_one_test('10', 'Drupal\tmgmt_config\Tests\ConfigSourceListTest') NoticeConfigSourceListTest.php160Drupal\tmgmt_config\Tests\ConfigSourceListTest->testViewTranslation()
Trying to get property of non-objectDrupal\tmgmt_config\Tests\ConfigSourceListTest->testViewTranslation() Drupal\simpletest\TestBase->run(Array) simpletest_script_run_one_test('10', 'Drupal\tmgmt_config\Tests\ConfigSourceListTest') NoticeConfigSourceListTest.php160Drupal\tmgmt_config\Tests\ConfigSourceListTest->testViewTranslation()
Value '' is equal to value 'Cart'.OtherConfigSourceListTest.php161Drupal\tmgmt_config\Tests\ConfigSourceListTest->testViewTranslation()
Page title '' is equal to 'Cart | Drupal'.OtherConfigSourceListTest.php162Drupal\tmgmt_config\Tests\ConfigSourceListTest->testViewTranslation()
"Request translation" foundOtherConfigSourceListTest.php163Drupal\tmgmt_config\Tests\ConfigSourceListTest->testViewTranslation()
Object of class Drupal\views\Entity\View could not be converted to stringRecoverable fatal errorSql.php1457Drupal\views\Plugin\views\query\Sql->execute()
"One job needs to be checked out." foundOtherConfigSourceListTest.php244Drupal\tmgmt_config\Tests\ConfigSourceListTest->testSimpleConfigTranslation()
"System information (English to ?, Unprocessed)" foundOtherConfigSourceListTest.php245Drupal\tmgmt_config\Tests\ConfigSourceListTest->testSimpleConfigTranslation()
Found the Submit to translator buttonOtherConfigSourceListTest.php248Drupal\tmgmt_config\Tests\ConfigSourceListTest->testSimpleConfigTranslation()
Found the requested form fields at OtherConfigSourceListTest.php248Drupal\tmgmt_config\Tests\ConfigSourceListTest->testSimpleConfigTranslation()
Expected 'http://ec2-52-27-196-164.us-west-2.compute.amazonaws.com/checkout/admin/tmgmt/sources/config/_simple_config' matches current URL (http://ec2-52-27-196-164.us-west-2.compute.amazonaws.com/checkout/admin/tmgmt/jobs/1).OtherConfigSourceListTest.php251Drupal\tmgmt_config\Tests\ConfigSourceListTest->testSimpleConfigTranslation()
Raw "href="/checkout/admin/tmgmt/items/1?destination=admin/tmgmt/sources/config/_simple_config" title="Active job item: Needs review"" foundOtherConfigSourceListTest.php257Drupal\tmgmt_config\Tests\ConfigSourceListTest->testSimpleConfigTranslation()
"Test translation created." foundOtherConfigSourceListTest.php259Drupal\tmgmt_config\Tests\ConfigSourceListTest->testSimpleConfigTranslation()
"The translation of System information to German is finished and can now be reviewed." foundOtherConfigSourceListTest.php260Drupal\tmgmt_config\Tests\ConfigSourceListTest->testSimpleConfigTranslation()
Undefined offset: 0Drupal\tmgmt_config\Tests\ConfigSourceListTest->testSimpleConfigTranslation() Drupal\simpletest\TestBase->run(Array) simpletest_script_run_one_test('10', 'Drupal\tmgmt_config\Tests\ConfigSourceListTest') NoticeConfigSourceListTest.php264Drupal\tmgmt_config\Tests\ConfigSourceListTest->testSimpleConfigTranslation()
Uninitialized string offset: 0Drupal\simpletest\WebTestBase->getAbsoluteUrl(NULL) Drupal\tmgmt_config\Tests\ConfigSourceListTest->testSimpleConfigTranslation() Drupal\simpletest\TestBase->run(Array) simpletest_script_run_one_test('10', 'Drupal\tmgmt_config\Tests\ConfigSourceListTest') NoticeWebTestBase.php2468Drupal\simpletest\WebTestBase->getAbsoluteUrl()
Found the Save buttonOtherConfigSourceListTest.php266Drupal\tmgmt_config\Tests\ConfigSourceListTest->testSimpleConfigTranslation()
Found the requested form fields at OtherConfigSourceListTest.php266Drupal\tmgmt_config\Tests\ConfigSourceListTest->testSimpleConfigTranslation()
Failed to set field items[entity.user.admin_form] to 1OtherConfigSourceListTest.php272Drupal\tmgmt_config\Tests\ConfigSourceListTest->testSimpleConfigTranslation()
Found the Request translation buttonOtherConfigSourceListTest.php272Drupal\tmgmt_config\Tests\ConfigSourceListTest->testSimpleConfigTranslation()
Found the requested form fields at OtherConfigSourceListTest.php272Drupal\tmgmt_config\Tests\ConfigSourceListTest->testSimpleConfigTranslation()
"Account settings (English to ?, Unprocessed)" foundOtherConfigSourceListTest.php276Drupal\tmgmt_config\Tests\ConfigSourceListTest->testSimpleConfigTranslation()
Found the Submit to translator buttonOtherConfigSourceListTest.php277Drupal\tmgmt_config\Tests\ConfigSourceListTest->testSimpleConfigTranslation()
Found the requested form fields at OtherConfigSourceListTest.php277Drupal\tmgmt_config\Tests\ConfigSourceListTest->testSimpleConfigTranslation()
Expected 'http://ec2-52-27-196-164.us-west-2.compute.amazonaws.com/checkout/admin/tmgmt/sources/config/_simple_config' matches current URL (http://ec2-52-27-196-164.us-west-2.compute.amazonaws.com/checkout/user/4).OtherConfigSourceListTest.php280Drupal\tmgmt_config\Tests\ConfigSourceListTest->testSimpleConfigTranslation()
Value 0 is equal to value 2.OtherConfigSourceListTest.php288Drupal\tmgmt_config\Tests\ConfigSourceListTest->testSimpleConfigTranslation()
ExpandDrupal\tmgmt_config\Tests\ConfigSourceUiTest166527
MessageGroupFilenameLineFunctionStatus
Object of class Drupal\views\Entity\View could not be converted to stringRecoverable fatal errorSql.php1457Drupal\views\Plugin\views\query\Sql->execute()
"One job needs to be checked out." foundOtherConfigSourceUiTest.php68Drupal\tmgmt_config\Tests\ConfigSourceUiTest->testNodeTypeTranslateTabSingleCheckout()
"Article content type (English to German, Unprocessed)" foundOtherConfigSourceUiTest.php69Drupal\tmgmt_config\Tests\ConfigSourceUiTest->testNodeTypeTranslateTabSingleCheckout()
Found the Submit to translator buttonOtherConfigSourceUiTest.php72Drupal\tmgmt_config\Tests\ConfigSourceUiTest->testNodeTypeTranslateTabSingleCheckout()
Found the requested form fields at OtherConfigSourceUiTest.php72Drupal\tmgmt_config\Tests\ConfigSourceUiTest->testNodeTypeTranslateTabSingleCheckout()
Expected 'http://ec2-52-27-196-164.us-west-2.compute.amazonaws.com/checkout/admin/structure/types/manage/article/translate' matches current URL (http://ec2-52-27-196-164.us-west-2.compute.amazonaws.com/checkout/admin/tmgmt/jobs/1).OtherConfigSourceUiTest.php75Drupal\tmgmt_config\Tests\ConfigSourceUiTest->testNodeTypeTranslateTabSingleCheckout()
Link Needs review does not exist on http://ec2-52-27-196-164.us-west-2.compute.amazonaws.com/checkout/admin/structure/types/manage/article/translateBrowserConfigSourceUiTest.php89Drupal\tmgmt_config\Tests\ConfigSourceUiTest->testNodeTypeTranslateTabSingleCheckout()
Found the Save as completed buttonOtherConfigSourceUiTest.php90Drupal\tmgmt_config\Tests\ConfigSourceUiTest->testNodeTypeTranslateTabSingleCheckout()
Found the requested form fields at OtherConfigSourceUiTest.php90Drupal\tmgmt_config\Tests\ConfigSourceUiTest->testNodeTypeTranslateTabSingleCheckout()
Object of class Drupal\views\Entity\View could not be converted to stringRecoverable fatal errorSql.php1457Drupal\views\Plugin\views\query\Sql->execute()
"One job needs to be checked out." foundOtherConfigSourceUiTest.php99Drupal\tmgmt_config\Tests\ConfigSourceUiTest->testNodeTypeTranslateTabSingleCheckout()
"Article content type (English to Spanish, Unprocessed)" foundOtherConfigSourceUiTest.php100Drupal\tmgmt_config\Tests\ConfigSourceUiTest->testNodeTypeTranslateTabSingleCheckout()
Found the Submit to translator buttonOtherConfigSourceUiTest.php101Drupal\tmgmt_config\Tests\ConfigSourceUiTest->testNodeTypeTranslateTabSingleCheckout()
Found the requested form fields at OtherConfigSourceUiTest.php101Drupal\tmgmt_config\Tests\ConfigSourceUiTest->testNodeTypeTranslateTabSingleCheckout()
Expected 'http://ec2-52-27-196-164.us-west-2.compute.amazonaws.com/checkout/admin/structure/types/manage/article/translate' matches current URL (http://ec2-52-27-196-164.us-west-2.compute.amazonaws.com/checkout/admin/tmgmt/jobs/2).OtherConfigSourceUiTest.php104Drupal\tmgmt_config\Tests\ConfigSourceUiTest->testNodeTypeTranslateTabSingleCheckout()
Value 0 is equal to value 2.OtherConfigSourceUiTest.php115Drupal\tmgmt_config\Tests\ConfigSourceUiTest->testNodeTypeTranslateTabSingleCheckout()
Object of class Drupal\views\Entity\View could not be converted to stringRecoverable fatal errorSql.php1457Drupal\views\Plugin\views\query\Sql->execute()
"2 jobs need to be checked out." foundOtherConfigSourceUiTest.php145Drupal\tmgmt_config\Tests\ConfigSourceUiTest->testNodeTypeTranslateTabMultipeCheckout()
"Article content type (English to German, Unprocessed)" foundOtherConfigSourceUiTest.php148Drupal\tmgmt_config\Tests\ConfigSourceUiTest->testNodeTypeTranslateTabMultipeCheckout()
Found the Submit to translator and continue buttonOtherConfigSourceUiTest.php149Drupal\tmgmt_config\Tests\ConfigSourceUiTest->testNodeTypeTranslateTabMultipeCheckout()
Found the requested form fields at OtherConfigSourceUiTest.php149Drupal\tmgmt_config\Tests\ConfigSourceUiTest->testNodeTypeTranslateTabMultipeCheckout()
"Article content type (English to Spanish, Unprocessed)" foundOtherConfigSourceUiTest.php150Drupal\tmgmt_config\Tests\ConfigSourceUiTest->testNodeTypeTranslateTabMultipeCheckout()
Found the Submit to translator buttonOtherConfigSourceUiTest.php151Drupal\tmgmt_config\Tests\ConfigSourceUiTest->testNodeTypeTranslateTabMultipeCheckout()
Found the requested form fields at OtherConfigSourceUiTest.php151Drupal\tmgmt_config\Tests\ConfigSourceUiTest->testNodeTypeTranslateTabMultipeCheckout()
Expected 'http://ec2-52-27-196-164.us-west-2.compute.amazonaws.com/checkout/admin/structure/types/manage/article/translate' matches current URL (http://ec2-52-27-196-164.us-west-2.compute.amazonaws.com/checkout/admin/tmgmt/jobs/1).OtherConfigSourceUiTest.php154Drupal\tmgmt_config\Tests\ConfigSourceUiTest->testNodeTypeTranslateTabMultipeCheckout()
"Test translation created." foundOtherConfigSourceUiTest.php155Drupal\tmgmt_config\Tests\ConfigSourceUiTest->testNodeTypeTranslateTabMultipeCheckout()
Value 0 is equal to value 2.OtherConfigSourceUiTest.php170Drupal\tmgmt_config\Tests\ConfigSourceUiTest->testNodeTypeTranslateTabMultipeCheckout()
Object of class Drupal\views\Entity\View could not be converted to stringRecoverable fatal errorSql.php1457Drupal\views\Plugin\views\query\Sql->execute()
"One job needs to be checked out." foundOtherConfigSourceUiTest.php193Drupal\tmgmt_config\Tests\ConfigSourceUiTest->testViewTranslateTabSingleCheckout()
"Content view (English to German, Unprocessed)" foundOtherConfigSourceUiTest.php194Drupal\tmgmt_config\Tests\ConfigSourceUiTest->testViewTranslateTabSingleCheckout()
Found the Submit to translator buttonOtherConfigSourceUiTest.php197Drupal\tmgmt_config\Tests\ConfigSourceUiTest->testViewTranslateTabSingleCheckout()
Found the requested form fields at OtherConfigSourceUiTest.php197Drupal\tmgmt_config\Tests\ConfigSourceUiTest->testViewTranslateTabSingleCheckout()
Expected 'http://ec2-52-27-196-164.us-west-2.compute.amazonaws.com/checkout/admin/structure/views/view/content/translate' matches current URL (http://ec2-52-27-196-164.us-west-2.compute.amazonaws.com/checkout/admin/tmgmt/jobs/1).OtherConfigSourceUiTest.php200Drupal\tmgmt_config\Tests\ConfigSourceUiTest->testViewTranslateTabSingleCheckout()
Link Needs review does not exist on http://ec2-52-27-196-164.us-west-2.compute.amazonaws.com/checkout/admin/structure/views/view/content/translateBrowserConfigSourceUiTest.php214Drupal\tmgmt_config\Tests\ConfigSourceUiTest->testViewTranslateTabSingleCheckout()
Found the Save as completed buttonOtherConfigSourceUiTest.php215Drupal\tmgmt_config\Tests\ConfigSourceUiTest->testViewTranslateTabSingleCheckout()
Found the requested form fields at OtherConfigSourceUiTest.php215Drupal\tmgmt_config\Tests\ConfigSourceUiTest->testViewTranslateTabSingleCheckout()
Object of class Drupal\views\Entity\View could not be converted to stringRecoverable fatal errorSql.php1457Drupal\views\Plugin\views\query\Sql->execute()
"One job needs to be checked out." foundOtherConfigSourceUiTest.php224Drupal\tmgmt_config\Tests\ConfigSourceUiTest->testViewTranslateTabSingleCheckout()
"Content view (English to Spanish, Unprocessed)" foundOtherConfigSourceUiTest.php225Drupal\tmgmt_config\Tests\ConfigSourceUiTest->testViewTranslateTabSingleCheckout()
Found the Submit to translator buttonOtherConfigSourceUiTest.php226Drupal\tmgmt_config\Tests\ConfigSourceUiTest->testViewTranslateTabSingleCheckout()
Found the requested form fields at OtherConfigSourceUiTest.php226Drupal\tmgmt_config\Tests\ConfigSourceUiTest->testViewTranslateTabSingleCheckout()
Expected 'http://ec2-52-27-196-164.us-west-2.compute.amazonaws.com/checkout/admin/structure/views/view/content/translate' matches current URL (http://ec2-52-27-196-164.us-west-2.compute.amazonaws.com/checkout/admin/tmgmt/jobs/2).OtherConfigSourceUiTest.php229Drupal\tmgmt_config\Tests\ConfigSourceUiTest->testViewTranslateTabSingleCheckout()
Value 0 is equal to value 2.OtherConfigSourceUiTest.php240Drupal\tmgmt_config\Tests\ConfigSourceUiTest->testViewTranslateTabSingleCheckout()
Object of class Drupal\views\Entity\View could not be converted to stringRecoverable fatal errorSql.php1457Drupal\views\Plugin\views\query\Sql->execute()
"One job needs to be checked out." foundOtherConfigSourceUiTest.php283Drupal\tmgmt_config\Tests\ConfigSourceUiTest->testSimpleConfiguration()
"System information (English to German, Unprocessed)" foundOtherConfigSourceUiTest.php284Drupal\tmgmt_config\Tests\ConfigSourceUiTest->testSimpleConfiguration()
Found the Submit to translator buttonOtherConfigSourceUiTest.php287Drupal\tmgmt_config\Tests\ConfigSourceUiTest->testSimpleConfiguration()
Found the requested form fields at OtherConfigSourceUiTest.php287Drupal\tmgmt_config\Tests\ConfigSourceUiTest->testSimpleConfiguration()
Expected 'http://ec2-52-27-196-164.us-west-2.compute.amazonaws.com/checkout/admin/config/system/site-information/translate' matches current URL (http://ec2-52-27-196-164.us-west-2.compute.amazonaws.com/checkout/admin/tmgmt/jobs/1).OtherConfigSourceUiTest.php290Drupal\tmgmt_config\Tests\ConfigSourceUiTest->testSimpleConfiguration()
Link Needs review does not exist on http://ec2-52-27-196-164.us-west-2.compute.amazonaws.com/checkout/admin/config/system/site-information/translateBrowserConfigSourceUiTest.php304Drupal\tmgmt_config\Tests\ConfigSourceUiTest->testSimpleConfiguration()
Found the Save buttonOtherConfigSourceUiTest.php305Drupal\tmgmt_config\Tests\ConfigSourceUiTest->testSimpleConfiguration()
Found the requested form fields at OtherConfigSourceUiTest.php305Drupal\tmgmt_config\Tests\ConfigSourceUiTest->testSimpleConfiguration()
Object of class Drupal\views\Entity\View could not be converted to stringRecoverable fatal errorSql.php1457Drupal\views\Plugin\views\query\Sql->execute()
"One job needs to be checked out." foundOtherConfigSourceUiTest.php314Drupal\tmgmt_config\Tests\ConfigSourceUiTest->testSimpleConfiguration()
"System information (English to Spanish, Unprocessed)" foundOtherConfigSourceUiTest.php315Drupal\tmgmt_config\Tests\ConfigSourceUiTest->testSimpleConfiguration()
Found the Submit to translator buttonOtherConfigSourceUiTest.php316Drupal\tmgmt_config\Tests\ConfigSourceUiTest->testSimpleConfiguration()
Found the requested form fields at OtherConfigSourceUiTest.php316Drupal\tmgmt_config\Tests\ConfigSourceUiTest->testSimpleConfiguration()
Expected 'http://ec2-52-27-196-164.us-west-2.compute.amazonaws.com/checkout/admin/config/system/site-information/translate' matches current URL (http://ec2-52-27-196-164.us-west-2.compute.amazonaws.com/checkout/admin/tmgmt/jobs/2).OtherConfigSourceUiTest.php319Drupal\tmgmt_config\Tests\ConfigSourceUiTest->testSimpleConfiguration()
Value 0 is equal to value 2.OtherConfigSourceUiTest.php330Drupal\tmgmt_config\Tests\ConfigSourceUiTest->testSimpleConfiguration()
LeafDrupal\tmgmt_config\Tests\ConfigSourceUnitTest3900
ExpandDrupal\tmgmt_content\Tests\ContentEntitySourceListTest14033
MessageGroupFilenameLineFunctionStatus
Object of class Drupal\views\Entity\View could not be converted to stringRecoverable fatal errorSql.php1457Drupal\views\Plugin\views\query\Sql->execute()
"One job needs to be checked out." foundOtherContentEntitySourceListTest.php180Drupal\tmgmt_content\Tests\ContentEntitySourceListTest->testTranslationSubmissions()
Object of class Drupal\views\Entity\View could not be converted to stringRecoverable fatal errorSql.php1457Drupal\views\Plugin\views\query\Sql->execute()
"One job needs to be checked out." foundOtherContentEntitySourceListTest.php189Drupal\tmgmt_content\Tests\ContentEntitySourceListTest->testTranslationSubmissions()
Object of class Drupal\views\Entity\View could not be converted to stringRecoverable fatal errorSql.php1457Drupal\views\Plugin\views\query\Sql->execute()
"3 jobs need to be checked out." foundOtherContentEntitySourceListTest.php206Drupal\tmgmt_content\Tests\ContentEntitySourceListTest->testTranslationSubmissions()
ExpandDrupal\tmgmt_content\Tests\ContentEntitySourceUiTest214485
MessageGroupFilenameLineFunctionStatus
Object of class Drupal\views\Entity\View could not be converted to stringRecoverable fatal errorSql.php1457Drupal\views\Plugin\views\query\Sql->execute()
"One job needs to be checked out." foundOtherContentEntitySourceUiTest.php83Drupal\tmgmt_content\Tests\ContentEntitySourceUiTest->testNodeTranslateTabSingleCheckout()
"uLNk4bve" foundOtherContentEntitySourceUiTest.php84Drupal\tmgmt_content\Tests\ContentEntitySourceUiTest->testNodeTranslateTabSingleCheckout()
Found the Submit to translator buttonOtherContentEntitySourceUiTest.php87Drupal\tmgmt_content\Tests\ContentEntitySourceUiTest->testNodeTranslateTabSingleCheckout()
Found the requested form fields at OtherContentEntitySourceUiTest.php87Drupal\tmgmt_content\Tests\ContentEntitySourceUiTest->testNodeTranslateTabSingleCheckout()
Value 'http://ec2-52-27-196-164.us-west-2.compute.amazonaws.com/checkout/node/1/translations' is equal to value 'http://ec2-52-27-196-164.us-west-2.compute.amazonaws.com/checkout/admin/tmgmt/jobs/1'.OtherContentEntitySourceUiTest.php90Drupal\tmgmt_content\Tests\ContentEntitySourceUiTest->testNodeTranslateTabSingleCheckout()
"Test translation created." foundOtherContentEntitySourceUiTest.php91Drupal\tmgmt_content\Tests\ContentEntitySourceUiTest->testNodeTranslateTabSingleCheckout()
"The translation of uLNk4bve to German is finished and can now be reviewed." foundOtherContentEntitySourceUiTest.php95Drupal\tmgmt_content\Tests\ContentEntitySourceUiTest->testNodeTranslateTabSingleCheckout()
Link Needs review does not exist on http://ec2-52-27-196-164.us-west-2.compute.amazonaws.com/checkout/admin/tmgmt/jobs/1BrowserContentEntitySourceUiTest.php98Drupal\tmgmt_content\Tests\ContentEntitySourceUiTest->testNodeTranslateTabSingleCheckout()
Found the Save as completed buttonOtherContentEntitySourceUiTest.php99Drupal\tmgmt_content\Tests\ContentEntitySourceUiTest->testNodeTranslateTabSingleCheckout()
Found the requested form fields at OtherContentEntitySourceUiTest.php99Drupal\tmgmt_content\Tests\ContentEntitySourceUiTest->testNodeTranslateTabSingleCheckout()
"The translation for uLNk4bve has been accepted." foundOtherContentEntitySourceUiTest.php101Drupal\tmgmt_content\Tests\ContentEntitySourceUiTest->testNodeTranslateTabSingleCheckout()
Link de_uLNk4bve does not exist on http://ec2-52-27-196-164.us-west-2.compute.amazonaws.com/checkout/admin/tmgmt/jobs/1BrowserContentEntitySourceUiTest.php104Drupal\tmgmt_content\Tests\ContentEntitySourceUiTest->testNodeTranslateTabSingleCheckout()
"de_uLNk4bve" foundOtherContentEntitySourceUiTest.php105Drupal\tmgmt_content\Tests\ContentEntitySourceUiTest->testNodeTranslateTabSingleCheckout()
"de_dIxE4jFhbbO2grdSSCOo" foundOtherContentEntitySourceUiTest.php106Drupal\tmgmt_content\Tests\ContentEntitySourceUiTest->testNodeTranslateTabSingleCheckout()
Object of class Drupal\views\Entity\View could not be converted to stringRecoverable fatal errorSql.php1457Drupal\views\Plugin\views\query\Sql->execute()
Object of class Drupal\views\Entity\View could not be converted to stringRecoverable fatal errorSql.php1457Drupal\views\Plugin\views\query\Sql->execute()
"One job needs to be checked out." foundOtherContentEntitySourceUiTest.php133Drupal\tmgmt_content\Tests\ContentEntitySourceUiTest->testNodeTranslateTabSingleCheckout()
"uLNk4bve" foundOtherContentEntitySourceUiTest.php134Drupal\tmgmt_content\Tests\ContentEntitySourceUiTest->testNodeTranslateTabSingleCheckout()
Found the Submit to translator buttonOtherContentEntitySourceUiTest.php135Drupal\tmgmt_content\Tests\ContentEntitySourceUiTest->testNodeTranslateTabSingleCheckout()
Found the requested form fields at OtherContentEntitySourceUiTest.php135Drupal\tmgmt_content\Tests\ContentEntitySourceUiTest->testNodeTranslateTabSingleCheckout()
Value 'http://ec2-52-27-196-164.us-west-2.compute.amazonaws.com/checkout/node/1' is equal to value 'http://ec2-52-27-196-164.us-west-2.compute.amazonaws.com/checkout/admin/tmgmt/jobs/3'.OtherContentEntitySourceUiTest.php138Drupal\tmgmt_content\Tests\ContentEntitySourceUiTest->testNodeTranslateTabSingleCheckout()
"uLNk4bve" not foundOtherContentEntitySourceUiTest.php148Drupal\tmgmt_content\Tests\ContentEntitySourceUiTest->testNodeTranslateTabSingleCheckout()
Object of class Drupal\views\Entity\View could not be converted to stringRecoverable fatal errorSql.php1457Drupal\views\Plugin\views\query\Sql->execute()
"2 jobs need to be checked out." foundOtherContentEntitySourceUiTest.php205Drupal\tmgmt_content\Tests\ContentEntitySourceUiTest->testNodeTranslateTabMultipeCheckout()
"abbLnhVf" foundOtherContentEntitySourceUiTest.php208Drupal\tmgmt_content\Tests\ContentEntitySourceUiTest->testNodeTranslateTabMultipeCheckout()
Found the Submit to translator and continue buttonOtherContentEntitySourceUiTest.php209Drupal\tmgmt_content\Tests\ContentEntitySourceUiTest->testNodeTranslateTabMultipeCheckout()
Found the requested form fields at OtherContentEntitySourceUiTest.php209Drupal\tmgmt_content\Tests\ContentEntitySourceUiTest->testNodeTranslateTabMultipeCheckout()
"abbLnhVf" foundOtherContentEntitySourceUiTest.php210Drupal\tmgmt_content\Tests\ContentEntitySourceUiTest->testNodeTranslateTabMultipeCheckout()
Found the Submit to translator buttonOtherContentEntitySourceUiTest.php211Drupal\tmgmt_content\Tests\ContentEntitySourceUiTest->testNodeTranslateTabMultipeCheckout()
Found the requested form fields at OtherContentEntitySourceUiTest.php211Drupal\tmgmt_content\Tests\ContentEntitySourceUiTest->testNodeTranslateTabMultipeCheckout()
Value 'http://ec2-52-27-196-164.us-west-2.compute.amazonaws.com/checkout/node/1/translations' is equal to value 'http://ec2-52-27-196-164.us-west-2.compute.amazonaws.com/checkout/admin/tmgmt/jobs/1'.OtherContentEntitySourceUiTest.php214Drupal\tmgmt_content\Tests\ContentEntitySourceUiTest->testNodeTranslateTabMultipeCheckout()
"Test translation created." foundOtherContentEntitySourceUiTest.php215Drupal\tmgmt_content\Tests\ContentEntitySourceUiTest->testNodeTranslateTabMultipeCheckout()
"The translation for abbLnhVf has been accepted." foundOtherContentEntitySourceUiTest.php220Drupal\tmgmt_content\Tests\ContentEntitySourceUiTest->testNodeTranslateTabMultipeCheckout()
"de_abbLnhVf" foundOtherContentEntitySourceUiTest.php225Drupal\tmgmt_content\Tests\ContentEntitySourceUiTest->testNodeTranslateTabMultipeCheckout()
"de_xm71w3yoyFCSdiUGmjRy" foundOtherContentEntitySourceUiTest.php226Drupal\tmgmt_content\Tests\ContentEntitySourceUiTest->testNodeTranslateTabMultipeCheckout()
"es_abbLnhVf" foundOtherContentEntitySourceUiTest.php229Drupal\tmgmt_content\Tests\ContentEntitySourceUiTest->testNodeTranslateTabMultipeCheckout()
"es_xm71w3yoyFCSdiUGmjRy" foundOtherContentEntitySourceUiTest.php230Drupal\tmgmt_content\Tests\ContentEntitySourceUiTest->testNodeTranslateTabMultipeCheckout()
Object of class Drupal\views\Entity\View could not be converted to stringRecoverable fatal errorSql.php1457Drupal\views\Plugin\views\query\Sql->execute()
"2 jobs need to be checked out." foundOtherContentEntitySourceUiTest.php300Drupal\tmgmt_content\Tests\ContentEntitySourceUiTest->testCommentTranslateTab()
"hsRNhLMd" foundOtherContentEntitySourceUiTest.php303Drupal\tmgmt_content\Tests\ContentEntitySourceUiTest->testCommentTranslateTab()
Found the Submit to translator and continue buttonOtherContentEntitySourceUiTest.php304Drupal\tmgmt_content\Tests\ContentEntitySourceUiTest->testCommentTranslateTab()
Found the requested form fields at OtherContentEntitySourceUiTest.php304Drupal\tmgmt_content\Tests\ContentEntitySourceUiTest->testCommentTranslateTab()
"hsRNhLMd" foundOtherContentEntitySourceUiTest.php305Drupal\tmgmt_content\Tests\ContentEntitySourceUiTest->testCommentTranslateTab()
Found the Submit to translator buttonOtherContentEntitySourceUiTest.php306Drupal\tmgmt_content\Tests\ContentEntitySourceUiTest->testCommentTranslateTab()
Found the requested form fields at OtherContentEntitySourceUiTest.php306Drupal\tmgmt_content\Tests\ContentEntitySourceUiTest->testCommentTranslateTab()
Expected 'http://ec2-52-27-196-164.us-west-2.compute.amazonaws.com/checkout/comment/1/translations' matches current URL (http://ec2-52-27-196-164.us-west-2.compute.amazonaws.com/checkout/admin/tmgmt/jobs/1).OtherContentEntitySourceUiTest.php309Drupal\tmgmt_content\Tests\ContentEntitySourceUiTest->testCommentTranslateTab()
"Test translation created." foundOtherContentEntitySourceUiTest.php310Drupal\tmgmt_content\Tests\ContentEntitySourceUiTest->testCommentTranslateTab()
"The translation for hsRNhLMd has been accepted." foundOtherContentEntitySourceUiTest.php315Drupal\tmgmt_content\Tests\ContentEntitySourceUiTest->testCommentTranslateTab()
Link de_hsRNhLMd does not exist on http://ec2-52-27-196-164.us-west-2.compute.amazonaws.com/checkout/admin/tmgmt/jobs/1BrowserContentEntitySourceUiTest.php318Drupal\tmgmt_content\Tests\ContentEntitySourceUiTest->testCommentTranslateTab()
"de_g0nKLVRf" foundOtherContentEntitySourceUiTest.php319Drupal\tmgmt_content\Tests\ContentEntitySourceUiTest->testCommentTranslateTab()
Link es_hsRNhLMd does not exist on http://ec2-52-27-196-164.us-west-2.compute.amazonaws.com/checkout/comment/1/translationsBrowserContentEntitySourceUiTest.php323Drupal\tmgmt_content\Tests\ContentEntitySourceUiTest->testCommentTranslateTab()
"es_g0nKLVRf" foundOtherContentEntitySourceUiTest.php325Drupal\tmgmt_content\Tests\ContentEntitySourceUiTest->testCommentTranslateTab()
LeafDrupal\tmgmt_content\Tests\ContentEntitySourceUnitTest14600
LeafDrupal\tmgmt_content\Tests\ContentEntitySuggestionsTest2400
ExpandDrupal\tmgmt_demo\Tests\TMGMTDemoTest4122
MessageGroupFilenameLineFunctionStatus
Object of class Drupal\views\Entity\View could not be converted to stringRecoverable fatal errorSql.php1457Drupal\views\Plugin\views\query\Sql->execute()
"2 jobs need to be checked out." foundOtherTMGMTDemoTest.php46Drupal\tmgmt_demo\Tests\TMGMTDemoTest->testInstalled()
Object of class Drupal\views\Entity\View could not be converted to stringRecoverable fatal errorSql.php1457Drupal\views\Plugin\views\query\Sql->execute()
"2 jobs need to be checked out." foundOtherTMGMTDemoTest.php52Drupal\tmgmt_demo\Tests\TMGMTDemoTest->testInstalled()
ExpandDrupal\tmgmt_file\Tests\FileTranslatorTest873310
MessageGroupFilenameLineFunctionStatus
Object of class Drupal\views\Entity\View could not be converted to stringRecoverable fatal errorSql.php1457Drupal\views\Plugin\views\query\Sql->execute()
Failed to set field files[file] to public://tmgmt_file/translated.xlfOtherFileTranslatorTest.php89Drupal\tmgmt_file\Tests\FileTranslatorTest->testXLIFFTextProcessing()
Found the Import buttonOtherFileTranslatorTest.php89Drupal\tmgmt_file\Tests\FileTranslatorTest->testXLIFFTextProcessing()
Found the requested form fields at http://ec2-52-27-196-164.us-west-2.compute.amazonaws.com/checkout/admin/tmgmt/jobs/1OtherFileTranslatorTest.php89Drupal\tmgmt_file\Tests\FileTranslatorTest->testXLIFFTextProcessing()
Undefined index: #translationDrupal\tmgmt_file\Tests\FileTranslatorTest->testXLIFFTextProcessing() Drupal\simpletest\TestBase->run(Array) simpletest_script_run_one_test('19', 'Drupal\tmgmt_file\Tests\FileTranslatorTest') NoticeFileTranslatorTest.php98Drupal\tmgmt_file\Tests\FileTranslatorTest->testXLIFFTextProcessing()
Value '' is equal to value '<p>one translated paragraph with special characters: äöüľščťžýáíéäňú©«®™»</p> <p>one translated paragraph with a <br />break line</p> <p>one translated paragraph with html entities: &amp;&lt;&gt;</p> <p>and here we have some link <a href="http://example.com">break line</a></p> <p>one translated paragraph with an <img src="not-existing.gif" alt="not existing image" title="not existing image" />image</p> <p>hello <span class="green">world</span> this is <span class="red">simple html</span></p><div>nested 1<div>nested 2<div>nested 3</div></div></div>'.OtherFileTranslatorTest.php98Drupal\tmgmt_file\Tests\FileTranslatorTest->testXLIFFTextProcessing()
Value false is TRUE.OtherFileTranslatorTest.php102Drupal\tmgmt_file\Tests\FileTranslatorTest->testXLIFFTextProcessing()
Object of class Drupal\views\Entity\View could not be converted to stringRecoverable fatal errorSql.php1457Drupal\views\Plugin\views\query\Sql->execute()
Failed to set field files[file] to public://tmgmt_file/translated.xlfOtherFileTranslatorTest.php122Drupal\tmgmt_file\Tests\FileTranslatorTest->testXLIFFTextProcessing()
Found the Import buttonOtherFileTranslatorTest.php122Drupal\tmgmt_file\Tests\FileTranslatorTest->testXLIFFTextProcessing()
Found the requested form fields at http://ec2-52-27-196-164.us-west-2.compute.amazonaws.com/checkout/admin/tmgmt/jobs/2OtherFileTranslatorTest.php122Drupal\tmgmt_file\Tests\FileTranslatorTest->testXLIFFTextProcessing()
The validation of semantic integrity must fail.OtherFileTranslatorTest.php127Drupal\tmgmt_file\Tests\FileTranslatorTest->testXLIFFTextProcessing()
Object of class Drupal\views\Entity\View could not be converted to stringRecoverable fatal errorSql.php1457Drupal\views\Plugin\views\query\Sql->execute()
Failed to set field files[file] to public://tmgmt_file/translated.htmlOtherFileTranslatorTest.php397Drupal\tmgmt_file\Tests\FileTranslatorTest->importFile()
Found the Import buttonOtherFileTranslatorTest.php397Drupal\tmgmt_file\Tests\FileTranslatorTest->importFile()
Found the requested form fields at http://ec2-52-27-196-164.us-west-2.compute.amazonaws.com/checkout/admin/tmgmt/jobs/1OtherFileTranslatorTest.php397Drupal\tmgmt_file\Tests\FileTranslatorTest->importFile()
Link review does not exist on http://ec2-52-27-196-164.us-west-2.compute.amazonaws.com/checkout/admin/tmgmt/jobs/1BrowserFileTranslatorTest.php406Drupal\tmgmt_file\Tests\FileTranslatorTest->importFile()
"de_Text for job item with type test and id 1." foundOtherFileTranslatorTest.php408Drupal\tmgmt_file\Tests\FileTranslatorTest->importFile()
Found the Save as completed buttonOtherFileTranslatorTest.php413Drupal\tmgmt_file\Tests\FileTranslatorTest->importFile()
Found the requested form fields at OtherFileTranslatorTest.php413Drupal\tmgmt_file\Tests\FileTranslatorTest->importFile()
Link review does not exist on http://ec2-52-27-196-164.us-west-2.compute.amazonaws.com/checkout/admin/tmgmt/jobs/1BrowserFileTranslatorTest.php415Drupal\tmgmt_file\Tests\FileTranslatorTest->importFile()
"de_Text for job item with type test and id 2." foundOtherFileTranslatorTest.php420Drupal\tmgmt_file\Tests\FileTranslatorTest->importFile()
Found the Save as completed buttonOtherFileTranslatorTest.php422Drupal\tmgmt_file\Tests\FileTranslatorTest->importFile()
Found the requested form fields at OtherFileTranslatorTest.php422Drupal\tmgmt_file\Tests\FileTranslatorTest->importFile()
"Finished" foundOtherFileTranslatorTest.php426Drupal\tmgmt_file\Tests\FileTranslatorTest->importFile()
Object of class Drupal\views\Entity\View could not be converted to stringRecoverable fatal errorSql.php1457Drupal\views\Plugin\views\query\Sql->execute()
Failed to set field files[file] to public://tmgmt_file/wrong_file.xlfOtherFileTranslatorTest.php273Drupal\tmgmt_file\Tests\FileTranslatorTest->testXLIFF()
Found the Import buttonOtherFileTranslatorTest.php273Drupal\tmgmt_file\Tests\FileTranslatorTest->testXLIFF()
Found the requested form fields at http://ec2-52-27-196-164.us-west-2.compute.amazonaws.com/checkout/admin/tmgmt/jobs/1OtherFileTranslatorTest.php273Drupal\tmgmt_file\Tests\FileTranslatorTest->testXLIFF()
"Failed to validate file, import aborted." foundOtherFileTranslatorTest.php274Drupal\tmgmt_file\Tests\FileTranslatorTest->testXLIFF()
Object of class Drupal\views\Entity\View could not be converted to stringRecoverable fatal errorSql.php1457Drupal\views\Plugin\views\query\Sql->execute()
Failed to set field files[file] to public://tmgmt_file/wrong_file.xlfOtherFileTranslatorTest.php294Drupal\tmgmt_file\Tests\FileTranslatorTest->testXLIFF()
Found the Import buttonOtherFileTranslatorTest.php294Drupal\tmgmt_file\Tests\FileTranslatorTest->testXLIFF()
Found the requested form fields at http://ec2-52-27-196-164.us-west-2.compute.amazonaws.com/checkout/admin/tmgmt/jobs/1OtherFileTranslatorTest.php294Drupal\tmgmt_file\Tests\FileTranslatorTest->testXLIFF()
Raw "The imported file job id 2 does not match the job id 1." foundOtherFileTranslatorTest.php298Drupal\tmgmt_file\Tests\FileTranslatorTest->testXLIFF()
Object of class Drupal\views\Entity\View could not be converted to stringRecoverable fatal errorSql.php1457Drupal\views\Plugin\views\query\Sql->execute()
Failed to set field files[file] to public://tmgmt_file/translated file.xlfOtherFileTranslatorTest.php308Drupal\tmgmt_file\Tests\FileTranslatorTest->testXLIFF()
Found the Import buttonOtherFileTranslatorTest.php308Drupal\tmgmt_file\Tests\FileTranslatorTest->testXLIFF()
Found the requested form fields at http://ec2-52-27-196-164.us-west-2.compute.amazonaws.com/checkout/admin/tmgmt/jobs/1OtherFileTranslatorTest.php308Drupal\tmgmt_file\Tests\FileTranslatorTest->testXLIFF()
Link review does not exist on http://ec2-52-27-196-164.us-west-2.compute.amazonaws.com/checkout/admin/tmgmt/jobs/1BrowserFileTranslatorTest.php309Drupal\tmgmt_file\Tests\FileTranslatorTest->testXLIFF()
Undefined offset: 0Drupal\simpletest\WebTestBase->drupalPostAjaxForm(NULL, NULL, Array) Drupal\tmgmt_file\Tests\FileTranslatorTest->testXLIFF() Drupal\simpletest\TestBase->run(Array) simpletest_script_run_one_test('19', 'Drupal\tmgmt_file\Tests\FileTranslatorTest') NoticeWebTestBase.php1826Drupal\simpletest\WebTestBase->drupalPostAjaxForm()
Undefined index: ajaxDrupal\simpletest\WebTestBase->drupalPostAjaxForm(NULL, NULL, Array) Drupal\tmgmt_file\Tests\FileTranslatorTest->testXLIFF() Drupal\simpletest\TestBase->run(Array) simpletest_script_run_one_test('19', 'Drupal\tmgmt_file\Tests\FileTranslatorTest') NoticeWebTestBase.php1827Drupal\simpletest\WebTestBase->drupalPostAjaxForm()
Exception: No #ajax path specified. in Drupal\simpletest\WebTestBase->drupalPostAjaxForm() (line 1863 of /var/lib/drupaltestbot/sites/default/files/checkout/core/modules/simpletest/src/WebTestBase.php). Drupal\simpletest\WebTestBase->drupalPostAjaxForm(NULL, NULL, Array) Drupal\tmgmt_file\Tests\FileTranslatorTest->testXLIFF() Drupal\simpletest\TestBase->run(Array) simpletest_script_run_one_test('19', 'Drupal\tmgmt_file\Tests\FileTranslatorTest') Uncaught exceptionWebTestBase.php1863Drupal\simpletest\WebTestBase->drupalPostAjaxForm()
LeafDrupal\tmgmt_locale\Tests\LocaleSourceTest6300
ExpandDrupal\tmgmt_locale\Tests\LocaleSourceUiTest39121
MessageGroupFilenameLineFunctionStatus
Object of class Drupal\views\Entity\View could not be converted to stringRecoverable fatal errorSql.php1457Drupal\views\Plugin\views\query\Sql->execute()
"Hello World" foundOtherLocaleSourceUiTest.php76Drupal\tmgmt_locale\Tests\LocaleSourceUiTest->testOverview()
"Locale" foundOtherLocaleSourceUiTest.php77Drupal\tmgmt_locale\Tests\LocaleSourceUiTest->testOverview()
"2" foundOtherLocaleSourceUiTest.php78Drupal\tmgmt_locale\Tests\LocaleSourceUiTest->testOverview()
Failed to set field target_language to gsw-berneOtherLocaleSourceUiTest.php79Drupal\tmgmt_locale\Tests\LocaleSourceUiTest->testOverview()
Found the Submit to translator buttonOtherLocaleSourceUiTest.php79Drupal\tmgmt_locale\Tests\LocaleSourceUiTest->testOverview()
Found the requested form fields at OtherLocaleSourceUiTest.php79Drupal\tmgmt_locale\Tests\LocaleSourceUiTest->testOverview()
Raw "Active job item: Needs review" foundOtherLocaleSourceUiTest.php83Drupal\tmgmt_locale\Tests\LocaleSourceUiTest->testOverview()
Raw "gsw-berne_Hello World" foundOtherLocaleSourceUiTest.php88Drupal\tmgmt_locale\Tests\LocaleSourceUiTest->testOverview()
Found the Save as completed buttonOtherLocaleSourceUiTest.php89Drupal\tmgmt_locale\Tests\LocaleSourceUiTest->testOverview()
Found the requested form fields at OtherLocaleSourceUiTest.php89Drupal\tmgmt_locale\Tests\LocaleSourceUiTest->testOverview()
Value 'Not translated' is equal to value 'Translation up to date'.OtherLocaleSourceUiTest.php97Drupal\tmgmt_locale\Tests\LocaleSourceUiTest->testOverview()
"Hello World" not foundOtherLocaleSourceUiTest.php113Drupal\tmgmt_locale\Tests\LocaleSourceUiTest->testOverview()