2502303-session-example-10.patch

Test status
StatusResult
Last receivedFri, 08/07/2015 - 04:35:08
Last requestedFri, 08/07/2015 - 04:36:01
Last testedFri, 08/07/2015 - 04:37:03
Test count1
Environment status
PHP 5.5 MySQLfail
File information
File2502303-session-example-10.patch
BranchExamples for Developers - 8.x-1.x
LinkIssue Link
SummaryFAILED: [[SimpleTest]]: [PHP 5.5 MySQL] 985 pass(es), 2 fail(s), and 1 exception(s).
Details

PHP 5.5 MySQL

  1. Setup environment
  2. Detect an invalid patch URL
  3. Detect invalid repository information
  4. Detect invalid patch format
  5. Detect a non-applicable patch
  6. Detect invalid PHP syntax
  7. Detect a Drupal installation failure
  8. Detect a test run failure
  9. Detect a failing test
    Review the test failures below then if necessary run them locally until the problem has been fixed.
  10. Complete test suite with all tests passing
985 pass(es), 2 fail(s), and 1 exception(s)

Non-pass

Test namePassFailException
ExpandDrupal\config_entity_example\Tests\ConfigEntityExampleTest011
MessageGroupFilenameLineFunctionStatus
The test did not complete due to a fatal error.Completion checkConfigEntityExampleTest.php61Drupal\config_entity_example\Tests\ConfigEntityExampleTest->testConfigEntityExample()
Drupal\Core\Config\Schema\SchemaIncompleteException: Schema errors for config_entity_example.robot.marvin with the following errors: config_entity_example.robot.marvin:langcode missing schema in Drupal\Core\Config\Testing\ConfigSchemaChecker->onConfigSave() (line 98 of /var/lib/drupaltestbot/sites/default/files/checkout/core/lib/Drupal/Core/Config/Testing/ConfigSchemaChecker.php). Drupal\Core\Config\Testing\ConfigSchemaChecker->onConfigSave(Object, 'config.save', Object) Drupal\Component\EventDispatcher\ContainerAwareEventDispatcher->dispatch('config.save', Object) Drupal\Core\Config\Config->save(1) Drupal\Core\Config\Entity\ConfigEntityStorage->doSave('marvin', Object) Drupal\Core\Entity\EntityStorageBase->save(Object) Drupal\Core\Config\Entity\ConfigEntityStorage->save(Object) Drupal\Core\Entity\Entity->save() Drupal\Core\Config\Entity\ConfigEntityBase->save() Drupal\Core\Config\ConfigInstaller->createConfiguration('', Array) Drupal\Core\Config\ConfigInstaller->installDefaultConfig('module', 'config_entity_example') Drupal\Core\ProxyClass\Config\ConfigInstaller->installDefaultConfig('module', 'config_entity_example') Drupal\Core\Extension\ModuleInstaller->install(Array, 1) Drupal\Core\ProxyClass\Extension\ModuleInstaller->install(Array, 1) Drupal\simpletest\WebTestBase->installModulesFromClassProperty(Object) Drupal\simpletest\WebTestBase->setUp() Drupal\simpletest\TestBase->run(Array) simpletest_script_run_one_test('14', 'Drupal\config_entity_example\Tests\ConfigEntityExampleTest') Uncaught exceptionConfigSchemaChecker.php98Drupal\Core\Config\Testing\ConfigSchemaChecker->onConfigSave()
ExpandDrupal\examples\Tests\ExamplesTest2010
MessageGroupFilenameLineFunctionStatus
Raw "<nav class="toolbar-lining clearfix" role="navigation" aria-label="Developer Examples">" foundOtherExamplesTest.php45Drupal\examples\Tests\ExamplesTest->testExamples()

All

Test namePassFailException
LeafDrupal\block_example\Tests\BlockExampleMenuTest800
LeafDrupal\block_example\Tests\BlockExampleTest2700
LeafDrupal\cache_example\Tests\CacheExampleTestCase5900
ExpandDrupal\config_entity_example\Tests\ConfigEntityExampleTest011
MessageGroupFilenameLineFunctionStatus
The test did not complete due to a fatal error.Completion checkConfigEntityExampleTest.php61Drupal\config_entity_example\Tests\ConfigEntityExampleTest->testConfigEntityExample()
Drupal\Core\Config\Schema\SchemaIncompleteException: Schema errors for config_entity_example.robot.marvin with the following errors: config_entity_example.robot.marvin:langcode missing schema in Drupal\Core\Config\Testing\ConfigSchemaChecker->onConfigSave() (line 98 of /var/lib/drupaltestbot/sites/default/files/checkout/core/lib/Drupal/Core/Config/Testing/ConfigSchemaChecker.php). Drupal\Core\Config\Testing\ConfigSchemaChecker->onConfigSave(Object, 'config.save', Object) Drupal\Component\EventDispatcher\ContainerAwareEventDispatcher->dispatch('config.save', Object) Drupal\Core\Config\Config->save(1) Drupal\Core\Config\Entity\ConfigEntityStorage->doSave('marvin', Object) Drupal\Core\Entity\EntityStorageBase->save(Object) Drupal\Core\Config\Entity\ConfigEntityStorage->save(Object) Drupal\Core\Entity\Entity->save() Drupal\Core\Config\Entity\ConfigEntityBase->save() Drupal\Core\Config\ConfigInstaller->createConfiguration('', Array) Drupal\Core\Config\ConfigInstaller->installDefaultConfig('module', 'config_entity_example') Drupal\Core\ProxyClass\Config\ConfigInstaller->installDefaultConfig('module', 'config_entity_example') Drupal\Core\Extension\ModuleInstaller->install(Array, 1) Drupal\Core\ProxyClass\Extension\ModuleInstaller->install(Array, 1) Drupal\simpletest\WebTestBase->installModulesFromClassProperty(Object) Drupal\simpletest\WebTestBase->setUp() Drupal\simpletest\TestBase->run(Array) simpletest_script_run_one_test('14', 'Drupal\config_entity_example\Tests\ConfigEntityExampleTest') Uncaught exceptionConfigSchemaChecker.php98Drupal\Core\Config\Testing\ConfigSchemaChecker->onConfigSave()
LeafDrupal\content_entity_example\Tests\ContentEntityExampleTest22500
LeafDrupal\dbtng_example\Tests\DBTNGExampleTest5900
LeafDrupal\email_example\Tests\EmailExampleTest2100
ExpandDrupal\examples\Tests\ExamplesTest2010
MessageGroupFilenameLineFunctionStatus
Raw "<nav class="toolbar-lining clearfix" role="navigation" aria-label="Developer Examples">" foundOtherExamplesTest.php45Drupal\examples\Tests\ExamplesTest->testExamples()
LeafDrupal\field_example\Tests\FieldExampleMenuTest800
ExpandDrupal\field_example\Tests\Text3WidgetTest11700
MessageGroupFilenameLineFunctionStatus
Saved settings for field <em class="placeholder">oznh9f1q4o</em> with widget <em class="placeholder">field_example_3text</em> and cardinality <em class="placeholder">1</em>DebugFieldExampleWebTestBase.php134Drupal\field_example\FieldExampleWebTestBase->createField()
Saved settings for field <em class="placeholder">pa72un0oe3</em> with widget <em class="placeholder">field_example_3text</em> and cardinality <em class="placeholder">-1</em>DebugFieldExampleWebTestBase.php134Drupal\field_example\FieldExampleWebTestBase->createField()
ExpandDrupal\field_example\Tests\TextWidgetTest11700
MessageGroupFilenameLineFunctionStatus
Saved settings for field <em class="placeholder">ghwkvxlbyx</em> with widget <em class="placeholder">field_example_text</em> and cardinality <em class="placeholder">1</em>DebugFieldExampleWebTestBase.php134Drupal\field_example\FieldExampleWebTestBase->createField()
Saved settings for field <em class="placeholder">zombhlz3on</em> with widget <em class="placeholder">field_example_text</em> and cardinality <em class="placeholder">-1</em>DebugFieldExampleWebTestBase.php134Drupal\field_example\FieldExampleWebTestBase->createField()
LeafDrupal\js_example\Tests\JsExampleTest1000
LeafDrupal\node_type_example\Tests\NodeTypeExampleTest4300
LeafDrupal\page_example\Tests\PageExampleTest9000
LeafDrupal\phpunit_example\Tests\PHPUnitExampleMenuTest800
LeafDrupal\session_example\Tests\SessionExampleTest3700
LeafDrupal\simpletest_example\Tests\SimpleTestExampleMockModuleTest1200
LeafDrupal\simpletest_example\Tests\SimpleTestExampleTest3500
LeafDrupal\tablesort_example\Tests\TableSortExampleTest2700
LeafDrupal\Tests\phpunit_example\Unit\AddClassTest2700
LeafDrupal\Tests\phpunit_example\Unit\DisplayManagerTest100
LeafDrupal\Tests\phpunit_example\Unit\ProtectedPrivatesTest400
LeafDrupal\tour_example\Tests\TourExampleTest3000