fix_database_backend-2545464-5.patch

Test status
StatusResult
Last receivedThu, 08/06/2015 - 21:06:04
Last requestedThu, 08/06/2015 - 21:07:01
Last testedThu, 08/06/2015 - 21:08:52
Test count1
Environment status
PHP 5.5 MySQLfail
File information
Filefix_database_backend-2545464-5.patch
BranchSearch API - 8.x-1.x
LinkIssue Link
SummaryFAILED: [[SimpleTest]]: [PHP 5.5 MySQL] 552 pass(es), 6 fail(s), and 6 exception(s).
Details

PHP 5.5 MySQL

  1. Setup environment
  2. Detect an invalid patch URL
  3. Detect invalid repository information
  4. Detect invalid patch format
  5. Detect a non-applicable patch
  6. Detect invalid PHP syntax
  7. Detect a Drupal installation failure
  8. Detect a test run failure
  9. Detect a failing test
    Review the test failures below then if necessary run them locally until the problem has been fixed.
  10. Complete test suite with all tests passing
552 pass(es), 6 fail(s), and 6 exception(s)

Non-pass

Test namePassFailException
ExpandDrupal\search_api\Tests\IntegrationTest011
MessageGroupFilenameLineFunctionStatus
The test did not complete due to a fatal error.Completion checkIntegrationTest.php39Drupal\search_api\Tests\IntegrationTest->testFramework()
Drupal\Core\Config\Schema\SchemaIncompleteException: Schema errors for search_api.settings with the following errors: search_api.settings:langcode missing schema in Drupal\Core\Config\Testing\ConfigSchemaChecker->onConfigSave() (line 98 of /var/lib/drupaltestbot/sites/default/files/checkout/core/lib/Drupal/Core/Config/Testing/ConfigSchemaChecker.php). Drupal\Core\Config\Testing\ConfigSchemaChecker->onConfigSave(Object, 'config.save', Object) Drupal\Component\EventDispatcher\ContainerAwareEventDispatcher->dispatch('config.save', Object) Drupal\Core\Config\Config->save(1) Drupal\Core\Config\ConfigInstaller->createConfiguration('', Array) Drupal\Core\Config\ConfigInstaller->installDefaultConfig('module', 'search_api') Drupal\Core\ProxyClass\Config\ConfigInstaller->installDefaultConfig('module', 'search_api') Drupal\Core\Extension\ModuleInstaller->install(Array, 1) Drupal\Core\ProxyClass\Extension\ModuleInstaller->install(Array, 1) Drupal\simpletest\WebTestBase->installModulesFromClassProperty(Object) Drupal\simpletest\WebTestBase->setUp() Drupal\search_api\Tests\WebTestBase->setUp() Drupal\simpletest\TestBase->run(Array) simpletest_script_run_one_test('12', 'Drupal\search_api\Tests\IntegrationTest') Uncaught exceptionConfigSchemaChecker.php98Drupal\Core\Config\Testing\ConfigSchemaChecker->onConfigSave()
ExpandDrupal\search_api\Tests\LocalActionsWebTest011
MessageGroupFilenameLineFunctionStatus
The test did not complete due to a fatal error.Completion checkLocalActionsWebTest.php47Drupal\search_api\Tests\LocalActionsWebTest->testLocalAction()
Drupal\Core\Config\Schema\SchemaIncompleteException: Schema errors for search_api.settings with the following errors: search_api.settings:langcode missing schema in Drupal\Core\Config\Testing\ConfigSchemaChecker->onConfigSave() (line 98 of /var/lib/drupaltestbot/sites/default/files/checkout/core/lib/Drupal/Core/Config/Testing/ConfigSchemaChecker.php). Drupal\Core\Config\Testing\ConfigSchemaChecker->onConfigSave(Object, 'config.save', Object) Drupal\Component\EventDispatcher\ContainerAwareEventDispatcher->dispatch('config.save', Object) Drupal\Core\Config\Config->save(1) Drupal\Core\Config\ConfigInstaller->createConfiguration('', Array) Drupal\Core\Config\ConfigInstaller->installDefaultConfig('module', 'search_api') Drupal\Core\ProxyClass\Config\ConfigInstaller->installDefaultConfig('module', 'search_api') Drupal\Core\Extension\ModuleInstaller->install(Array, 1) Drupal\Core\ProxyClass\Extension\ModuleInstaller->install(Array, 1) Drupal\simpletest\WebTestBase->installModulesFromClassProperty(Object) Drupal\simpletest\WebTestBase->setUp() Drupal\search_api\Tests\LocalActionsWebTest->setUp() Drupal\simpletest\TestBase->run(Array) simpletest_script_run_one_test('10', 'Drupal\search_api\Tests\LocalActionsWebTest') Uncaught exceptionConfigSchemaChecker.php98Drupal\Core\Config\Testing\ConfigSchemaChecker->onConfigSave()
ExpandDrupal\search_api\Tests\OverviewPageTest011
MessageGroupFilenameLineFunctionStatus
The test did not complete due to a fatal error.Completion checkOverviewPageTest.php42Drupal\search_api\Tests\OverviewPageTest->testServerAndIndexCreation()
Drupal\Core\Config\Schema\SchemaIncompleteException: Schema errors for search_api.settings with the following errors: search_api.settings:langcode missing schema in Drupal\Core\Config\Testing\ConfigSchemaChecker->onConfigSave() (line 98 of /var/lib/drupaltestbot/sites/default/files/checkout/core/lib/Drupal/Core/Config/Testing/ConfigSchemaChecker.php). Drupal\Core\Config\Testing\ConfigSchemaChecker->onConfigSave(Object, 'config.save', Object) Drupal\Component\EventDispatcher\ContainerAwareEventDispatcher->dispatch('config.save', Object) Drupal\Core\Config\Config->save(1) Drupal\Core\Config\ConfigInstaller->createConfiguration('', Array) Drupal\Core\Config\ConfigInstaller->installDefaultConfig('module', 'search_api') Drupal\Core\ProxyClass\Config\ConfigInstaller->installDefaultConfig('module', 'search_api') Drupal\Core\Extension\ModuleInstaller->install(Array, 1) Drupal\Core\ProxyClass\Extension\ModuleInstaller->install(Array, 1) Drupal\simpletest\WebTestBase->installModulesFromClassProperty(Object) Drupal\simpletest\WebTestBase->setUp() Drupal\search_api\Tests\WebTestBase->setUp() Drupal\search_api\Tests\OverviewPageTest->setUp() Drupal\simpletest\TestBase->run(Array) simpletest_script_run_one_test('9', 'Drupal\search_api\Tests\OverviewPageTest') Uncaught exceptionConfigSchemaChecker.php98Drupal\Core\Config\Testing\ConfigSchemaChecker->onConfigSave()
ExpandDrupal\search_api\Tests\Processor\ProcessorIntegrationTest011
MessageGroupFilenameLineFunctionStatus
The test did not complete due to a fatal error.Completion checkProcessorIntegrationTest.php51Drupal\search_api\Tests\Processor\ProcessorIntegrationTest->testProcessorIntegration()
Drupal\Core\Config\Schema\SchemaIncompleteException: Schema errors for search_api.settings with the following errors: search_api.settings:langcode missing schema in Drupal\Core\Config\Testing\ConfigSchemaChecker->onConfigSave() (line 98 of /var/lib/drupaltestbot/sites/default/files/checkout/core/lib/Drupal/Core/Config/Testing/ConfigSchemaChecker.php). Drupal\Core\Config\Testing\ConfigSchemaChecker->onConfigSave(Object, 'config.save', Object) Drupal\Component\EventDispatcher\ContainerAwareEventDispatcher->dispatch('config.save', Object) Drupal\Core\Config\Config->save(1) Drupal\Core\Config\ConfigInstaller->createConfiguration('', Array) Drupal\Core\Config\ConfigInstaller->installDefaultConfig('module', 'search_api') Drupal\Core\ProxyClass\Config\ConfigInstaller->installDefaultConfig('module', 'search_api') Drupal\Core\Extension\ModuleInstaller->install(Array, 1) Drupal\Core\ProxyClass\Extension\ModuleInstaller->install(Array, 1) Drupal\simpletest\WebTestBase->installModulesFromClassProperty(Object) Drupal\simpletest\WebTestBase->setUp() Drupal\search_api\Tests\WebTestBase->setUp() Drupal\search_api\Tests\Processor\ProcessorIntegrationTest->setUp() Drupal\simpletest\TestBase->run(Array) simpletest_script_run_one_test('4', 'Drupal\search_api\Tests\Processor\ProcessorIntegrationTest') Uncaught exceptionConfigSchemaChecker.php98Drupal\Core\Config\Testing\ConfigSchemaChecker->onConfigSave()
ExpandDrupal\search_api\Tests\ViewsTest011
MessageGroupFilenameLineFunctionStatus
The test did not complete due to a fatal error.Completion checkViewsTest.php45Drupal\search_api\Tests\ViewsTest->testFulltextSearch()
Drupal\Core\Config\Schema\SchemaIncompleteException: Schema errors for search_api.settings with the following errors: search_api.settings:langcode missing schema in Drupal\Core\Config\Testing\ConfigSchemaChecker->onConfigSave() (line 98 of /var/lib/drupaltestbot/sites/default/files/checkout/core/lib/Drupal/Core/Config/Testing/ConfigSchemaChecker.php). Drupal\Core\Config\Testing\ConfigSchemaChecker->onConfigSave(Object, 'config.save', Object) Drupal\Component\EventDispatcher\ContainerAwareEventDispatcher->dispatch('config.save', Object) Drupal\Core\Config\Config->save(1) Drupal\Core\Config\ConfigInstaller->createConfiguration('', Array) Drupal\Core\Config\ConfigInstaller->installDefaultConfig('module', 'search_api') Drupal\Core\ProxyClass\Config\ConfigInstaller->installDefaultConfig('module', 'search_api') Drupal\Core\Extension\ModuleInstaller->install(Array, 1) Drupal\Core\ProxyClass\Extension\ModuleInstaller->install(Array, 1) Drupal\simpletest\WebTestBase->installModulesFromClassProperty(Object) Drupal\simpletest\WebTestBase->setUp() Drupal\search_api\Tests\WebTestBase->setUp() Drupal\search_api\Tests\ViewsTest->setUp() Drupal\simpletest\TestBase->run(Array) simpletest_script_run_one_test('6', 'Drupal\search_api\Tests\ViewsTest') Uncaught exceptionConfigSchemaChecker.php98Drupal\Core\Config\Testing\ConfigSchemaChecker->onConfigSave()
ExpandDrupal\search_api_db_defaults\Tests\IntegrationTest411
MessageGroupFilenameLineFunctionStatus
The test did not complete due to a fatal error.Completion checkIntegrationTest.php176Drupal\search_api_db_defaults\Tests\IntegrationTest->testDefaultSetupWorking()
Drupal\Core\Config\Schema\SchemaIncompleteException: Schema errors for search_api.settings with the following errors: search_api.settings:langcode missing schema in Drupal\Core\Config\Testing\ConfigSchemaChecker->onConfigSave() (line 98 of /var/lib/drupaltestbot/sites/default/files/checkout/core/lib/Drupal/Core/Config/Testing/ConfigSchemaChecker.php). Drupal\Core\Config\Testing\ConfigSchemaChecker->onConfigSave(Object, 'config.save', Object) Drupal\Component\EventDispatcher\ContainerAwareEventDispatcher->dispatch('config.save', Object) Drupal\Core\Config\Config->save(1) Drupal\Core\Config\ConfigInstaller->createConfiguration('', Array) Drupal\Core\Config\ConfigInstaller->installDefaultConfig('module', 'search_api') Drupal\Core\ProxyClass\Config\ConfigInstaller->installDefaultConfig('module', 'search_api') Drupal\Core\Extension\ModuleInstaller->install(Array, 1) Drupal\Core\ProxyClass\Extension\ModuleInstaller->install(Array, 1) Drupal\search_api_db_defaults\Tests\IntegrationTest->setUp() Drupal\simpletest\TestBase->run(Array) simpletest_script_run_one_test('1', 'Drupal\search_api_db_defaults\Tests\IntegrationTest') Uncaught exceptionConfigSchemaChecker.php98Drupal\Core\Config\Testing\ConfigSchemaChecker->onConfigSave()

All

Test namePassFailException
LeafDrupal\search_api\Tests\CustomDataTypesUnitTest1800
LeafDrupal\search_api\Tests\IndexStorageUnitTest500
ExpandDrupal\search_api\Tests\IntegrationTest011
MessageGroupFilenameLineFunctionStatus
The test did not complete due to a fatal error.Completion checkIntegrationTest.php39Drupal\search_api\Tests\IntegrationTest->testFramework()
Drupal\Core\Config\Schema\SchemaIncompleteException: Schema errors for search_api.settings with the following errors: search_api.settings:langcode missing schema in Drupal\Core\Config\Testing\ConfigSchemaChecker->onConfigSave() (line 98 of /var/lib/drupaltestbot/sites/default/files/checkout/core/lib/Drupal/Core/Config/Testing/ConfigSchemaChecker.php). Drupal\Core\Config\Testing\ConfigSchemaChecker->onConfigSave(Object, 'config.save', Object) Drupal\Component\EventDispatcher\ContainerAwareEventDispatcher->dispatch('config.save', Object) Drupal\Core\Config\Config->save(1) Drupal\Core\Config\ConfigInstaller->createConfiguration('', Array) Drupal\Core\Config\ConfigInstaller->installDefaultConfig('module', 'search_api') Drupal\Core\ProxyClass\Config\ConfigInstaller->installDefaultConfig('module', 'search_api') Drupal\Core\Extension\ModuleInstaller->install(Array, 1) Drupal\Core\ProxyClass\Extension\ModuleInstaller->install(Array, 1) Drupal\simpletest\WebTestBase->installModulesFromClassProperty(Object) Drupal\simpletest\WebTestBase->setUp() Drupal\search_api\Tests\WebTestBase->setUp() Drupal\simpletest\TestBase->run(Array) simpletest_script_run_one_test('12', 'Drupal\search_api\Tests\IntegrationTest') Uncaught exceptionConfigSchemaChecker.php98Drupal\Core\Config\Testing\ConfigSchemaChecker->onConfigSave()
LeafDrupal\search_api\Tests\LanguageIntegrationUnitTest3500
ExpandDrupal\search_api\Tests\LocalActionsWebTest011
MessageGroupFilenameLineFunctionStatus
The test did not complete due to a fatal error.Completion checkLocalActionsWebTest.php47Drupal\search_api\Tests\LocalActionsWebTest->testLocalAction()
Drupal\Core\Config\Schema\SchemaIncompleteException: Schema errors for search_api.settings with the following errors: search_api.settings:langcode missing schema in Drupal\Core\Config\Testing\ConfigSchemaChecker->onConfigSave() (line 98 of /var/lib/drupaltestbot/sites/default/files/checkout/core/lib/Drupal/Core/Config/Testing/ConfigSchemaChecker.php). Drupal\Core\Config\Testing\ConfigSchemaChecker->onConfigSave(Object, 'config.save', Object) Drupal\Component\EventDispatcher\ContainerAwareEventDispatcher->dispatch('config.save', Object) Drupal\Core\Config\Config->save(1) Drupal\Core\Config\ConfigInstaller->createConfiguration('', Array) Drupal\Core\Config\ConfigInstaller->installDefaultConfig('module', 'search_api') Drupal\Core\ProxyClass\Config\ConfigInstaller->installDefaultConfig('module', 'search_api') Drupal\Core\Extension\ModuleInstaller->install(Array, 1) Drupal\Core\ProxyClass\Extension\ModuleInstaller->install(Array, 1) Drupal\simpletest\WebTestBase->installModulesFromClassProperty(Object) Drupal\simpletest\WebTestBase->setUp() Drupal\search_api\Tests\LocalActionsWebTest->setUp() Drupal\simpletest\TestBase->run(Array) simpletest_script_run_one_test('10', 'Drupal\search_api\Tests\LocalActionsWebTest') Uncaught exceptionConfigSchemaChecker.php98Drupal\Core\Config\Testing\ConfigSchemaChecker->onConfigSave()
ExpandDrupal\search_api\Tests\OverviewPageTest011
MessageGroupFilenameLineFunctionStatus
The test did not complete due to a fatal error.Completion checkOverviewPageTest.php42Drupal\search_api\Tests\OverviewPageTest->testServerAndIndexCreation()
Drupal\Core\Config\Schema\SchemaIncompleteException: Schema errors for search_api.settings with the following errors: search_api.settings:langcode missing schema in Drupal\Core\Config\Testing\ConfigSchemaChecker->onConfigSave() (line 98 of /var/lib/drupaltestbot/sites/default/files/checkout/core/lib/Drupal/Core/Config/Testing/ConfigSchemaChecker.php). Drupal\Core\Config\Testing\ConfigSchemaChecker->onConfigSave(Object, 'config.save', Object) Drupal\Component\EventDispatcher\ContainerAwareEventDispatcher->dispatch('config.save', Object) Drupal\Core\Config\Config->save(1) Drupal\Core\Config\ConfigInstaller->createConfiguration('', Array) Drupal\Core\Config\ConfigInstaller->installDefaultConfig('module', 'search_api') Drupal\Core\ProxyClass\Config\ConfigInstaller->installDefaultConfig('module', 'search_api') Drupal\Core\Extension\ModuleInstaller->install(Array, 1) Drupal\Core\ProxyClass\Extension\ModuleInstaller->install(Array, 1) Drupal\simpletest\WebTestBase->installModulesFromClassProperty(Object) Drupal\simpletest\WebTestBase->setUp() Drupal\search_api\Tests\WebTestBase->setUp() Drupal\search_api\Tests\OverviewPageTest->setUp() Drupal\simpletest\TestBase->run(Array) simpletest_script_run_one_test('9', 'Drupal\search_api\Tests\OverviewPageTest') Uncaught exceptionConfigSchemaChecker.php98Drupal\Core\Config\Testing\ConfigSchemaChecker->onConfigSave()
LeafDrupal\search_api\Tests\Processor\ContentAccessTest7200
ExpandDrupal\search_api\Tests\Processor\ProcessorIntegrationTest011
MessageGroupFilenameLineFunctionStatus
The test did not complete due to a fatal error.Completion checkProcessorIntegrationTest.php51Drupal\search_api\Tests\Processor\ProcessorIntegrationTest->testProcessorIntegration()
Drupal\Core\Config\Schema\SchemaIncompleteException: Schema errors for search_api.settings with the following errors: search_api.settings:langcode missing schema in Drupal\Core\Config\Testing\ConfigSchemaChecker->onConfigSave() (line 98 of /var/lib/drupaltestbot/sites/default/files/checkout/core/lib/Drupal/Core/Config/Testing/ConfigSchemaChecker.php). Drupal\Core\Config\Testing\ConfigSchemaChecker->onConfigSave(Object, 'config.save', Object) Drupal\Component\EventDispatcher\ContainerAwareEventDispatcher->dispatch('config.save', Object) Drupal\Core\Config\Config->save(1) Drupal\Core\Config\ConfigInstaller->createConfiguration('', Array) Drupal\Core\Config\ConfigInstaller->installDefaultConfig('module', 'search_api') Drupal\Core\ProxyClass\Config\ConfigInstaller->installDefaultConfig('module', 'search_api') Drupal\Core\Extension\ModuleInstaller->install(Array, 1) Drupal\Core\ProxyClass\Extension\ModuleInstaller->install(Array, 1) Drupal\simpletest\WebTestBase->installModulesFromClassProperty(Object) Drupal\simpletest\WebTestBase->setUp() Drupal\search_api\Tests\WebTestBase->setUp() Drupal\search_api\Tests\Processor\ProcessorIntegrationTest->setUp() Drupal\simpletest\TestBase->run(Array) simpletest_script_run_one_test('4', 'Drupal\search_api\Tests\Processor\ProcessorIntegrationTest') Uncaught exceptionConfigSchemaChecker.php98Drupal\Core\Config\Testing\ConfigSchemaChecker->onConfigSave()
LeafDrupal\search_api\Tests\Processor\RenderedItemTest4200
LeafDrupal\search_api\Tests\ServerStorageUnitTest600
LeafDrupal\search_api\Tests\ServerTaskUnitTest5900
ExpandDrupal\search_api\Tests\ViewsTest011
MessageGroupFilenameLineFunctionStatus
The test did not complete due to a fatal error.Completion checkViewsTest.php45Drupal\search_api\Tests\ViewsTest->testFulltextSearch()
Drupal\Core\Config\Schema\SchemaIncompleteException: Schema errors for search_api.settings with the following errors: search_api.settings:langcode missing schema in Drupal\Core\Config\Testing\ConfigSchemaChecker->onConfigSave() (line 98 of /var/lib/drupaltestbot/sites/default/files/checkout/core/lib/Drupal/Core/Config/Testing/ConfigSchemaChecker.php). Drupal\Core\Config\Testing\ConfigSchemaChecker->onConfigSave(Object, 'config.save', Object) Drupal\Component\EventDispatcher\ContainerAwareEventDispatcher->dispatch('config.save', Object) Drupal\Core\Config\Config->save(1) Drupal\Core\Config\ConfigInstaller->createConfiguration('', Array) Drupal\Core\Config\ConfigInstaller->installDefaultConfig('module', 'search_api') Drupal\Core\ProxyClass\Config\ConfigInstaller->installDefaultConfig('module', 'search_api') Drupal\Core\Extension\ModuleInstaller->install(Array, 1) Drupal\Core\ProxyClass\Extension\ModuleInstaller->install(Array, 1) Drupal\simpletest\WebTestBase->installModulesFromClassProperty(Object) Drupal\simpletest\WebTestBase->setUp() Drupal\search_api\Tests\WebTestBase->setUp() Drupal\search_api\Tests\ViewsTest->setUp() Drupal\simpletest\TestBase->run(Array) simpletest_script_run_one_test('6', 'Drupal\search_api\Tests\ViewsTest') Uncaught exceptionConfigSchemaChecker.php98Drupal\Core\Config\Testing\ConfigSchemaChecker->onConfigSave()
LeafDrupal\search_api_db\Tests\BackendTest16600
ExpandDrupal\search_api_db_defaults\Tests\IntegrationTest411
MessageGroupFilenameLineFunctionStatus
The test did not complete due to a fatal error.Completion checkIntegrationTest.php176Drupal\search_api_db_defaults\Tests\IntegrationTest->testDefaultSetupWorking()
Drupal\Core\Config\Schema\SchemaIncompleteException: Schema errors for search_api.settings with the following errors: search_api.settings:langcode missing schema in Drupal\Core\Config\Testing\ConfigSchemaChecker->onConfigSave() (line 98 of /var/lib/drupaltestbot/sites/default/files/checkout/core/lib/Drupal/Core/Config/Testing/ConfigSchemaChecker.php). Drupal\Core\Config\Testing\ConfigSchemaChecker->onConfigSave(Object, 'config.save', Object) Drupal\Component\EventDispatcher\ContainerAwareEventDispatcher->dispatch('config.save', Object) Drupal\Core\Config\Config->save(1) Drupal\Core\Config\ConfigInstaller->createConfiguration('', Array) Drupal\Core\Config\ConfigInstaller->installDefaultConfig('module', 'search_api') Drupal\Core\ProxyClass\Config\ConfigInstaller->installDefaultConfig('module', 'search_api') Drupal\Core\Extension\ModuleInstaller->install(Array, 1) Drupal\Core\ProxyClass\Extension\ModuleInstaller->install(Array, 1) Drupal\search_api_db_defaults\Tests\IntegrationTest->setUp() Drupal\simpletest\TestBase->run(Array) simpletest_script_run_one_test('1', 'Drupal\search_api_db_defaults\Tests\IntegrationTest') Uncaught exceptionConfigSchemaChecker.php98Drupal\Core\Config\Testing\ConfigSchemaChecker->onConfigSave()
LeafDrupal\Tests\search_api\Unit\Plugin\Processor\AddURLTest200
LeafDrupal\Tests\search_api\Unit\Plugin\Processor\AggregatedFieldTest900
LeafDrupal\Tests\search_api\Unit\Plugin\Processor\FieldsProcessorPluginBaseTest1300
LeafDrupal\Tests\search_api\Unit\Plugin\Processor\HighlightTest1300
LeafDrupal\Tests\search_api\Unit\Plugin\Processor\HtmlFilterTest2500
LeafDrupal\Tests\search_api\Unit\Plugin\Processor\IgnoreCaseTest400
LeafDrupal\Tests\search_api\Unit\Plugin\Processor\IgnoreCharacterTest3900
LeafDrupal\Tests\search_api\Unit\Plugin\Processor\LanguageTest200
LeafDrupal\Tests\search_api\Unit\Plugin\Processor\NodeStatusTest300
LeafDrupal\Tests\search_api\Unit\Plugin\Processor\RoleFilterTest200
LeafDrupal\Tests\search_api\Unit\Plugin\Processor\StopwordsTest800
LeafDrupal\Tests\search_api\Unit\Plugin\Processor\TokenizerTest2200
LeafDrupal\Tests\search_api\Unit\Plugin\Processor\TransliterationTest300